Build: #443 failed Changes by Eric Milles

Build result summary

Details

Completed
Duration
94 minutes
Labels
None
Agent
bamboo-16.af.pivotal.io
Revision
1780c16c2593ecdbf3d2cbcce3335e9b6f0a29e2 1780c16c2593ecdbf3d2cbcce3335e9b6f0a29e2
Total tests
6184
Failing since
#369 (Changes by Eric Milles)

Responsible

Code commits

Author Commit Message Commit date
Eric Milles Eric Milles 1780c16c2593ecdbf3d2cbcce3335e9b6f0a29e2 1780c16c2593ecdbf3d2cbcce3335e9b6f0a29e2 Fix for #959: check aliased annotations for attribute methods

Configuration changes

Plan configuration has changed since the last successful build. See the plan audit log for more details.

Tests

New test failures 4
Status Test View job Duration
Collapse Failed BasicGroovyBuildTests testSimpleTaskMarkerInSingleLineCommentEndOfClassCaseInsensitive History
Default Job < 1 sec
java.lang.AssertionError: missing expected problem: Problem : todonothing [ resource : </Project/src/p/A.groovy> range : <24,36> category : <-1> severity : <2>]
	at org.eclipse.jdt.core.groovy.tests.builder.BasicGroovyBuildTests.testSimpleTaskMarkerInSingleLineCommentEndOfClassCaseInsensitive(BasicGroovyBuildTests.java:2370)
Collapse Failed ArrayInferencingTests testArrayProperty9 History
Default Job < 1 sec
java.lang.AssertionError: Expected type not found.
Expected: XX[]
Found: java.lang.String
Declaring type: java.lang.String
ASTNode: org.codehaus.groovy.ast.expr.ConstantExpression@fd2ef[xx]
Confidence: UNKNOWN

java.lang.AssertionError: 
(8 more lines...)
Collapse Failed ConstructorReferenceSearchTests testNewifyConstructorReferences2 History
Default Job < 1 sec
java.lang.AssertionError: expected:<2> but was:<0>
	at org.eclipse.jdt.core.groovy.tests.search.ConstructorReferenceSearchTests.testNewifyConstructorReferences2(ConstructorReferenceSearchTests.java:408)
Collapse Failed DGMInferencingTests testDGM29 History
Default Job < 1 sec
java.lang.AssertionError: Expected type not found.
Expected: java.io.FileOutputStream
Found: java.lang.Object
Declaring type: groovy.lang.Closure<V extends java.lang.Object>
ASTNode: org.codehaus.groovy.ast.expr.VariableExpression@f170b[variable: it]
Confidence: INFERRED

java.lang.AssertionError: 
(9 more lines...)
Fixed tests 1
Status Test Failing since View job Duration
Successful BasicGroovyBuildTests testUpdateProjectPreferences History
Failing since build #376 (Changes by Eric Milles) Default Job < 1 sec