Build: #97 failed Changes by Eric Milles

Build result summary

Details

Completed
Duration
102 minutes
Labels
None
Agent
bamboo-12.af.pivotal.io
Revision
fb508c1db6ceecc78a372b5630f2aecb647ad005 fb508c1db6ceecc78a372b5630f2aecb647ad005
Total tests
5424
Failing since
#95 (Changes by Eric Milles)
Fixed in
#103 (Changes by Eric Milles)

Responsible

Code commits

Author Commit Message Commit date
Eric Milles Eric Milles fb508c1db6ceecc78a372b5630f2aecb647ad005 fb508c1db6ceecc78a372b5630f2aecb647ad005 Fix for #612: add quick fix resolver/proposal for override final method
Eric Milles Eric Milles dd387f1e1c0ddd032e7d216c70236ab825d99970 dd387f1e1c0ddd032e7d216c70236ab825d99970 Prep for #612: errors on method declarations should cover parameter list

Tests

New test failures 2
Status Test View job Duration
Collapse Failed BasicGroovyBuildTests testProjectBasedirAsOutputLocation History
Default Job < 1 sec
org.junit.ComparisonFailure: unexpected recompiled units. lenExpected=1 lenActual=2 expected:<{p.Script[]}> but was:<{p.Script[,p.Script]}>
	at org.eclipse.jdt.core.groovy.tests.builder.BasicGroovyBuildTests.testProjectBasedirAsOutputLocation(BasicGroovyBuildTests.java:303)
Collapse Failed DGMInferencingTests testDGM42 History
Default Job < 1 sec
java.lang.AssertionError: Expected type not found.
Expected: java.lang.String
Found: java.lang.Object
Declaring type: groovy.lang.Closure<V extends java.lang.Object>
ASTNode: org.codehaus.groovy.ast.expr.VariableExpression@fc7a9[variable: it]
Confidence: INFERRED

java.lang.AssertionError: 
(9 more lines...)
Existing test failures 1
Status Test Failing since View job Duration
java.lang.AssertionError: Should have found 2 matches, but found: Match at: (105, 11), accuracy: ACCURATE
 Matched object: void xxx() [in Second [in Second.groovy [in <default> [in src [in Project]]]]]
Match at: (138, 11), accuracy: ACCURATE
 Matched object: void xxx() [in Second [in Second.groovy [in <default> [in src [in Project]]]]]
Match at: (168, 11), accuracy: INACCURATE
 Matched object: void xxx() [in Second [in Second.groovy [in <default> [in src [in Project]]]]]
 expected:<2> but was:<3>
java.lang.AssertionError: 
(8 more lines...)
Fixed tests 3
Status Test Failing since View job Duration
Successful BuildAccessRulesTests testAccessForFieldGenerics History
Failing since build #96 (Changes by Eric Milles) Default Job < 1 sec
Successful BuildAccessRulesTests testAccessForField History
Failing since build #96 (Changes by Eric Milles) Default Job < 1 sec
Successful BuildAccessRulesTests testAccessForImplements History
Failing since build #96 (Changes by Eric Milles) Default Job < 1 sec