Build: #261 failed

Job: Default Job failed

Stages & jobs

  1. Default Stage

Job result summary

Completed
Duration
106 minutes
Agent
bamboo-20.af.pivotal.io
Revision
8bbefb7014e4e5788b584f75049da74526ce3016 8bbefb7014e4e5788b584f75049da74526ce3016
Total tests
5731
Failing since
#253 (Code changes detected – )
Fixed in
#270 (Code changes detected)

Tests

  • 5,731 tests in total
  • 7 tests failed
  • 4 failures are new
  • 7 tests were fixed
  • 102 tests were quarantined / skipped
  • 100 minutes taken in total.
New test failures 4
Status Test Duration
Collapse Failed DGMInferencingTests testDGM15 History
< 1 sec
java.lang.AssertionError: Expected type not found.
Expected: java.util.Map$Entry<java.lang.String,java.lang.Integer>
Found: java.lang.Object
Declaring type: groovy.lang.Closure<V extends java.lang.Object>
ASTNode: org.codehaus.groovy.ast.expr.VariableExpression@f4ba7[variable: it]
Confidence: INFERRED

java.lang.AssertionError: 
(9 more lines...)
Collapse Failed Groovy20InferencingTests testCompileStatic13 History
< 1 sec
java.lang.AssertionError: Expected type not found.
Expected: java.lang.Number
Found: java.lang.String
Declaring type: X
ASTNode: org.codehaus.groovy.ast.expr.ConstantExpression@11125f[readOnly]
Confidence: UNKNOWN

java.lang.AssertionError: 
(8 more lines...)
Collapse Failed OperatorOverloadingInferencingTests testLongExpr2 History
< 1 sec
java.lang.AssertionError: Expected type not found.
Expected: Foo
Found: java.util.List<Foo>
Declaring type: Search
ASTNode: org.codehaus.groovy.ast.expr.VariableExpression@1061bc[variable: xxx]
Confidence: INFERRED

java.lang.AssertionError: 
(8 more lines...)
Collapse Failed StaticInferencingTests testClassReference14 History
< 1 sec
java.lang.NoClassDefFoundError: org/codehaus/groovy/runtime/DefaultGroovyMethodsSupport
	at org.eclipse.jdt.core.groovy.tests.search.StaticInferencingTests.assertKnown(StaticInferencingTests.java:35)
	at org.eclipse.jdt.core.groovy.tests.search.StaticInferencingTests.testClassReference14(StaticInferencingTests.java:139)
Caused by: java.lang.ClassNotFoundException: org.codehaus.groovy.runtime.DefaultGroovyMethodsSupport
	at org.eclipse.jdt.core.groovy.tests.search.StaticInferencingTests.assertKnown(StaticInferencingTests.java:35)
	at org.eclipse.jdt.core.groovy.tests.search.StaticInferencingTests.testClassReference14(StaticInferencingTests.java:139)
Existing test failures 3
Status Test Failing since Duration
org.junit.ComparisonFailure: unexpected recompiled units. lenExpected=3 lenActual=4 expected:<...st.Class1,test.Class[]2,test.Class3}> but was:<...st.Class1,test.Class[1,test.Class]2,test.Class3}>
	at org.eclipse.jdt.core.groovy.tests.builder.BasicGroovyBuildTests.testGRE1773(BasicGroovyBuildTests.java:3422)
org.junit.runners.model.TestTimedOutException: test timed out after 1500 milliseconds
	at org.eclipse.jdt.groovy.core.tests.basic.EnumerationTests.testEnum4438(EnumerationTests.java:316)
org.junit.runners.model.TestTimedOutException: test timed out after 1500 milliseconds
	at org.eclipse.jdt.groovy.core.tests.basic.EnumerationTests.testEnum4438(EnumerationTests.java:316)
Fixed tests 7
Status Test Failing since Duration
Successful ClosureInferencingTests testClosure16 History
Failing since build #260 (Code changes detected) < 1 sec
Successful ClosureInferencingTests testNestedClosure6 History
Failing since build #260 (Code changes detected) < 1 sec
Successful ClosureInferencingTests testNestedClosure7 History
Failing since build #260 (Code changes detected) < 1 sec
Successful DGMInferencingTests testDGMClosure3 History
Failing since build #260 (Code changes detected) < 1 sec
Successful InferencingTests testAnonInner1 History
Failing since build #260 (Code changes detected) < 1 sec
Successful InferencingTests testLocalVar14 History
Failing since build #260 (Code changes detected) 1 sec
Successful OperatorOverloadingInferencingTests testNumberPlusString1 History
Failing since build #260 (Code changes detected) < 1 sec

Error summary

The build generated some errors. See the full build log for more details.


(SWT:13806): Gtk-WARNING **: 16:29:21.058: gtk_widget_size_allocate(): attempt to allocate widget with width -3 and height -3

(SWT:13806): Gtk-CRITICAL **: 16:29:23.601: gtk_box_gadget_distribute: assertion 'size >= 0' failed in GtkScrollbar
TypeInferencingVisitorWithRequestor.findMethodNode: no match found for Foo(QMap.Entry;, Qjava.lang.Object;)
TypeInferencingVisitorWithRequestor.findMethodNode: no match found for Foo(QMap.Entry;)
TypeInferencingVisitorWithRequestor.findMethodNode: no match found for Foo(QDictionary;)
TypeInferencingVisitorWithRequestor.findMethodNode: no match found for TestUnit232444.y(QOuter.Inner;)
TypeInferencingVisitorWithRequestor.findMethodNode: no match found for TestUnit232444.y(QOuter.Inner;)
TypeInferencingVisitorWithRequestor.findMethodNode: no match found for TestUnit946988.y(QOuter.Inner;)
TypeInferencingVisitorWithRequestor.findMethodNode: no match found for TestUnit946988.y(QOuter.Inner;)
TypeInferencingVisitorWithRequestor.findMethodNode: no match found for Main.main([Qjava.lang.String;)
TypeInferencingVisitorWithRequestor.findMethodNode: no match found for Main.main([Qjava.lang.String;)
CodeSelectRequestor: Could not proceed due to null declaring type for org.codehaus.groovy.ast.expr.BinaryExpression@ecbea[org.codehaus.groovy.ast.expr.VariableExpression@ecbe3[variable: it]("in" at 1:20:  "in" )org.codehaus.groovy.ast.expr.ListExpression@ee270[]]
CodeSelectRequestor: Could not proceed due to null declaring type for org.codehaus.groovy.ast.expr.RangeExpression@ebcdd
CodeSelectRequestor: Could not proceed due to null declaring type for org.codehaus.groovy.ast.expr.RangeExpression@ebcde
TypeInferencingVisitorWithRequestor.findMethodNode: no match found for Type.x(QList<Qjava.util.Date;>;)
TypeInferencingVisitorWithRequestor.findMethodNode: no match found for Type.x(QList<Qjava.lang.Number;>;)
TypeInferencingVisitorWithRequestor.findMethodNode: no match found for Type.x(QList<Qjava.lang.Number;>;)
TypeInferencingVisitorWithRequestor.findMethodNode: no match found for Type.x(QList<Qjava.util.Date;>;)
TypeInferencingVisitorWithRequestor.findMethodNode: no match found for Type.x(QList<Qjava.lang.Number;>;)
CodeSelectRequestor: Could not proceed due to null declaring type for org.codehaus.groovy.ast.expr.ConstantExpression@e8fc6[fff]
CodeSelectRequestor: Could not proceed due to null declaring type for org.codehaus.groovy.ast.expr.ConstantExpression@e8fca[fff]
CodeSelectRequestor: Could not proceed due to null declaring type for org.codehaus.groovy.ast.expr.ConstantExpression@e8fca[fff]
Waiting for: Java indexing... 18 files to index (/opt/jdk8u212-b03/jre/lib/rt.jar)
Waiting for: Java indexing... 22 files to index (/Project)
Waiting for: Java indexing... 22 files to index (/Project)
Waiting for: Java indexing... 22 files to index (/Project)
Waiting for: Java indexing... 22 files to index (/Project)
Waiting for: Java indexing... 22 files to index (/Project)
Waiting for: Java indexing... 22 files to index (/Project)
Waiting for: Java indexing... 21 files to index (/Project)
Waiting for: Java indexing... 21 files to index (/Project)
Waiting for: Java indexing... 21 files to index (/Project)
Waiting for: Java indexing... 15 files to index (/opt/jdk8u212-b03/jre/lib/ext/sunjce_provider.jar)