Build: #261 failed

Job: Default Job failed

Stages & jobs

  1. Default Stage

Build log

The build generated 47,272 lines of output.The output is too long and has been truncated to the last 1,000 lines. Download or view full build log

28-May-2019 18:11:39 testMap15(org.eclipse.jdt.core.groovy.tests.search.GenericInferencingTests)  Time elapsed: 0.248 s
28-May-2019 18:11:39 testMap16(org.eclipse.jdt.core.groovy.tests.search.GenericInferencingTests)  Time elapsed: 0.179 s
28-May-2019 18:11:39 testMap1(org.eclipse.jdt.core.groovy.tests.search.GenericInferencingTests)  Time elapsed: 0.324 s
28-May-2019 18:11:39 testMap2(org.eclipse.jdt.core.groovy.tests.search.GenericInferencingTests)  Time elapsed: 0.177 s
28-May-2019 18:11:39 testMap3(org.eclipse.jdt.core.groovy.tests.search.GenericInferencingTests)  Time elapsed: 0.178 s
28-May-2019 18:11:39 testMap4(org.eclipse.jdt.core.groovy.tests.search.GenericInferencingTests)  Time elapsed: 0.17 s
28-May-2019 18:11:39 testMap5(org.eclipse.jdt.core.groovy.tests.search.GenericInferencingTests)  Time elapsed: 0.165 s
28-May-2019 18:11:39 testMap6(org.eclipse.jdt.core.groovy.tests.search.GenericInferencingTests)  Time elapsed: 0.291 s
28-May-2019 18:11:39 testMap7(org.eclipse.jdt.core.groovy.tests.search.GenericInferencingTests)  Time elapsed: 0.258 s
28-May-2019 18:11:39 testMap8(org.eclipse.jdt.core.groovy.tests.search.GenericInferencingTests)  Time elapsed: 0.256 s
28-May-2019 18:11:39 testMap9(org.eclipse.jdt.core.groovy.tests.search.GenericInferencingTests)  Time elapsed: 0.297 s
28-May-2019 18:11:39 testSet1(org.eclipse.jdt.core.groovy.tests.search.GenericInferencingTests)  Time elapsed: 0.249 s
28-May-2019 18:11:39 testSet2(org.eclipse.jdt.core.groovy.tests.search.GenericInferencingTests)  Time elapsed: 0.291 s
28-May-2019 18:11:39 testSet3(org.eclipse.jdt.core.groovy.tests.search.GenericInferencingTests)  Time elapsed: 0.253 s
28-May-2019 18:11:39 testSet4(org.eclipse.jdt.core.groovy.tests.search.GenericInferencingTests)  Time elapsed: 0.264 s
28-May-2019 18:11:39 testSet5(org.eclipse.jdt.core.groovy.tests.search.GenericInferencingTests)  Time elapsed: 0.265 s
28-May-2019 18:11:39 testSet6(org.eclipse.jdt.core.groovy.tests.search.GenericInferencingTests)  Time elapsed: 0.166 s
28-May-2019 18:11:39 testSet7(org.eclipse.jdt.core.groovy.tests.search.GenericInferencingTests)  Time elapsed: 0.26 s
28-May-2019 18:11:39 testSet8(org.eclipse.jdt.core.groovy.tests.search.GenericInferencingTests)  Time elapsed: 0.195 s
28-May-2019 18:11:39 testStaticMethod1(org.eclipse.jdt.core.groovy.tests.search.GenericInferencingTests)  Time elapsed: 0.194 s
28-May-2019 18:11:39 testStaticMethod2(org.eclipse.jdt.core.groovy.tests.search.GenericInferencingTests)  Time elapsed: 0.275 s
28-May-2019 18:11:39 testStaticMethod3(org.eclipse.jdt.core.groovy.tests.search.GenericInferencingTests)  Time elapsed: 0.264 s
28-May-2019 18:11:39 testStaticMethod4(org.eclipse.jdt.core.groovy.tests.search.GenericInferencingTests)  Time elapsed: 0.164 s
28-May-2019 18:11:39 testStaticMethod5(org.eclipse.jdt.core.groovy.tests.search.GenericInferencingTests)  Time elapsed: 0.283 s
28-May-2019 18:11:39 testStaticMethod6(org.eclipse.jdt.core.groovy.tests.search.GenericInferencingTests)  Time elapsed: 0.257 s
28-May-2019 18:11:39 testStaticMethod7(org.eclipse.jdt.core.groovy.tests.search.GenericInferencingTests)  Time elapsed: 0.572 s
28-May-2019 18:11:39 testStaticMethod8(org.eclipse.jdt.core.groovy.tests.search.GenericInferencingTests) skipped
28-May-2019 18:11:39 testStaticMethod9(org.eclipse.jdt.core.groovy.tests.search.GenericInferencingTests)  Time elapsed: 0.251 s
28-May-2019 18:11:39 testArrayDGM(org.eclipse.jdt.core.groovy.tests.search.GenericInferencingTests)  Time elapsed: 0.594 s
28-May-2019 18:11:39 testListOfMap1(org.eclipse.jdt.core.groovy.tests.search.GenericInferencingTests)  Time elapsed: 0.264 s
28-May-2019 18:11:39 testListOfMap3(org.eclipse.jdt.core.groovy.tests.search.GenericInferencingTests)  Time elapsed: 0.186 s
28-May-2019 18:11:39 testStaticMethodOverloads10(org.eclipse.jdt.core.groovy.tests.search.GenericInferencingTests)  Time elapsed: 0.289 s
28-May-2019 18:11:39 testStaticMethodOverloads11(org.eclipse.jdt.core.groovy.tests.search.GenericInferencingTests)  Time elapsed: 0.468 s
28-May-2019 18:11:39 testStaticMethodOverloads1(org.eclipse.jdt.core.groovy.tests.search.GenericInferencingTests)  Time elapsed: 0.291 s
28-May-2019 18:11:39 testStaticMethodOverloads2(org.eclipse.jdt.core.groovy.tests.search.GenericInferencingTests)  Time elapsed: 0.26 s
28-May-2019 18:11:39 testStaticMethodOverloads3(org.eclipse.jdt.core.groovy.tests.search.GenericInferencingTests)  Time elapsed: 0.269 s
28-May-2019 18:11:39 testStaticMethodOverloads4(org.eclipse.jdt.core.groovy.tests.search.GenericInferencingTests)  Time elapsed: 0.415 s
28-May-2019 18:11:39 testStaticMethodOverloads5(org.eclipse.jdt.core.groovy.tests.search.GenericInferencingTests)  Time elapsed: 0.261 s
28-May-2019 18:11:39 testStaticMethodOverloads6(org.eclipse.jdt.core.groovy.tests.search.GenericInferencingTests)  Time elapsed: 0.192 s
28-May-2019 18:11:39 testStaticMethodOverloads7(org.eclipse.jdt.core.groovy.tests.search.GenericInferencingTests)  Time elapsed: 0.267 s
28-May-2019 18:11:39 testStaticMethodOverloads8(org.eclipse.jdt.core.groovy.tests.search.GenericInferencingTests)  Time elapsed: 0.258 s
28-May-2019 18:11:39 testStaticMethodOverloads9(org.eclipse.jdt.core.groovy.tests.search.GenericInferencingTests)  Time elapsed: 0.175 s
28-May-2019 18:11:39 testNestedGenerics1(org.eclipse.jdt.core.groovy.tests.search.GenericInferencingTests)  Time elapsed: 0.264 s
28-May-2019 18:11:39 testNestedGenerics2(org.eclipse.jdt.core.groovy.tests.search.GenericInferencingTests)  Time elapsed: 0.27 s
28-May-2019 18:11:39 testNestedGenerics3(org.eclipse.jdt.core.groovy.tests.search.GenericInferencingTests)  Time elapsed: 0.294 s
28-May-2019 18:11:39 testNestedGenerics4(org.eclipse.jdt.core.groovy.tests.search.GenericInferencingTests)  Time elapsed: 0.272 s
28-May-2019 18:11:39 testNestedGenerics5(org.eclipse.jdt.core.groovy.tests.search.GenericInferencingTests)  Time elapsed: 0.338 s
28-May-2019 18:11:39 testNestedGenerics6(org.eclipse.jdt.core.groovy.tests.search.GenericInferencingTests)  Time elapsed: 0.269 s
28-May-2019 18:11:39 testNestedGenerics7(org.eclipse.jdt.core.groovy.tests.search.GenericInferencingTests)  Time elapsed: 0.303 s
28-May-2019 18:11:39 testNestedGenerics8(org.eclipse.jdt.core.groovy.tests.search.GenericInferencingTests)  Time elapsed: 0.273 s
28-May-2019 18:11:39 testStaticMethod10(org.eclipse.jdt.core.groovy.tests.search.GenericInferencingTests)  Time elapsed: 0.489 s
28-May-2019 18:11:39 testStaticMethod11(org.eclipse.jdt.core.groovy.tests.search.GenericInferencingTests)  Time elapsed: 0.474 s
28-May-2019 18:11:39 testMethod1(org.eclipse.jdt.core.groovy.tests.search.GenericInferencingTests)  Time elapsed: 0.298 s
28-May-2019 18:11:39 testMethod2(org.eclipse.jdt.core.groovy.tests.search.GenericInferencingTests)  Time elapsed: 0.258 s
28-May-2019 18:11:39 testMethod3(org.eclipse.jdt.core.groovy.tests.search.GenericInferencingTests)  Time elapsed: 0.286 s
28-May-2019 18:11:39 testMethod4(org.eclipse.jdt.core.groovy.tests.search.GenericInferencingTests)  Time elapsed: 0.267 s
28-May-2019 18:11:39 testGetClass1(org.eclipse.jdt.core.groovy.tests.search.GenericInferencingTests)  Time elapsed: 0.259 s
28-May-2019 18:11:39 testGetClass2(org.eclipse.jdt.core.groovy.tests.search.GenericInferencingTests)  Time elapsed: 0.288 s
28-May-2019 18:11:39 testGetClass3(org.eclipse.jdt.core.groovy.tests.search.GenericInferencingTests)  Time elapsed: 0.25 s
28-May-2019 18:11:39 testCircularReference(org.eclipse.jdt.core.groovy.tests.search.GenericInferencingTests)  Time elapsed: 0.276 s
28-May-2019 18:11:39 testForLoop1(org.eclipse.jdt.core.groovy.tests.search.GenericInferencingTests)  Time elapsed: 0.249 s
28-May-2019 18:11:39 testForLoop2(org.eclipse.jdt.core.groovy.tests.search.GenericInferencingTests)  Time elapsed: 0.259 s
28-May-2019 18:11:39 testForLoop3(org.eclipse.jdt.core.groovy.tests.search.GenericInferencingTests)  Time elapsed: 0.252 s
28-May-2019 18:11:39 testForLoop4(org.eclipse.jdt.core.groovy.tests.search.GenericInferencingTests)  Time elapsed: 0.28 s
28-May-2019 18:11:39 testForLoop5(org.eclipse.jdt.core.groovy.tests.search.GenericInferencingTests)  Time elapsed: 0.282 s
28-May-2019 18:11:39 testForLoop6(org.eclipse.jdt.core.groovy.tests.search.GenericInferencingTests)  Time elapsed: 0.262 s
28-May-2019 18:11:39 testForLoop7(org.eclipse.jdt.core.groovy.tests.search.GenericInferencingTests)  Time elapsed: 0.251 s
28-May-2019 18:11:39 testForLoop8(org.eclipse.jdt.core.groovy.tests.search.GenericInferencingTests)  Time elapsed: 0.309 s
28-May-2019 18:11:39 testForLoop9(org.eclipse.jdt.core.groovy.tests.search.GenericInferencingTests)  Time elapsed: 0.191 s
28-May-2019 18:11:39 testMapOfMaps(org.eclipse.jdt.core.groovy.tests.search.GenericInferencingTests)  Time elapsed: 0.261 s
28-May-2019 18:11:39 testList10(org.eclipse.jdt.core.groovy.tests.search.GenericInferencingTests)  Time elapsed: 0.25 s
28-May-2019 18:11:39 testList11(org.eclipse.jdt.core.groovy.tests.search.GenericInferencingTests)  Time elapsed: 0.256 s
28-May-2019 18:11:39 testList12(org.eclipse.jdt.core.groovy.tests.search.GenericInferencingTests)  Time elapsed: 0.254 s
28-May-2019 18:11:39 testList13(org.eclipse.jdt.core.groovy.tests.search.GenericInferencingTests)  Time elapsed: 0.276 s
28-May-2019 18:11:39 testForLoop11(org.eclipse.jdt.core.groovy.tests.search.GenericInferencingTests)  Time elapsed: 0.268 s
28-May-2019 18:11:39 testForLoop2a(org.eclipse.jdt.core.groovy.tests.search.GenericInferencingTests)  Time elapsed: 0.252 s
28-May-2019 18:11:39 testRange1(org.eclipse.jdt.core.groovy.tests.search.GenericInferencingTests)  Time elapsed: 0.249 s
28-May-2019 18:11:39 testRange2(org.eclipse.jdt.core.groovy.tests.search.GenericInferencingTests)  Time elapsed: 0.258 s
28-May-2019 18:11:39 testClosure1(org.eclipse.jdt.core.groovy.tests.search.GenericInferencingTests)  Time elapsed: 0.159 s
28-May-2019 18:11:39 testClosure2(org.eclipse.jdt.core.groovy.tests.search.GenericInferencingTests)  Time elapsed: 0.258 s
28-May-2019 18:11:39 testClosure3(org.eclipse.jdt.core.groovy.tests.search.GenericInferencingTests)  Time elapsed: 0.279 s
28-May-2019 18:11:39 testClosure4(org.eclipse.jdt.core.groovy.tests.search.GenericInferencingTests)  Time elapsed: 0.178 s
28-May-2019 18:11:39 testMapOfList1(org.eclipse.jdt.core.groovy.tests.search.GenericInferencingTests)  Time elapsed: 0.267 s
28-May-2019 18:11:39 testMapOfList2(org.eclipse.jdt.core.groovy.tests.search.GenericInferencingTests)  Time elapsed: 0.279 s
28-May-2019 18:11:39 testMapOfList3(org.eclipse.jdt.core.groovy.tests.search.GenericInferencingTests)  Time elapsed: 0.329 s
28-May-2019 18:11:39 testMapOfList4(org.eclipse.jdt.core.groovy.tests.search.GenericInferencingTests)  Time elapsed: 0.28 s
28-May-2019 18:11:39 testMapOfList5(org.eclipse.jdt.core.groovy.tests.search.GenericInferencingTests)  Time elapsed: 0.249 s
28-May-2019 18:11:39 testMapOfList6(org.eclipse.jdt.core.groovy.tests.search.GenericInferencingTests)  Time elapsed: 0.261 s
28-May-2019 18:11:39 testMapOfList7(org.eclipse.jdt.core.groovy.tests.search.GenericInferencingTests)  Time elapsed: 0.292 s
28-May-2019 18:11:39 testGenericsMapper(org.eclipse.jdt.core.groovy.tests.search.GenericsMappingTests)  Time elapsed: 0.138 s
28-May-2019 18:11:39 testCompileStatic10(org.eclipse.jdt.core.groovy.tests.search.Groovy20InferencingTests)  Time elapsed: 0.208 s
28-May-2019 18:11:39 testCompileStatic11(org.eclipse.jdt.core.groovy.tests.search.Groovy20InferencingTests)  Time elapsed: 0.495 s
28-May-2019 18:11:39 testCompileStatic12(org.eclipse.jdt.core.groovy.tests.search.Groovy20InferencingTests)  Time elapsed: 0.316 s
28-May-2019 18:11:39 testCompileStatic13(org.eclipse.jdt.core.groovy.tests.search.Groovy20InferencingTests)  Time elapsed: 0.188 s  <<< FAILURE!
28-May-2019 18:11:39 java.lang.AssertionError:
28-May-2019 18:11:39 Expected type not found.
28-May-2019 18:11:39 Expected: java.lang.Number
28-May-2019 18:11:39 Found: java.lang.String
28-May-2019 18:11:39 Declaring type: X
28-May-2019 18:11:39 ASTNode: org.codehaus.groovy.ast.expr.ConstantExpression@11125f[readOnly]
28-May-2019 18:11:39 Confidence: UNKNOWN
28-May-2019 18:11:39
28-May-2019 18:11:39         at org.eclipse.jdt.core.groovy.tests.search.Groovy20InferencingTests.testCompileStatic13(Groovy20InferencingTests.java:193)
28-May-2019 18:11:39
28-May-2019 18:11:39 testCompileStatic14(org.eclipse.jdt.core.groovy.tests.search.Groovy20InferencingTests)  Time elapsed: 0.532 s
28-May-2019 18:11:39 testCompileStatic15(org.eclipse.jdt.core.groovy.tests.search.Groovy20InferencingTests)  Time elapsed: 0.418 s
28-May-2019 18:11:39 testCompileStatic16(org.eclipse.jdt.core.groovy.tests.search.Groovy20InferencingTests)  Time elapsed: 0.47 s
28-May-2019 18:11:39 testCompileStatic1(org.eclipse.jdt.core.groovy.tests.search.Groovy20InferencingTests)  Time elapsed: 0.255 s
28-May-2019 18:11:39 testCompileStatic2(org.eclipse.jdt.core.groovy.tests.search.Groovy20InferencingTests)  Time elapsed: 0.262 s
28-May-2019 18:11:39 testCompileStatic3(org.eclipse.jdt.core.groovy.tests.search.Groovy20InferencingTests)  Time elapsed: 0.255 s
28-May-2019 18:11:39 testCompileStatic4(org.eclipse.jdt.core.groovy.tests.search.Groovy20InferencingTests)  Time elapsed: 0.289 s
28-May-2019 18:11:39 testCompileStatic5(org.eclipse.jdt.core.groovy.tests.search.Groovy20InferencingTests)  Time elapsed: 0.271 s
28-May-2019 18:11:39 testCompileStatic6(org.eclipse.jdt.core.groovy.tests.search.Groovy20InferencingTests)  Time elapsed: 0.267 s
28-May-2019 18:11:39 testCompileStatic7(org.eclipse.jdt.core.groovy.tests.search.Groovy20InferencingTests)  Time elapsed: 0.163 s
28-May-2019 18:11:39 testCompileStatic8(org.eclipse.jdt.core.groovy.tests.search.Groovy20InferencingTests)  Time elapsed: 0.257 s
28-May-2019 18:11:39 testCompileStatic9(org.eclipse.jdt.core.groovy.tests.search.Groovy20InferencingTests)  Time elapsed: 0.196 s
28-May-2019 18:11:39 testTypeChecked1(org.eclipse.jdt.core.groovy.tests.search.Groovy20InferencingTests)  Time elapsed: 0.261 s
28-May-2019 18:11:39 testTypeChecked2(org.eclipse.jdt.core.groovy.tests.search.Groovy20InferencingTests)  Time elapsed: 0.167 s
28-May-2019 18:11:39 testTypeChecked3(org.eclipse.jdt.core.groovy.tests.search.Groovy20InferencingTests)  Time elapsed: 0.264 s
28-May-2019 18:11:39 testTypeChecked4(org.eclipse.jdt.core.groovy.tests.search.Groovy20InferencingTests)  Time elapsed: 0.154 s
28-May-2019 18:11:39 testTypeChecked5(org.eclipse.jdt.core.groovy.tests.search.Groovy20InferencingTests)  Time elapsed: 0.164 s
28-May-2019 18:11:39 testTypeChecked6(org.eclipse.jdt.core.groovy.tests.search.Groovy20InferencingTests)  Time elapsed: 0.181 s
28-May-2019 18:11:39 testTypeChecked7(org.eclipse.jdt.core.groovy.tests.search.Groovy20InferencingTests)  Time elapsed: 0.168 s
28-May-2019 18:11:39 testTypeChecked8(org.eclipse.jdt.core.groovy.tests.search.Groovy20InferencingTests)  Time elapsed: 0.265 s
28-May-2019 18:11:39 testDelegatesToResolveStrategy2(org.eclipse.jdt.core.groovy.tests.search.Groovy21InferencingTests)  Time elapsed: 0.284 s
28-May-2019 18:11:39 testDelegatesToResolveStrategy3(org.eclipse.jdt.core.groovy.tests.search.Groovy21InferencingTests)  Time elapsed: 0.288 s
28-May-2019 18:11:39 testDelegatesToResolveStrategy4(org.eclipse.jdt.core.groovy.tests.search.Groovy21InferencingTests)  Time elapsed: 0.426 s
28-May-2019 18:11:39 testDelegatesToTarget2a(org.eclipse.jdt.core.groovy.tests.search.Groovy21InferencingTests)  Time elapsed: 0.399 s
28-May-2019 18:11:39 testTypeCheckingExtension(org.eclipse.jdt.core.groovy.tests.search.Groovy21InferencingTests)  Time elapsed: 1.081 s
28-May-2019 18:11:39 testDelegatesToTarget1(org.eclipse.jdt.core.groovy.tests.search.Groovy21InferencingTests)  Time elapsed: 0.533 s
28-May-2019 18:11:39 testDelegatesToTarget2(org.eclipse.jdt.core.groovy.tests.search.Groovy21InferencingTests)  Time elapsed: 0.505 s
28-May-2019 18:11:39 testDelegatesToTarget3(org.eclipse.jdt.core.groovy.tests.search.Groovy21InferencingTests)  Time elapsed: 0.311 s
28-May-2019 18:11:39 testDelegatesToTarget4(org.eclipse.jdt.core.groovy.tests.search.Groovy21InferencingTests)  Time elapsed: 0.66 s
28-May-2019 18:11:39 testDelegatesToTarget5(org.eclipse.jdt.core.groovy.tests.search.Groovy21InferencingTests)  Time elapsed: 0.309 s
28-May-2019 18:11:39 testDelegatesToTarget6(org.eclipse.jdt.core.groovy.tests.search.Groovy21InferencingTests)  Time elapsed: 0.394 s
28-May-2019 18:11:39 testDelegatesToValue2(org.eclipse.jdt.core.groovy.tests.search.Groovy21InferencingTests)  Time elapsed: 0.252 s
28-May-2019 18:11:39 testDelegatesToValue3(org.eclipse.jdt.core.groovy.tests.search.Groovy21InferencingTests)  Time elapsed: 0.279 s
28-May-2019 18:11:39 testDelegatesToValue4(org.eclipse.jdt.core.groovy.tests.search.Groovy21InferencingTests)  Time elapsed: 0.255 s
28-May-2019 18:11:39 testDelegatesToValue5(org.eclipse.jdt.core.groovy.tests.search.Groovy21InferencingTests)  Time elapsed: 0.259 s
28-May-2019 18:11:39 testDelegatesToValue6(org.eclipse.jdt.core.groovy.tests.search.Groovy21InferencingTests)  Time elapsed: 0.267 s
28-May-2019 18:11:39 testDelegatesToTypeName1(org.eclipse.jdt.core.groovy.tests.search.Groovy21InferencingTests)  Time elapsed: 0.254 s
28-May-2019 18:11:39 testDelegatesToTypeName2(org.eclipse.jdt.core.groovy.tests.search.Groovy21InferencingTests)  Time elapsed: 0.176 s
28-May-2019 18:11:39 testDelegatesToValue(org.eclipse.jdt.core.groovy.tests.search.Groovy21InferencingTests)  Time elapsed: 0.254 s
28-May-2019 18:11:39 testEnumOverrides(org.eclipse.jdt.core.groovy.tests.search.Groovy21InferencingTests)  Time elapsed: 0.255 s
28-May-2019 18:11:39 testEnumOverrides2(org.eclipse.jdt.core.groovy.tests.search.Groovy21InferencingTests)  Time elapsed: 0.272 s
28-May-2019 18:11:39 org.eclipse.jdt.core.groovy.tests.search.Groovy25InferencingTests skipped
28-May-2019 18:11:39 testFieldAndPropertyWithSameName(org.eclipse.jdt.core.groovy.tests.search.InferencingTests)  Time elapsed: 0.289 s
28-May-2019 18:11:39 testObjectMethodOnInterface(org.eclipse.jdt.core.groovy.tests.search.InferencingTests)  Time elapsed: 0.252 s
28-May-2019 18:11:39 testLocalWithInitializer1(org.eclipse.jdt.core.groovy.tests.search.InferencingTests)  Time elapsed: 0.26 s
28-May-2019 18:11:39 testLocalWithInitializer2(org.eclipse.jdt.core.groovy.tests.search.InferencingTests)  Time elapsed: 0.252 s
28-May-2019 18:11:39 testLocalWithInitializer3(org.eclipse.jdt.core.groovy.tests.search.InferencingTests)  Time elapsed: 0.249 s
28-May-2019 18:11:39 testLocalWithInitializer4(org.eclipse.jdt.core.groovy.tests.search.InferencingTests)  Time elapsed: 0.168 s
28-May-2019 18:11:39 testLocalWithInitializer5(org.eclipse.jdt.core.groovy.tests.search.InferencingTests)  Time elapsed: 0.248 s
28-May-2019 18:11:39 testNothingIsUnknown(org.eclipse.jdt.core.groovy.tests.search.InferencingTests)  Time elapsed: 0.278 s
28-May-2019 18:11:39 testInnerClass1(org.eclipse.jdt.core.groovy.tests.search.InferencingTests)  Time elapsed: 0.264 s
28-May-2019 18:11:39 testInnerClass2(org.eclipse.jdt.core.groovy.tests.search.InferencingTests)  Time elapsed: 0.262 s
28-May-2019 18:11:39 testInnerClass3(org.eclipse.jdt.core.groovy.tests.search.InferencingTests)  Time elapsed: 0.152 s
28-May-2019 18:11:39 testInnerClass4(org.eclipse.jdt.core.groovy.tests.search.InferencingTests)  Time elapsed: 0.248 s
28-May-2019 18:11:39 testInnerClass5(org.eclipse.jdt.core.groovy.tests.search.InferencingTests)  Time elapsed: 0.153 s
28-May-2019 18:11:39 testInnerClass6(org.eclipse.jdt.core.groovy.tests.search.InferencingTests)  Time elapsed: 0.228 s
28-May-2019 18:11:39 testInnerClass7(org.eclipse.jdt.core.groovy.tests.search.InferencingTests)  Time elapsed: 0.865 s
28-May-2019 18:11:39 testInnerClass8(org.eclipse.jdt.core.groovy.tests.search.InferencingTests)  Time elapsed: 0.572 s
28-May-2019 18:11:39 testInnerClass9(org.eclipse.jdt.core.groovy.tests.search.InferencingTests)  Time elapsed: 0.387 s
28-May-2019 18:11:39 testMethodOverloadsArgumentMatching1(org.eclipse.jdt.core.groovy.tests.search.InferencingTests)  Time elapsed: 0.547 s
28-May-2019 18:11:39 testMethodOverloadsArgumentMatching2(org.eclipse.jdt.core.groovy.tests.search.InferencingTests)  Time elapsed: 0.371 s
28-May-2019 18:11:39 testMethodOverloadsArgumentMatching3(org.eclipse.jdt.core.groovy.tests.search.InferencingTests)  Time elapsed: 0.299 s
28-May-2019 18:11:39 testMethodOverloadsArgumentMatching4(org.eclipse.jdt.core.groovy.tests.search.InferencingTests)  Time elapsed: 0.387 s
28-May-2019 18:11:39 testMethodOverloadsArgumentMatching5(org.eclipse.jdt.core.groovy.tests.search.InferencingTests)  Time elapsed: 0.364 s
28-May-2019 18:11:39 testMethodOverloadsArgumentMatching6(org.eclipse.jdt.core.groovy.tests.search.InferencingTests)  Time elapsed: 0.388 s
28-May-2019 18:11:39 testMethodOverloadsArgumentMatching7(org.eclipse.jdt.core.groovy.tests.search.InferencingTests)  Time elapsed: 0.388 s
28-May-2019 18:11:39 testBoolean1(org.eclipse.jdt.core.groovy.tests.search.InferencingTests)  Time elapsed: 0.186 s
28-May-2019 18:11:39 testBoolean2(org.eclipse.jdt.core.groovy.tests.search.InferencingTests)  Time elapsed: 0.271 s
28-May-2019 18:11:39 testBoolean3(org.eclipse.jdt.core.groovy.tests.search.InferencingTests)  Time elapsed: 0.262 s
28-May-2019 18:11:39 testBoolean4(org.eclipse.jdt.core.groovy.tests.search.InferencingTests)  Time elapsed: 0.261 s
28-May-2019 18:11:39 testBoolean5(org.eclipse.jdt.core.groovy.tests.search.InferencingTests)  Time elapsed: 0.256 s
28-May-2019 18:11:39 testBoolean6(org.eclipse.jdt.core.groovy.tests.search.InferencingTests)  Time elapsed: 0.26 s
28-May-2019 18:11:39 testBoolean7(org.eclipse.jdt.core.groovy.tests.search.InferencingTests)  Time elapsed: 0.28 s
28-May-2019 18:11:39 testDeclarationAtBeginningOfMethod(org.eclipse.jdt.core.groovy.tests.search.InferencingTests)  Time elapsed: 0.255 s
28-May-2019 18:11:39 testLocalTypeAndDefaultImportCollision(org.eclipse.jdt.core.groovy.tests.search.InferencingTests)  Time elapsed: 0.456 s
28-May-2019 18:11:39 testTernaryInitializer(org.eclipse.jdt.core.groovy.tests.search.InferencingTests)  Time elapsed: 0.262 s
28-May-2019 18:11:39 testSuperFieldReference3a(org.eclipse.jdt.core.groovy.tests.search.InferencingTests)  Time elapsed: 0.174 s
28-May-2019 18:11:39 testSuperFieldReference3b(org.eclipse.jdt.core.groovy.tests.search.InferencingTests)  Time elapsed: 0.277 s
28-May-2019 18:11:39 testSuperFieldReference3c(org.eclipse.jdt.core.groovy.tests.search.InferencingTests)  Time elapsed: 0.259 s
28-May-2019 18:11:39 testSpecialConstructor1(org.eclipse.jdt.core.groovy.tests.search.InferencingTests)  Time elapsed: 0.229 s
28-May-2019 18:11:39 testSpecialConstructor2(org.eclipse.jdt.core.groovy.tests.search.InferencingTests)  Time elapsed: 0.247 s
28-May-2019 18:11:39 testInnerClass10(org.eclipse.jdt.core.groovy.tests.search.InferencingTests)  Time elapsed: 0.366 s
28-May-2019 18:11:39 testInnerClass11(org.eclipse.jdt.core.groovy.tests.search.InferencingTests)  Time elapsed: 0.39 s
28-May-2019 18:11:39 testMultiDecl10(org.eclipse.jdt.core.groovy.tests.search.InferencingTests)  Time elapsed: 0.276 s
28-May-2019 18:11:39 testMultiDecl11(org.eclipse.jdt.core.groovy.tests.search.InferencingTests)  Time elapsed: 0.372 s
28-May-2019 18:11:39 testMultiDecl12(org.eclipse.jdt.core.groovy.tests.search.InferencingTests)  Time elapsed: 0.374 s
28-May-2019 18:11:39 testMultiDecl13(org.eclipse.jdt.core.groovy.tests.search.InferencingTests)  Time elapsed: 0.498 s
28-May-2019 18:11:39 testConstantFromSuper(org.eclipse.jdt.core.groovy.tests.search.InferencingTests)  Time elapsed: 0.26 s
28-May-2019 18:11:39 testAsExpression1(org.eclipse.jdt.core.groovy.tests.search.InferencingTests)  Time elapsed: 0.253 s
28-May-2019 18:11:39 testAsExpression2(org.eclipse.jdt.core.groovy.tests.search.InferencingTests)  Time elapsed: 0.26 s
28-May-2019 18:11:39 testSuperClassMethod1(org.eclipse.jdt.core.groovy.tests.search.InferencingTests)  Time elapsed: 0.262 s
28-May-2019 18:11:39 testSuperClassMethod2(org.eclipse.jdt.core.groovy.tests.search.InferencingTests)  Time elapsed: 0.258 s
28-May-2019 18:11:39 testSuperClassMethod3(org.eclipse.jdt.core.groovy.tests.search.InferencingTests)  Time elapsed: 0.287 s
28-May-2019 18:11:39 testSuperClassMethod4(org.eclipse.jdt.core.groovy.tests.search.InferencingTests)  Time elapsed: 0.26 s
28-May-2019 18:11:39 testSuperClassMethod5(org.eclipse.jdt.core.groovy.tests.search.InferencingTests)  Time elapsed: 0.367 s
28-May-2019 18:11:39 testElvisInitializer(org.eclipse.jdt.core.groovy.tests.search.InferencingTests)  Time elapsed: 0.261 s
28-May-2019 18:11:39 testRangeExpression1(org.eclipse.jdt.core.groovy.tests.search.InferencingTests)  Time elapsed: 0.252 s
28-May-2019 18:11:39 testRangeExpression2(org.eclipse.jdt.core.groovy.tests.search.InferencingTests)  Time elapsed: 1.159 s
28-May-2019 18:11:39 testRangeExpression3(org.eclipse.jdt.core.groovy.tests.search.InferencingTests)  Time elapsed: 0.162 s
28-May-2019 18:11:39 testRangeExpression4(org.eclipse.jdt.core.groovy.tests.search.InferencingTests)  Time elapsed: 0.162 s
28-May-2019 18:11:39 testRangeExpression5(org.eclipse.jdt.core.groovy.tests.search.InferencingTests)  Time elapsed: 0.249 s
28-May-2019 18:11:39 testRangeExpression6(org.eclipse.jdt.core.groovy.tests.search.InferencingTests)  Time elapsed: 0.256 s
28-May-2019 18:11:39 testSpread10(org.eclipse.jdt.core.groovy.tests.search.InferencingTests)  Time elapsed: 0.154 s
28-May-2019 18:11:39 testSpread11(org.eclipse.jdt.core.groovy.tests.search.InferencingTests)  Time elapsed: 0.194 s
28-May-2019 18:11:39 testSpread12(org.eclipse.jdt.core.groovy.tests.search.InferencingTests)  Time elapsed: 0.277 s
28-May-2019 18:11:39 testSpread13(org.eclipse.jdt.core.groovy.tests.search.InferencingTests)  Time elapsed: 0.371 s
28-May-2019 18:11:39 testSpread14(org.eclipse.jdt.core.groovy.tests.search.InferencingTests)  Time elapsed: 0.252 s
28-May-2019 18:11:39 testSpread15(org.eclipse.jdt.core.groovy.tests.search.InferencingTests)  Time elapsed: 0.272 s
28-May-2019 18:11:39 testSpread16(org.eclipse.jdt.core.groovy.tests.search.InferencingTests)  Time elapsed: 0.192 s
28-May-2019 18:11:39 testSpread17(org.eclipse.jdt.core.groovy.tests.search.InferencingTests)  Time elapsed: 0.169 s
28-May-2019 18:11:39 testStaticThisAndSuper1(org.eclipse.jdt.core.groovy.tests.search.InferencingTests)  Time elapsed: 0.37 s
28-May-2019 18:11:39 testStaticThisAndSuper2(org.eclipse.jdt.core.groovy.tests.search.InferencingTests)  Time elapsed: 0.361 s
28-May-2019 18:11:39 testMethodOverloadsArgumentMatching4a(org.eclipse.jdt.core.groovy.tests.search.InferencingTests)  Time elapsed: 0.428 s
28-May-2019 18:11:39 testMethodOverloadsArgumentMatching4b(org.eclipse.jdt.core.groovy.tests.search.InferencingTests)  Time elapsed: 0.253 s
28-May-2019 18:11:39 testMethodOverloadsArgumentMatching5a(org.eclipse.jdt.core.groovy.tests.search.InferencingTests)  Time elapsed: 0.359 s
28-May-2019 18:11:39 testMethodOverloadsArgumentMatching5b(org.eclipse.jdt.core.groovy.tests.search.InferencingTests)  Time elapsed: 0.356 s
28-May-2019 18:11:39 testMethodOverloadsArgumentMatching6a(org.eclipse.jdt.core.groovy.tests.search.InferencingTests)  Time elapsed: 1.725 s
28-May-2019 18:11:39 testMethodOverloadsArgumentMatching6b(org.eclipse.jdt.core.groovy.tests.search.InferencingTests)  Time elapsed: 0.394 s
28-May-2019 18:11:39 testConstructor1(org.eclipse.jdt.core.groovy.tests.search.InferencingTests)  Time elapsed: 0.963 s
28-May-2019 18:11:39 testConstructor2(org.eclipse.jdt.core.groovy.tests.search.InferencingTests)  Time elapsed: 1.788 s
28-May-2019 18:11:39 testConstructor3(org.eclipse.jdt.core.groovy.tests.search.InferencingTests)  Time elapsed: 0.478 s
28-May-2019 18:11:39 testConstructor4(org.eclipse.jdt.core.groovy.tests.search.InferencingTests)  Time elapsed: 1.649 s
28-May-2019 18:11:39 testConstructor5(org.eclipse.jdt.core.groovy.tests.search.InferencingTests)  Time elapsed: 0.514 s
28-May-2019 18:11:39 testConstructor6(org.eclipse.jdt.core.groovy.tests.search.InferencingTests)  Time elapsed: 0.692 s
28-May-2019 18:11:39 testInterfaceMethodsAsProperty(org.eclipse.jdt.core.groovy.tests.search.InferencingTests)  Time elapsed: 1.472 s
28-May-2019 18:11:39 testStaticMethod1(org.eclipse.jdt.core.groovy.tests.search.InferencingTests)  Time elapsed: 0.287 s
28-May-2019 18:11:39 testStaticMethod2(org.eclipse.jdt.core.groovy.tests.search.InferencingTests)  Time elapsed: 0.256 s
28-May-2019 18:11:39 testStaticMethod3(org.eclipse.jdt.core.groovy.tests.search.InferencingTests)  Time elapsed: 0.196 s
28-May-2019 18:11:39 testStaticMethod4(org.eclipse.jdt.core.groovy.tests.search.InferencingTests)  Time elapsed: 0.246 s
28-May-2019 18:11:39 testStaticMethod5(org.eclipse.jdt.core.groovy.tests.search.InferencingTests)  Time elapsed: 0.198 s
28-May-2019 18:11:39 testStaticMethod6(org.eclipse.jdt.core.groovy.tests.search.InferencingTests)  Time elapsed: 1.091 s
28-May-2019 18:11:39 testStaticMethod7(org.eclipse.jdt.core.groovy.tests.search.InferencingTests)  Time elapsed: 0.337 s
28-May-2019 18:11:39 testStaticMethod8(org.eclipse.jdt.core.groovy.tests.search.InferencingTests)  Time elapsed: 0.273 s
28-May-2019 18:11:39 testStaticMethod9(org.eclipse.jdt.core.groovy.tests.search.InferencingTests)  Time elapsed: 0.267 s
28-May-2019 18:11:39 testPostfix(org.eclipse.jdt.core.groovy.tests.search.InferencingTests)  Time elapsed: 0.252 s
28-May-2019 18:11:39 testSuperClassMethod4a(org.eclipse.jdt.core.groovy.tests.search.InferencingTests)  Time elapsed: 1.448 s
28-May-2019 18:11:39 testSuperClassMethod4b(org.eclipse.jdt.core.groovy.tests.search.InferencingTests)  Time elapsed: 0.243 s
28-May-2019 18:11:39 testSuperClassMethod4c(org.eclipse.jdt.core.groovy.tests.search.InferencingTests)  Time elapsed: 0.248 s
28-May-2019 18:11:39 testSuperClassMethod5a(org.eclipse.jdt.core.groovy.tests.search.InferencingTests)  Time elapsed: 0.484 s
28-May-2019 18:11:39 testSuperClassMethod5b(org.eclipse.jdt.core.groovy.tests.search.InferencingTests)  Time elapsed: 1.65 s
28-May-2019 18:11:39 testListSort1(org.eclipse.jdt.core.groovy.tests.search.InferencingTests)  Time elapsed: 0.355 s
28-May-2019 18:11:39 testListSort2(org.eclipse.jdt.core.groovy.tests.search.InferencingTests)  Time elapsed: 0.498 s
28-May-2019 18:11:39 testListSort3(org.eclipse.jdt.core.groovy.tests.search.InferencingTests)  Time elapsed: 0.303 s
28-May-2019 18:11:39 testLocalVar1(org.eclipse.jdt.core.groovy.tests.search.InferencingTests)  Time elapsed: 1.202 s
28-May-2019 18:11:39 testLocalVar2(org.eclipse.jdt.core.groovy.tests.search.InferencingTests)  Time elapsed: 0.254 s
28-May-2019 18:11:39 testLocalVar3(org.eclipse.jdt.core.groovy.tests.search.InferencingTests)  Time elapsed: 0.258 s
28-May-2019 18:11:39 testLocalVar4(org.eclipse.jdt.core.groovy.tests.search.InferencingTests)  Time elapsed: 0.255 s
28-May-2019 18:11:39 testLocalVar5(org.eclipse.jdt.core.groovy.tests.search.InferencingTests)  Time elapsed: 0.275 s
28-May-2019 18:11:39 testLocalVar6(org.eclipse.jdt.core.groovy.tests.search.InferencingTests)  Time elapsed: 1.141 s
28-May-2019 18:11:39 testLocalVar7(org.eclipse.jdt.core.groovy.tests.search.InferencingTests)  Time elapsed: 0.263 s
28-May-2019 18:11:39 testLocalVar8(org.eclipse.jdt.core.groovy.tests.search.InferencingTests)  Time elapsed: 0.263 s
28-May-2019 18:11:39 testLocalVar9(org.eclipse.jdt.core.groovy.tests.search.InferencingTests)  Time elapsed: 0.254 s
28-May-2019 18:11:39 testIndirectInterfaceMethod(org.eclipse.jdt.core.groovy.tests.search.InferencingTests)  Time elapsed: 1.976 s
28-May-2019 18:11:39 testMapLiteral(org.eclipse.jdt.core.groovy.tests.search.InferencingTests)  Time elapsed: 0.263 s
28-May-2019 18:11:39 testListRemove(org.eclipse.jdt.core.groovy.tests.search.InferencingTests)  Time elapsed: 0.381 s
28-May-2019 18:11:39 testCategoryMethodAsProperty(org.eclipse.jdt.core.groovy.tests.search.InferencingTests)  Time elapsed: 0.165 s
28-May-2019 18:11:39 testNothingIsUnknownWithCategories(org.eclipse.jdt.core.groovy.tests.search.InferencingTests)  Time elapsed: 1.622 s
28-May-2019 18:11:39 testImplicitVar1(org.eclipse.jdt.core.groovy.tests.search.InferencingTests)  Time elapsed: 0.256 s
28-May-2019 18:11:39 testImplicitVar2(org.eclipse.jdt.core.groovy.tests.search.InferencingTests)  Time elapsed: 0.262 s
28-May-2019 18:11:39 testImplicitVar3(org.eclipse.jdt.core.groovy.tests.search.InferencingTests)  Time elapsed: 0.259 s
28-May-2019 18:11:39 testImplicitVar4(org.eclipse.jdt.core.groovy.tests.search.InferencingTests)  Time elapsed: 0.264 s
28-May-2019 18:11:39 testImplicitVar5(org.eclipse.jdt.core.groovy.tests.search.InferencingTests)  Time elapsed: 1.802 s
28-May-2019 18:11:39 testImplicitVar6(org.eclipse.jdt.core.groovy.tests.search.InferencingTests)  Time elapsed: 0.263 s
28-May-2019 18:11:39 testImplicitVar7(org.eclipse.jdt.core.groovy.tests.search.InferencingTests)  Time elapsed: 0.264 s
28-May-2019 18:11:39 testClassLiteral1(org.eclipse.jdt.core.groovy.tests.search.InferencingTests)  Time elapsed: 0.263 s
28-May-2019 18:11:39 testClassLiteral2(org.eclipse.jdt.core.groovy.tests.search.InferencingTests)  Time elapsed: 0.258 s
28-May-2019 18:11:39 testClassLiteral3(org.eclipse.jdt.core.groovy.tests.search.InferencingTests)  Time elapsed: 1.398 s
28-May-2019 18:11:39 testClassLiteral4(org.eclipse.jdt.core.groovy.tests.search.InferencingTests)  Time elapsed: 0.258 s
28-May-2019 18:11:39 testClassLiteral5(org.eclipse.jdt.core.groovy.tests.search.InferencingTests)  Time elapsed: 0.263 s
28-May-2019 18:11:39 testScriptDeclaringType(org.eclipse.jdt.core.groovy.tests.search.InferencingTests)  Time elapsed: 0.265 s
28-May-2019 18:11:39 testInstanceOf10(org.eclipse.jdt.core.groovy.tests.search.InferencingTests)  Time elapsed: 2.051 s
28-May-2019 18:11:39 testInstanceOf11(org.eclipse.jdt.core.groovy.tests.search.InferencingTests)  Time elapsed: 0.75 s
28-May-2019 18:11:39 testInstanceOf1a(org.eclipse.jdt.core.groovy.tests.search.InferencingTests)  Time elapsed: 2.241 s
28-May-2019 18:11:39 testInstanceOf1b(org.eclipse.jdt.core.groovy.tests.search.InferencingTests)  Time elapsed: 0.716 s
28-May-2019 18:11:39 testThisInInnerClass(org.eclipse.jdt.core.groovy.tests.search.InferencingTests)  Time elapsed: 1.645 s
28-May-2019 18:11:39 testStaticImports1(org.eclipse.jdt.core.groovy.tests.search.InferencingTests)  Time elapsed: 0.288 s
28-May-2019 18:11:39 testStaticImports2(org.eclipse.jdt.core.groovy.tests.search.InferencingTests)  Time elapsed: 0.308 s
28-May-2019 18:11:39 testStaticImports3(org.eclipse.jdt.core.groovy.tests.search.InferencingTests)  Time elapsed: 0.302 s
28-May-2019 18:11:39 testStaticImports4(org.eclipse.jdt.core.groovy.tests.search.InferencingTests)  Time elapsed: 1.758 s
28-May-2019 18:11:39 testMultiDecl1(org.eclipse.jdt.core.groovy.tests.search.InferencingTests)  Time elapsed: 0.38 s
28-May-2019 18:11:39 testMultiDecl2(org.eclipse.jdt.core.groovy.tests.search.InferencingTests)  Time elapsed: 0.363 s
28-May-2019 18:11:39 testMultiDecl3(org.eclipse.jdt.core.groovy.tests.search.InferencingTests)  Time elapsed: 1.396 s
28-May-2019 18:11:39 testMultiDecl4(org.eclipse.jdt.core.groovy.tests.search.InferencingTests)  Time elapsed: 0.387 s
28-May-2019 18:11:39 testMultiDecl6(org.eclipse.jdt.core.groovy.tests.search.InferencingTests)  Time elapsed: 0.278 s
28-May-2019 18:11:39 testMultiDecl7(org.eclipse.jdt.core.groovy.tests.search.InferencingTests)  Time elapsed: 1.771 s
28-May-2019 18:11:39 testMultiDecl8(org.eclipse.jdt.core.groovy.tests.search.InferencingTests)  Time elapsed: 0.388 s
28-May-2019 18:11:39 testMultiDecl9(org.eclipse.jdt.core.groovy.tests.search.InferencingTests)  Time elapsed: 0.381 s
28-May-2019 18:11:39 testLocalMethod1(org.eclipse.jdt.core.groovy.tests.search.InferencingTests)  Time elapsed: 0.27 s
28-May-2019 18:11:39 testLocalMethod2(org.eclipse.jdt.core.groovy.tests.search.InferencingTests)  Time elapsed: 1.513 s
28-May-2019 18:11:39 testLocalMethod3(org.eclipse.jdt.core.groovy.tests.search.InferencingTests)  Time elapsed: 0.256 s
28-May-2019 18:11:39 testLocalMethod4(org.eclipse.jdt.core.groovy.tests.search.InferencingTests)  Time elapsed: 0.272 s
28-May-2019 18:11:39 testLocalMethod5(org.eclipse.jdt.core.groovy.tests.search.InferencingTests)  Time elapsed: 0.259 s
28-May-2019 18:11:39 testLocalVar10(org.eclipse.jdt.core.groovy.tests.search.InferencingTests)  Time elapsed: 1.593 s
28-May-2019 18:11:39 testLocalVar11(org.eclipse.jdt.core.groovy.tests.search.InferencingTests)  Time elapsed: 0.176 s
28-May-2019 18:11:39 testLocalVar12(org.eclipse.jdt.core.groovy.tests.search.InferencingTests)  Time elapsed: 0.271 s
28-May-2019 18:11:39 testLocalVar13(org.eclipse.jdt.core.groovy.tests.search.InferencingTests)  Time elapsed: 0.278 s
28-May-2019 18:11:39 testLocalVar14(org.eclipse.jdt.core.groovy.tests.search.InferencingTests)  Time elapsed: 1.387 s
28-May-2019 18:11:39 testLocalVar15(org.eclipse.jdt.core.groovy.tests.search.InferencingTests)  Time elapsed: 0.716 s
28-May-2019 18:11:39 testLocalVar16(org.eclipse.jdt.core.groovy.tests.search.InferencingTests)  Time elapsed: 1.531 s
28-May-2019 18:11:39 testLocalVar17(org.eclipse.jdt.core.groovy.tests.search.InferencingTests)  Time elapsed: 0.752 s
28-May-2019 18:11:39 testLocalVar18(org.eclipse.jdt.core.groovy.tests.search.InferencingTests)  Time elapsed: 1.948 s
28-May-2019 18:11:39 testLocalVar19(org.eclipse.jdt.core.groovy.tests.search.InferencingTests)  Time elapsed: 0.623 s
28-May-2019 18:11:39 testLocalVar20(org.eclipse.jdt.core.groovy.tests.search.InferencingTests)  Time elapsed: 1.62 s
28-May-2019 18:11:39 testLocalVar21(org.eclipse.jdt.core.groovy.tests.search.InferencingTests)  Time elapsed: 0.581 s
28-May-2019 18:11:39 testLocalVar22(org.eclipse.jdt.core.groovy.tests.search.InferencingTests)  Time elapsed: 1.273 s
28-May-2019 18:11:39 testLocalVar23(org.eclipse.jdt.core.groovy.tests.search.InferencingTests)  Time elapsed: 1.846 s
28-May-2019 18:11:39 testLocalVar24(org.eclipse.jdt.core.groovy.tests.search.InferencingTests)  Time elapsed: 1.784 s
28-May-2019 18:11:39 testLocalVar25(org.eclipse.jdt.core.groovy.tests.search.InferencingTests)  Time elapsed: 0.936 s
28-May-2019 18:11:39 testLocalVar26(org.eclipse.jdt.core.groovy.tests.search.InferencingTests)  Time elapsed: 1.141 s
28-May-2019 18:11:39 testLocalVar27(org.eclipse.jdt.core.groovy.tests.search.InferencingTests)  Time elapsed: 0.189 s
28-May-2019 18:11:39 testLocalVar28(org.eclipse.jdt.core.groovy.tests.search.InferencingTests)  Time elapsed: 0.27 s
28-May-2019 18:11:39 testNoGString(org.eclipse.jdt.core.groovy.tests.search.InferencingTests)  Time elapsed: 0.268 s
28-May-2019 18:11:39 testObjectMethodOnInterfaceAsProperty(org.eclipse.jdt.core.groovy.tests.search.InferencingTests)  Time elapsed: 0.909 s
28-May-2019 18:11:39 testMatcher1(org.eclipse.jdt.core.groovy.tests.search.InferencingTests)  Time elapsed: 0.263 s
28-May-2019 18:11:39 testMatcher2(org.eclipse.jdt.core.groovy.tests.search.InferencingTests)  Time elapsed: 0.272 s
28-May-2019 18:11:39 testCatchBlock1(org.eclipse.jdt.core.groovy.tests.search.InferencingTests)  Time elapsed: 0.26 s
28-May-2019 18:11:39 testCatchBlock2(org.eclipse.jdt.core.groovy.tests.search.InferencingTests)  Time elapsed: 0.932 s
28-May-2019 18:11:39 testCatchBlock3(org.eclipse.jdt.core.groovy.tests.search.InferencingTests)  Time elapsed: 0.283 s
28-May-2019 18:11:39 testCatchBlock4(org.eclipse.jdt.core.groovy.tests.search.InferencingTests)  Time elapsed: 0.177 s
28-May-2019 18:11:39 testCatchBlock5(org.eclipse.jdt.core.groovy.tests.search.InferencingTests)  Time elapsed: 0.26 s
28-May-2019 18:11:39 testInterfaceMethodAsProperty2(org.eclipse.jdt.core.groovy.tests.search.InferencingTests)  Time elapsed: 1.06 s
28-May-2019 18:11:39 testInterfaceMethodAsProperty3(org.eclipse.jdt.core.groovy.tests.search.InferencingTests)  Time elapsed: 0.452 s
28-May-2019 18:11:39 testGetAt1(org.eclipse.jdt.core.groovy.tests.search.InferencingTests)  Time elapsed: 0.173 s
28-May-2019 18:11:39 testGetAt2(org.eclipse.jdt.core.groovy.tests.search.InferencingTests)  Time elapsed: 1.346 s
28-May-2019 18:11:39 testGetAt3(org.eclipse.jdt.core.groovy.tests.search.InferencingTests)  Time elapsed: 0.289 s
28-May-2019 18:11:39 testGetAt4(org.eclipse.jdt.core.groovy.tests.search.InferencingTests)  Time elapsed: 0.173 s
28-May-2019 18:11:39 testGetAt5(org.eclipse.jdt.core.groovy.tests.search.InferencingTests)  Time elapsed: 1.254 s
28-May-2019 18:11:39 testGetAt6(org.eclipse.jdt.core.groovy.tests.search.InferencingTests)  Time elapsed: 0.374 s
28-May-2019 18:11:39 testGetAt7(org.eclipse.jdt.core.groovy.tests.search.InferencingTests)  Time elapsed: 0.294 s
28-May-2019 18:11:39 testGetAt8(org.eclipse.jdt.core.groovy.tests.search.InferencingTests) skipped
28-May-2019 18:11:39 testGetAt9(org.eclipse.jdt.core.groovy.tests.search.InferencingTests) skipped
28-May-2019 18:11:39 testFieldWithInitializer1(org.eclipse.jdt.core.groovy.tests.search.InferencingTests)  Time elapsed: 0.172 s
28-May-2019 18:11:39 testFieldWithInitializer2(org.eclipse.jdt.core.groovy.tests.search.InferencingTests)  Time elapsed: 0.273 s
28-May-2019 18:11:39 testNested1(org.eclipse.jdt.core.groovy.tests.search.InferencingTests)  Time elapsed: 0.266 s
28-May-2019 18:11:39 testNested2(org.eclipse.jdt.core.groovy.tests.search.InferencingTests)  Time elapsed: 1.348 s
28-May-2019 18:11:39 testNested3(org.eclipse.jdt.core.groovy.tests.search.InferencingTests)  Time elapsed: 0.268 s
28-May-2019 18:11:39 testNested4(org.eclipse.jdt.core.groovy.tests.search.InferencingTests)  Time elapsed: 0.274 s
28-May-2019 18:11:39 testIndirectInterfaceConstant(org.eclipse.jdt.core.groovy.tests.search.InferencingTests)  Time elapsed: 1.101 s
28-May-2019 18:11:39 testInstanceOf1(org.eclipse.jdt.core.groovy.tests.search.InferencingTests)  Time elapsed: 0.743 s
28-May-2019 18:11:39 testInstanceOf2(org.eclipse.jdt.core.groovy.tests.search.InferencingTests)  Time elapsed: 1.366 s
28-May-2019 18:11:39 testInstanceOf3(org.eclipse.jdt.core.groovy.tests.search.InferencingTests)  Time elapsed: 1.575 s
28-May-2019 18:11:39 testInstanceOf4(org.eclipse.jdt.core.groovy.tests.search.InferencingTests)  Time elapsed: 1.074 s
28-May-2019 18:11:39 testInstanceOf5(org.eclipse.jdt.core.groovy.tests.search.InferencingTests)  Time elapsed: 1.623 s
28-May-2019 18:11:39 testInstanceOf6(org.eclipse.jdt.core.groovy.tests.search.InferencingTests)  Time elapsed: 1.704 s
28-May-2019 18:11:39 testInstanceOf7(org.eclipse.jdt.core.groovy.tests.search.InferencingTests)  Time elapsed: 1.47 s
28-May-2019 18:11:39 testInstanceOf8(org.eclipse.jdt.core.groovy.tests.search.InferencingTests)  Time elapsed: 0.698 s
28-May-2019 18:11:39 testInstanceOf9(org.eclipse.jdt.core.groovy.tests.search.InferencingTests)  Time elapsed: 1.538 s
28-May-2019 18:11:39 testAnonInner1(org.eclipse.jdt.core.groovy.tests.search.InferencingTests)  Time elapsed: 0.273 s
28-May-2019 18:11:39 testAnonInner2(org.eclipse.jdt.core.groovy.tests.search.InferencingTests)  Time elapsed: 0.298 s
28-May-2019 18:11:39 testAnonInner3(org.eclipse.jdt.core.groovy.tests.search.InferencingTests)  Time elapsed: 1.057 s
28-May-2019 18:11:39 testAnonInner4(org.eclipse.jdt.core.groovy.tests.search.InferencingTests)  Time elapsed: 0.291 s
28-May-2019 18:11:39 testAnonInner5(org.eclipse.jdt.core.groovy.tests.search.InferencingTests)  Time elapsed: 0.284 s
28-May-2019 18:11:39 testAnonInner6(org.eclipse.jdt.core.groovy.tests.search.InferencingTests)  Time elapsed: 0.301 s
28-May-2019 18:11:39 testAnonInner7(org.eclipse.jdt.core.groovy.tests.search.InferencingTests)  Time elapsed: 1.436 s
28-May-2019 18:11:39 testNumber1(org.eclipse.jdt.core.groovy.tests.search.InferencingTests)  Time elapsed: 0.178 s
28-May-2019 18:11:39 testNumber2(org.eclipse.jdt.core.groovy.tests.search.InferencingTests)  Time elapsed: 0.85 s
28-May-2019 18:11:39 testNumber3(org.eclipse.jdt.core.groovy.tests.search.InferencingTests)  Time elapsed: 0.266 s
28-May-2019 18:11:39 testNumber4(org.eclipse.jdt.core.groovy.tests.search.InferencingTests)  Time elapsed: 0.173 s
28-May-2019 18:11:39 testNumber5(org.eclipse.jdt.core.groovy.tests.search.InferencingTests)  Time elapsed: 0.169 s
28-May-2019 18:11:39 testNumber6(org.eclipse.jdt.core.groovy.tests.search.InferencingTests)  Time elapsed: 0.86 s
28-May-2019 18:11:39 testSpread1(org.eclipse.jdt.core.groovy.tests.search.InferencingTests)  Time elapsed: 0.258 s
28-May-2019 18:11:39 testSpread2(org.eclipse.jdt.core.groovy.tests.search.InferencingTests)  Time elapsed: 0.275 s
28-May-2019 18:11:39 testSpread3(org.eclipse.jdt.core.groovy.tests.search.InferencingTests)  Time elapsed: 0.266 s
28-May-2019 18:11:39 testSpread4(org.eclipse.jdt.core.groovy.tests.search.InferencingTests)  Time elapsed: 0.971 s
28-May-2019 18:11:39 testSpread5(org.eclipse.jdt.core.groovy.tests.search.InferencingTests)  Time elapsed: 0.264 s
28-May-2019 18:11:39 testSpread6(org.eclipse.jdt.core.groovy.tests.search.InferencingTests)  Time elapsed: 0.281 s
28-May-2019 18:11:39 testSpread7(org.eclipse.jdt.core.groovy.tests.search.InferencingTests)  Time elapsed: 0.264 s
28-May-2019 18:11:39 testSpread8(org.eclipse.jdt.core.groovy.tests.search.InferencingTests)  Time elapsed: 0.963 s
28-May-2019 18:11:39 testSpread9(org.eclipse.jdt.core.groovy.tests.search.InferencingTests)  Time elapsed: 0.291 s
28-May-2019 18:11:39 testPattern1(org.eclipse.jdt.core.groovy.tests.search.InferencingTests)  Time elapsed: 0.17 s
28-May-2019 18:11:39 testPattern2(org.eclipse.jdt.core.groovy.tests.search.InferencingTests)  Time elapsed: 0.263 s
28-May-2019 18:11:39 testClassReference2a(org.eclipse.jdt.core.groovy.tests.search.InferencingTests)  Time elapsed: 1.147 s
28-May-2019 18:11:39 testClassReference3a(org.eclipse.jdt.core.groovy.tests.search.InferencingTests)  Time elapsed: 0.385 s
28-May-2019 18:11:39 testClassReference4a(org.eclipse.jdt.core.groovy.tests.search.InferencingTests)  Time elapsed: 1.322 s
28-May-2019 18:11:39 testClassReference4b(org.eclipse.jdt.core.groovy.tests.search.InferencingTests)  Time elapsed: 0.419 s
28-May-2019 18:11:39 testString1(org.eclipse.jdt.core.groovy.tests.search.InferencingTests)  Time elapsed: 0.279 s
28-May-2019 18:11:39 testString2(org.eclipse.jdt.core.groovy.tests.search.InferencingTests)  Time elapsed: 0.272 s
28-May-2019 18:11:39 testString3(org.eclipse.jdt.core.groovy.tests.search.InferencingTests)  Time elapsed: 1.276 s
28-May-2019 18:11:39 testSuperFieldReference1(org.eclipse.jdt.core.groovy.tests.search.InferencingTests)  Time elapsed: 0.268 s
28-May-2019 18:11:39 testSuperFieldReference2(org.eclipse.jdt.core.groovy.tests.search.InferencingTests)  Time elapsed: 0.275 s
28-May-2019 18:11:39 testSuperFieldReference3(org.eclipse.jdt.core.groovy.tests.search.InferencingTests)  Time elapsed: 1.214 s
28-May-2019 18:11:39 testClassReference1(org.eclipse.jdt.core.groovy.tests.search.InferencingTests)  Time elapsed: 0.26 s
28-May-2019 18:11:39 testClassReference2(org.eclipse.jdt.core.groovy.tests.search.InferencingTests)  Time elapsed: 0.379 s
28-May-2019 18:11:39 testClassReference3(org.eclipse.jdt.core.groovy.tests.search.InferencingTests)  Time elapsed: 1.103 s
28-May-2019 18:11:39 testClassReference4(org.eclipse.jdt.core.groovy.tests.search.InferencingTests)  Time elapsed: 0.397 s
28-May-2019 18:11:39 testPropertyNodeFromJava1(org.eclipse.jdt.core.groovy.tests.search.JDTPropertyNodeInferencingTests)  Time elapsed: 0.258 s
28-May-2019 18:11:39 testPropertyNodeFromJava2(org.eclipse.jdt.core.groovy.tests.search.JDTPropertyNodeInferencingTests)  Time elapsed: 0.266 s
28-May-2019 18:11:39 testPropertyNodeFromJava3(org.eclipse.jdt.core.groovy.tests.search.JDTPropertyNodeInferencingTests)  Time elapsed: 1.259 s
28-May-2019 18:11:39 testPropertyNodeFromJava4(org.eclipse.jdt.core.groovy.tests.search.JDTPropertyNodeInferencingTests)  Time elapsed: 0.188 s
28-May-2019 18:11:39 testNodeFromJava1(org.eclipse.jdt.core.groovy.tests.search.JDTPropertyNodeInferencingTests)  Time elapsed: 0.265 s
28-May-2019 18:11:39 testPropertyNodeReferenceInBinary1(org.eclipse.jdt.core.groovy.tests.search.JDTPropertyNodeInferencingTests)  Time elapsed: 0.271 s
28-May-2019 18:11:39 testVarReferenceInGString1(org.eclipse.jdt.core.groovy.tests.search.LocalVariableReferenceSearchTests)  Time elapsed: 1.329 s
28-May-2019 18:11:39 testVarReferenceInGString2(org.eclipse.jdt.core.groovy.tests.search.LocalVariableReferenceSearchTests)  Time elapsed: 0.165 s
28-May-2019 18:11:39 testVarReferenceInGString3(org.eclipse.jdt.core.groovy.tests.search.LocalVariableReferenceSearchTests)  Time elapsed: 0.27 s
28-May-2019 18:11:39 testVarReferenceInGString4(org.eclipse.jdt.core.groovy.tests.search.LocalVariableReferenceSearchTests)  Time elapsed: 0.178 s
28-May-2019 18:11:39 testVarReferenceInGString5(org.eclipse.jdt.core.groovy.tests.search.LocalVariableReferenceSearchTests)  Time elapsed: 1.249 s
28-May-2019 18:11:39 testVarReference10(org.eclipse.jdt.core.groovy.tests.search.LocalVariableReferenceSearchTests)  Time elapsed: 0.164 s
28-May-2019 18:11:39 testVarReference1(org.eclipse.jdt.core.groovy.tests.search.LocalVariableReferenceSearchTests)  Time elapsed: 0.168 s
28-May-2019 18:11:39 testVarReference2(org.eclipse.jdt.core.groovy.tests.search.LocalVariableReferenceSearchTests)  Time elapsed: 0.266 s
28-May-2019 18:11:39 testVarReference3(org.eclipse.jdt.core.groovy.tests.search.LocalVariableReferenceSearchTests)  Time elapsed: 0.27 s
28-May-2019 18:11:39 testVarReference4(org.eclipse.jdt.core.groovy.tests.search.LocalVariableReferenceSearchTests)  Time elapsed: 0.95 s
28-May-2019 18:11:39 testVarReference5(org.eclipse.jdt.core.groovy.tests.search.LocalVariableReferenceSearchTests)  Time elapsed: 0.27 s
28-May-2019 18:11:39 testVarReference6(org.eclipse.jdt.core.groovy.tests.search.LocalVariableReferenceSearchTests)  Time elapsed: 0.268 s
28-May-2019 18:11:39 testVarReference7(org.eclipse.jdt.core.groovy.tests.search.LocalVariableReferenceSearchTests)  Time elapsed: 0.176 s
28-May-2019 18:11:39 testVarReference8(org.eclipse.jdt.core.groovy.tests.search.LocalVariableReferenceSearchTests)  Time elapsed: 1.009 s
28-May-2019 18:11:39 testVarReference9(org.eclipse.jdt.core.groovy.tests.search.LocalVariableReferenceSearchTests)  Time elapsed: 0.268 s
28-May-2019 18:11:39 testExplicitPropertySetterSearch1(org.eclipse.jdt.core.groovy.tests.search.MethodReferenceSearchTests)  Time elapsed: 0.401 s
28-May-2019 18:11:39 testExplicitPropertySetterSearch2(org.eclipse.jdt.core.groovy.tests.search.MethodReferenceSearchTests)  Time elapsed: 1.921 s
28-May-2019 18:11:39 testOverloadedMethodReferences1(org.eclipse.jdt.core.groovy.tests.search.MethodReferenceSearchTests)  Time elapsed: 0.312 s
28-May-2019 18:11:39 testOverloadedMethodReferences2(org.eclipse.jdt.core.groovy.tests.search.MethodReferenceSearchTests)  Time elapsed: 0.227 s
28-May-2019 18:11:39 testOverloadedMethodReferences3(org.eclipse.jdt.core.groovy.tests.search.MethodReferenceSearchTests)  Time elapsed: 1.541 s
28-May-2019 18:11:39 testOverloadedMethodReferences4(org.eclipse.jdt.core.groovy.tests.search.MethodReferenceSearchTests)  Time elapsed: 0.328 s
28-May-2019 18:11:39 testOverloadedMethodReferences5(org.eclipse.jdt.core.groovy.tests.search.MethodReferenceSearchTests)  Time elapsed: 0.485 s
28-May-2019 18:11:39 testOverloadedMethodReferences6(org.eclipse.jdt.core.groovy.tests.search.MethodReferenceSearchTests)  Time elapsed: 1.179 s
28-May-2019 18:11:39 testStaticMethodReferenceSearch(org.eclipse.jdt.core.groovy.tests.search.MethodReferenceSearchTests)  Time elapsed: 0.209 s
28-May-2019 18:11:39 testMethodReferencesInClass1(org.eclipse.jdt.core.groovy.tests.search.MethodReferenceSearchTests)  Time elapsed: 0.233 s
28-May-2019 18:11:39 testMethodReferencesInClass2(org.eclipse.jdt.core.groovy.tests.search.MethodReferenceSearchTests)  Time elapsed: 1.067 s
28-May-2019 18:11:39 testMethodReferencesInClass3(org.eclipse.jdt.core.groovy.tests.search.MethodReferenceSearchTests)  Time elapsed: 0.665 s
28-May-2019 18:11:39 testGenericsMethodReferenceSearch(org.eclipse.jdt.core.groovy.tests.search.MethodReferenceSearchTests)  Time elapsed: 0.556 s
28-May-2019 18:11:39 testMethodReferencesInScript1(org.eclipse.jdt.core.groovy.tests.search.MethodReferenceSearchTests)  Time elapsed: 1.322 s
28-May-2019 18:11:39 testMethodReferencesInScript2(org.eclipse.jdt.core.groovy.tests.search.MethodReferenceSearchTests)  Time elapsed: 0.316 s
28-May-2019 18:11:39 testMethodReferencesInScript3(org.eclipse.jdt.core.groovy.tests.search.MethodReferenceSearchTests)  Time elapsed: 0.315 s
28-May-2019 18:11:39 testMethodReferencesInScript4(org.eclipse.jdt.core.groovy.tests.search.MethodReferenceSearchTests)  Time elapsed: 1.444 s
28-May-2019 18:11:39 testMethodReferencesInScript5(org.eclipse.jdt.core.groovy.tests.search.MethodReferenceSearchTests)  Time elapsed: 0.318 s
28-May-2019 18:11:39 testMethodReferencesInScript6(org.eclipse.jdt.core.groovy.tests.search.MethodReferenceSearchTests)  Time elapsed: 0.33 s
28-May-2019 18:11:39 testMethodReferencesInScript7(org.eclipse.jdt.core.groovy.tests.search.MethodReferenceSearchTests)  Time elapsed: 0.992 s
28-May-2019 18:11:39 testMethodReferencesInScript8(org.eclipse.jdt.core.groovy.tests.search.MethodReferenceSearchTests)  Time elapsed: 0.322 s
28-May-2019 18:11:39 testMethodReferencesInScript9(org.eclipse.jdt.core.groovy.tests.search.MethodReferenceSearchTests)  Time elapsed: 0.315 s
28-May-2019 18:11:39 testMethodWithDefaultParameters1(org.eclipse.jdt.core.groovy.tests.search.MethodReferenceSearchTests)  Time elapsed: 0.956 s
28-May-2019 18:11:39 testMethodWithDefaultParameters2(org.eclipse.jdt.core.groovy.tests.search.MethodReferenceSearchTests)  Time elapsed: 0.314 s
28-May-2019 18:11:39 testMethodWithDefaultParameters3(org.eclipse.jdt.core.groovy.tests.search.MethodReferenceSearchTests)  Time elapsed: 0.306 s
28-May-2019 18:11:39 testMethodWithDefaultParameters4(org.eclipse.jdt.core.groovy.tests.search.MethodReferenceSearchTests) skipped
28-May-2019 18:11:39 testExplicitPropertyGetterSearch1(org.eclipse.jdt.core.groovy.tests.search.MethodReferenceSearchTests)  Time elapsed: 1.11 s
28-May-2019 18:11:39 testExplicitPropertyGetterSearch2(org.eclipse.jdt.core.groovy.tests.search.MethodReferenceSearchTests)  Time elapsed: 0.646 s
28-May-2019 18:11:39 testRightShift(org.eclipse.jdt.core.groovy.tests.search.OperatorOverloadingInferencingTests)  Time elapsed: 0.271 s
28-May-2019 18:11:39 testLeftShift(org.eclipse.jdt.core.groovy.tests.search.OperatorOverloadingInferencingTests)  Time elapsed: 1.673 s
28-May-2019 18:11:39 testAnd(org.eclipse.jdt.core.groovy.tests.search.OperatorOverloadingInferencingTests)  Time elapsed: 0.189 s
28-May-2019 18:11:39 testMod(org.eclipse.jdt.core.groovy.tests.search.OperatorOverloadingInferencingTests)  Time elapsed: 0.164 s
28-May-2019 18:11:39 testXor(org.eclipse.jdt.core.groovy.tests.search.OperatorOverloadingInferencingTests)  Time elapsed: 0.179 s
28-May-2019 18:11:39 testPlus1(org.eclipse.jdt.core.groovy.tests.search.OperatorOverloadingInferencingTests)  Time elapsed: 1.274 s
28-May-2019 18:11:39 testPlus2(org.eclipse.jdt.core.groovy.tests.search.OperatorOverloadingInferencingTests)  Time elapsed: 0.281 s
28-May-2019 18:11:39 testPlus3(org.eclipse.jdt.core.groovy.tests.search.OperatorOverloadingInferencingTests)  Time elapsed: 0.182 s
28-May-2019 18:11:39 testOr(org.eclipse.jdt.core.groovy.tests.search.OperatorOverloadingInferencingTests)  Time elapsed: 0.278 s
28-May-2019 18:11:39 testPrefix1(org.eclipse.jdt.core.groovy.tests.search.OperatorOverloadingInferencingTests)  Time elapsed: 1.137 s
28-May-2019 18:11:39 testPrefix2(org.eclipse.jdt.core.groovy.tests.search.OperatorOverloadingInferencingTests)  Time elapsed: 0.299 s
28-May-2019 18:11:39 testPrefix3(org.eclipse.jdt.core.groovy.tests.search.OperatorOverloadingInferencingTests)  Time elapsed: 0.273 s
28-May-2019 18:11:39 testPrefix4(org.eclipse.jdt.core.groovy.tests.search.OperatorOverloadingInferencingTests)  Time elapsed: 0.297 s
28-May-2019 18:11:39 testPrefix5(org.eclipse.jdt.core.groovy.tests.search.OperatorOverloadingInferencingTests)  Time elapsed: 1.11 s
28-May-2019 18:11:39 testPrefix6(org.eclipse.jdt.core.groovy.tests.search.OperatorOverloadingInferencingTests)  Time elapsed: 0.2 s
28-May-2019 18:11:39 testLongExpr1(org.eclipse.jdt.core.groovy.tests.search.OperatorOverloadingInferencingTests)  Time elapsed: 0.266 s
28-May-2019 18:11:39 testLongExpr2(org.eclipse.jdt.core.groovy.tests.search.OperatorOverloadingInferencingTests)  Time elapsed: 0.17 s  <<< FAILURE!
28-May-2019 18:11:39 java.lang.AssertionError:
28-May-2019 18:11:39 Expected type not found.
28-May-2019 18:11:39 Expected: Foo
28-May-2019 18:11:39 Found: java.util.List<Foo>
28-May-2019 18:11:39 Declaring type: Search
28-May-2019 18:11:39 ASTNode: org.codehaus.groovy.ast.expr.VariableExpression@1061bc[variable: xxx]
28-May-2019 18:11:39 Confidence: INFERRED
28-May-2019 18:11:39
28-May-2019 18:11:39         at org.eclipse.jdt.core.groovy.tests.search.OperatorOverloadingInferencingTests.testLongExpr2(OperatorOverloadingInferencingTests.java:325)
28-May-2019 18:11:39
28-May-2019 18:11:39 testLongExpr3(org.eclipse.jdt.core.groovy.tests.search.OperatorOverloadingInferencingTests)  Time elapsed: 0.271 s
28-May-2019 18:11:39 testAttributeExpr1(org.eclipse.jdt.core.groovy.tests.search.OperatorOverloadingInferencingTests)  Time elapsed: 1.275 s
28-May-2019 18:11:39 testAttributeExpr2(org.eclipse.jdt.core.groovy.tests.search.OperatorOverloadingInferencingTests)  Time elapsed: 0.265 s
28-May-2019 18:11:39 testDivide(org.eclipse.jdt.core.groovy.tests.search.OperatorOverloadingInferencingTests)  Time elapsed: 0.274 s
28-May-2019 18:11:39 testMultiply(org.eclipse.jdt.core.groovy.tests.search.OperatorOverloadingInferencingTests)  Time elapsed: 0.267 s
28-May-2019 18:11:39 testGetAt1(org.eclipse.jdt.core.groovy.tests.search.OperatorOverloadingInferencingTests)  Time elapsed: 1.183 s
28-May-2019 18:11:39 testGetAt2(org.eclipse.jdt.core.groovy.tests.search.OperatorOverloadingInferencingTests)  Time elapsed: 0.277 s
28-May-2019 18:11:39 testGetAt3(org.eclipse.jdt.core.groovy.tests.search.OperatorOverloadingInferencingTests)  Time elapsed: 0.266 s
28-May-2019 18:11:39 testGetAt4(org.eclipse.jdt.core.groovy.tests.search.OperatorOverloadingInferencingTests)  Time elapsed: 0.185 s
28-May-2019 18:11:39 testGetAt5(org.eclipse.jdt.core.groovy.tests.search.OperatorOverloadingInferencingTests)  Time elapsed: 1.053 s
28-May-2019 18:11:39 testGetAt6(org.eclipse.jdt.core.groovy.tests.search.OperatorOverloadingInferencingTests)  Time elapsed: 0.176 s
28-May-2019 18:11:39 testGetAt7(org.eclipse.jdt.core.groovy.tests.search.OperatorOverloadingInferencingTests)  Time elapsed: 0.23 s
28-May-2019 18:11:39 testGetAt8(org.eclipse.jdt.core.groovy.tests.search.OperatorOverloadingInferencingTests)  Time elapsed: 0.266 s
28-May-2019 18:11:39 testGetAt9(org.eclipse.jdt.core.groovy.tests.search.OperatorOverloadingInferencingTests)  Time elapsed: 1.391 s
28-May-2019 18:11:39 testPostfix1(org.eclipse.jdt.core.groovy.tests.search.OperatorOverloadingInferencingTests)  Time elapsed: 0.195 s
28-May-2019 18:11:39 testPostfix2(org.eclipse.jdt.core.groovy.tests.search.OperatorOverloadingInferencingTests)  Time elapsed: 0.261 s
28-May-2019 18:11:39 testMinus1(org.eclipse.jdt.core.groovy.tests.search.OperatorOverloadingInferencingTests)  Time elapsed: 0.179 s
28-May-2019 18:11:39 testMinus2(org.eclipse.jdt.core.groovy.tests.search.OperatorOverloadingInferencingTests)  Time elapsed: 1.08 s
28-May-2019 18:11:39 testNumberPlusString1(org.eclipse.jdt.core.groovy.tests.search.OperatorOverloadingInferencingTests)  Time elapsed: 0.19 s
28-May-2019 18:11:39 testNumberPlusString2(org.eclipse.jdt.core.groovy.tests.search.OperatorOverloadingInferencingTests)  Time elapsed: 0.269 s
28-May-2019 18:11:39 testCompleteExpr1(org.eclipse.jdt.core.groovy.tests.search.OperatorOverloadingInferencingTests)  Time elapsed: 0.177 s
28-May-2019 18:11:39 testCompleteExpr2(org.eclipse.jdt.core.groovy.tests.search.OperatorOverloadingInferencingTests)  Time elapsed: 1.103 s
28-May-2019 18:11:39 testCompleteExpr3(org.eclipse.jdt.core.groovy.tests.search.OperatorOverloadingInferencingTests)  Time elapsed: 0.264 s
28-May-2019 18:11:39 testCompleteExpr4(org.eclipse.jdt.core.groovy.tests.search.OperatorOverloadingInferencingTests)  Time elapsed: 0.268 s
28-May-2019 18:11:39 testCompleteExpr5(org.eclipse.jdt.core.groovy.tests.search.OperatorOverloadingInferencingTests)  Time elapsed: 0.26 s
28-May-2019 18:11:39 testCompleteExpr6(org.eclipse.jdt.core.groovy.tests.search.OperatorOverloadingInferencingTests)  Time elapsed: 0.959 s
28-May-2019 18:11:39 testCompleteExpr7(org.eclipse.jdt.core.groovy.tests.search.OperatorOverloadingInferencingTests)  Time elapsed: 0.267 s
28-May-2019 18:11:39 testCompleteExpr8(org.eclipse.jdt.core.groovy.tests.search.OperatorOverloadingInferencingTests)  Time elapsed: 0.186 s
28-May-2019 18:11:39 testDataTable(org.eclipse.jdt.core.groovy.tests.search.SpockInferencingTests) skipped
28-May-2019 18:11:39 testBasics(org.eclipse.jdt.core.groovy.tests.search.SpockInferencingTests) skipped
28-May-2019 18:11:39 testNonStaticReference1(org.eclipse.jdt.core.groovy.tests.search.StaticInferencingTests)  Time elapsed: 1.187 s
28-May-2019 18:11:39 testNonStaticReference2(org.eclipse.jdt.core.groovy.tests.search.StaticInferencingTests)  Time elapsed: 0.28 s
28-May-2019 18:11:39 testNonStaticReference3(org.eclipse.jdt.core.groovy.tests.search.StaticInferencingTests)  Time elapsed: 0.172 s
28-May-2019 18:11:39 testNonStaticReference4(org.eclipse.jdt.core.groovy.tests.search.StaticInferencingTests)  Time elapsed: 0.267 s
28-May-2019 18:11:39 testNonStaticReference5(org.eclipse.jdt.core.groovy.tests.search.StaticInferencingTests)  Time elapsed: 1.182 s
28-May-2019 18:11:39 testNonStaticReference6(org.eclipse.jdt.core.groovy.tests.search.StaticInferencingTests)  Time elapsed: 0.271 s
28-May-2019 18:11:39 testNonStaticReference7(org.eclipse.jdt.core.groovy.tests.search.StaticInferencingTests)  Time elapsed: 0.247 s
28-May-2019 18:11:39 testNonStaticReference8(org.eclipse.jdt.core.groovy.tests.search.StaticInferencingTests)  Time elapsed: 0.257 s
28-May-2019 18:11:39 testStaticReference1(org.eclipse.jdt.core.groovy.tests.search.StaticInferencingTests)  Time elapsed: 1.35 s
28-May-2019 18:11:39 testStaticReference2(org.eclipse.jdt.core.groovy.tests.search.StaticInferencingTests)  Time elapsed: 0.203 s
28-May-2019 18:11:39 testStaticReference3(org.eclipse.jdt.core.groovy.tests.search.StaticInferencingTests)  Time elapsed: 0.273 s
28-May-2019 18:11:39 testStaticReference4(org.eclipse.jdt.core.groovy.tests.search.StaticInferencingTests)  Time elapsed: 0.164 s
28-May-2019 18:11:39 testStaticReference5(org.eclipse.jdt.core.groovy.tests.search.StaticInferencingTests)  Time elapsed: 1.226 s
28-May-2019 18:11:39 testStaticReference6(org.eclipse.jdt.core.groovy.tests.search.StaticInferencingTests)  Time elapsed: 0.276 s
28-May-2019 18:11:39 testStaticReference7(org.eclipse.jdt.core.groovy.tests.search.StaticInferencingTests)  Time elapsed: 0.265 s
28-May-2019 18:11:39 testStaticReference8(org.eclipse.jdt.core.groovy.tests.search.StaticInferencingTests)  Time elapsed: 0.269 s
28-May-2019 18:11:39 testStaticReference9(org.eclipse.jdt.core.groovy.tests.search.StaticInferencingTests)  Time elapsed: 0.265 s
28-May-2019 18:11:39 testStaticImport1(org.eclipse.jdt.core.groovy.tests.search.StaticInferencingTests)  Time elapsed: 1.1 s
28-May-2019 18:11:39 testStaticImport2(org.eclipse.jdt.core.groovy.tests.search.StaticInferencingTests)  Time elapsed: 0.267 s
28-May-2019 18:11:39 testStaticImport3(org.eclipse.jdt.core.groovy.tests.search.StaticInferencingTests)  Time elapsed: 0.277 s
28-May-2019 18:11:39 testStaticImport4(org.eclipse.jdt.core.groovy.tests.search.StaticInferencingTests)  Time elapsed: 0.275 s
28-May-2019 18:11:39 testStaticImport5(org.eclipse.jdt.core.groovy.tests.search.StaticInferencingTests)  Time elapsed: 0.987 s
28-May-2019 18:11:39 testStaticImport6(org.eclipse.jdt.core.groovy.tests.search.StaticInferencingTests)  Time elapsed: 0.382 s
28-May-2019 18:11:39 testStaticImport7(org.eclipse.jdt.core.groovy.tests.search.StaticInferencingTests)  Time elapsed: 0.27 s
28-May-2019 18:11:39 testStaticImport8(org.eclipse.jdt.core.groovy.tests.search.StaticInferencingTests)  Time elapsed: 1.298 s
28-May-2019 18:11:39 testStaticImport9(org.eclipse.jdt.core.groovy.tests.search.StaticInferencingTests)  Time elapsed: 0.182 s
28-May-2019 18:11:39 testStaticImport10(org.eclipse.jdt.core.groovy.tests.search.StaticInferencingTests)  Time elapsed: 0.267 s
28-May-2019 18:11:39 testStaticImport11(org.eclipse.jdt.core.groovy.tests.search.StaticInferencingTests) skipped
28-May-2019 18:11:39 testStaticImport12(org.eclipse.jdt.core.groovy.tests.search.StaticInferencingTests) skipped
28-May-2019 18:11:39 testStaticImport13(org.eclipse.jdt.core.groovy.tests.search.StaticInferencingTests) skipped
28-May-2019 18:11:39 testClassReference16a(org.eclipse.jdt.core.groovy.tests.search.StaticInferencingTests)  Time elapsed: 0.261 s
28-May-2019 18:11:39 testClassReference17a(org.eclipse.jdt.core.groovy.tests.search.StaticInferencingTests)  Time elapsed: 1.096 s
28-May-2019 18:11:39 testStaticReference10a(org.eclipse.jdt.core.groovy.tests.search.StaticInferencingTests)  Time elapsed: 0.175 s
28-May-2019 18:11:39 testClassReference10(org.eclipse.jdt.core.groovy.tests.search.StaticInferencingTests)  Time elapsed: 0.27 s
28-May-2019 18:11:39 testClassReference11(org.eclipse.jdt.core.groovy.tests.search.StaticInferencingTests)  Time elapsed: 0.162 s
28-May-2019 18:11:39 testClassReference12(org.eclipse.jdt.core.groovy.tests.search.StaticInferencingTests)  Time elapsed: 0.287 s
28-May-2019 18:11:39 testClassReference13(org.eclipse.jdt.core.groovy.tests.search.StaticInferencingTests)  Time elapsed: 1.188 s
28-May-2019 18:11:39 testClassReference14(org.eclipse.jdt.core.groovy.tests.search.StaticInferencingTests)  Time elapsed: 0.263 s  <<< ERROR!
28-May-2019 18:11:39 java.lang.NoClassDefFoundError: org/codehaus/groovy/runtime/DefaultGroovyMethodsSupport
28-May-2019 18:11:39         at org.eclipse.jdt.core.groovy.tests.search.StaticInferencingTests.assertKnown(StaticInferencingTests.java:35)
28-May-2019 18:11:39         at org.eclipse.jdt.core.groovy.tests.search.StaticInferencingTests.testClassReference14(StaticInferencingTests.java:139)
28-May-2019 18:11:39 Caused by: java.lang.ClassNotFoundException: org.codehaus.groovy.runtime.DefaultGroovyMethodsSupport
28-May-2019 18:11:39         at org.eclipse.jdt.core.groovy.tests.search.StaticInferencingTests.assertKnown(StaticInferencingTests.java:35)
28-May-2019 18:11:39         at org.eclipse.jdt.core.groovy.tests.search.StaticInferencingTests.testClassReference14(StaticInferencingTests.java:139)
28-May-2019 18:11:39
28-May-2019 18:11:39 testClassReference15(org.eclipse.jdt.core.groovy.tests.search.StaticInferencingTests)  Time elapsed: 0.178 s
28-May-2019 18:11:39 testClassReference16(org.eclipse.jdt.core.groovy.tests.search.StaticInferencingTests)  Time elapsed: 0.268 s
28-May-2019 18:11:39 testClassReference17(org.eclipse.jdt.core.groovy.tests.search.StaticInferencingTests)  Time elapsed: 0.928 s
28-May-2019 18:11:39 testClassReference4a(org.eclipse.jdt.core.groovy.tests.search.StaticInferencingTests)  Time elapsed: 0.184 s
28-May-2019 18:11:39 testStaticReference10(org.eclipse.jdt.core.groovy.tests.search.StaticInferencingTests)  Time elapsed: 0.176 s
28-May-2019 18:11:39 testStaticReference1a(org.eclipse.jdt.core.groovy.tests.search.StaticInferencingTests)  Time elapsed: 0.27 s
28-May-2019 18:11:39 testStaticReference1b(org.eclipse.jdt.core.groovy.tests.search.StaticInferencingTests)  Time elapsed: 0.934 s
28-May-2019 18:11:39 testStaticReference9a(org.eclipse.jdt.core.groovy.tests.search.StaticInferencingTests)  Time elapsed: 0.268 s
28-May-2019 18:11:39 testClassReference1(org.eclipse.jdt.core.groovy.tests.search.StaticInferencingTests)  Time elapsed: 0.26 s
28-May-2019 18:11:39 testClassReference2(org.eclipse.jdt.core.groovy.tests.search.StaticInferencingTests)  Time elapsed: 0.172 s
28-May-2019 18:11:39 testClassReference3(org.eclipse.jdt.core.groovy.tests.search.StaticInferencingTests)  Time elapsed: 0.987 s
28-May-2019 18:11:39 testClassReference4(org.eclipse.jdt.core.groovy.tests.search.StaticInferencingTests)  Time elapsed: 0.184 s
28-May-2019 18:11:39 testClassReference5(org.eclipse.jdt.core.groovy.tests.search.StaticInferencingTests)  Time elapsed: 0.166 s
28-May-2019 18:11:39 testClassReference6(org.eclipse.jdt.core.groovy.tests.search.StaticInferencingTests)  Time elapsed: 0.263 s
28-May-2019 18:11:39 testClassReference7(org.eclipse.jdt.core.groovy.tests.search.StaticInferencingTests)  Time elapsed: 0.26 s
28-May-2019 18:11:39 testClassReference8(org.eclipse.jdt.core.groovy.tests.search.StaticInferencingTests)  Time elapsed: 1.045 s
28-May-2019 18:11:39 testClassReference9(org.eclipse.jdt.core.groovy.tests.search.StaticInferencingTests)  Time elapsed: 0.182 s
28-May-2019 18:11:39 testSyntheticAccessors1(org.eclipse.jdt.core.groovy.tests.search.SyntheticAccessorInferencingTests)  Time elapsed: 0.472 s
28-May-2019 18:11:39 testSyntheticAccessors2(org.eclipse.jdt.core.groovy.tests.search.SyntheticAccessorInferencingTests)  Time elapsed: 1.648 s
28-May-2019 18:11:39 testSyntheticAccessors3(org.eclipse.jdt.core.groovy.tests.search.SyntheticAccessorInferencingTests)  Time elapsed: 0.507 s
28-May-2019 18:11:39 testSyntheticAccessors4(org.eclipse.jdt.core.groovy.tests.search.SyntheticAccessorInferencingTests)  Time elapsed: 5.895 s
28-May-2019 18:11:39 testPrivateMethod(org.eclipse.jdt.core.groovy.tests.search.TraitInferencingTests)  Time elapsed: 0.385 s
28-May-2019 18:11:39 testPrivateStaticField(org.eclipse.jdt.core.groovy.tests.search.TraitInferencingTests)  Time elapsed: 0.386 s
28-May-2019 18:11:39 testPrivateMethod2(org.eclipse.jdt.core.groovy.tests.search.TraitInferencingTests)  Time elapsed: 1.566 s
28-May-2019 18:11:39 testPrivateMethod3(org.eclipse.jdt.core.groovy.tests.search.TraitInferencingTests)  Time elapsed: 0.299 s
28-May-2019 18:11:39 testPrivateMethod4(org.eclipse.jdt.core.groovy.tests.search.TraitInferencingTests)  Time elapsed: 0.285 s
28-May-2019 18:11:39 testPrivateStaticMethod(org.eclipse.jdt.core.groovy.tests.search.TraitInferencingTests)  Time elapsed: 1.451 s
28-May-2019 18:11:39 testPublicStaticSuperMethod(org.eclipse.jdt.core.groovy.tests.search.TraitInferencingTests)  Time elapsed: 0.38 s
28-May-2019 18:11:39 testPrivateStaticFinalField(org.eclipse.jdt.core.groovy.tests.search.TraitInferencingTests)  Time elapsed: 0.385 s
28-May-2019 18:11:39 testPrivateField(org.eclipse.jdt.core.groovy.tests.search.TraitInferencingTests)  Time elapsed: 1.074 s
28-May-2019 18:11:39 testFindClassDeclarationWithPattern(org.eclipse.jdt.core.groovy.tests.search.TypeReferenceSearchTests)  Time elapsed: 0.564 s
28-May-2019 18:11:39 testInnerTypes1(org.eclipse.jdt.core.groovy.tests.search.TypeReferenceSearchTests)  Time elapsed: 1.113 s
28-May-2019 18:11:39 testInnerTypes2(org.eclipse.jdt.core.groovy.tests.search.TypeReferenceSearchTests)  Time elapsed: 1.116 s
28-May-2019 18:11:39 testInnerTypes3(org.eclipse.jdt.core.groovy.tests.search.TypeReferenceSearchTests)  Time elapsed: 2.196 s
28-May-2019 18:11:39 testSearchForTypesScript1(org.eclipse.jdt.core.groovy.tests.search.TypeReferenceSearchTests)  Time elapsed: 0.274 s
28-May-2019 18:11:39 testSearchForTypesScript2(org.eclipse.jdt.core.groovy.tests.search.TypeReferenceSearchTests)  Time elapsed: 0.273 s
28-May-2019 18:11:39 testSearchForTypesScript3(org.eclipse.jdt.core.groovy.tests.search.TypeReferenceSearchTests)  Time elapsed: 0.275 s
28-May-2019 18:11:39 testSearchForTypesScript4(org.eclipse.jdt.core.groovy.tests.search.TypeReferenceSearchTests)  Time elapsed: 0.949 s
28-May-2019 18:11:39 testSearchForTypesScript5(org.eclipse.jdt.core.groovy.tests.search.TypeReferenceSearchTests)  Time elapsed: 0.276 s
28-May-2019 18:11:39 testSearchForTypesScript6(org.eclipse.jdt.core.groovy.tests.search.TypeReferenceSearchTests)  Time elapsed: 0.275 s
28-May-2019 18:11:39 testShouldntFindClassDeclarationInScript(org.eclipse.jdt.core.groovy.tests.search.TypeReferenceSearchTests)  Time elapsed: 1.114 s
28-May-2019 18:11:39 testSearchForTypesArray1(org.eclipse.jdt.core.groovy.tests.search.TypeReferenceSearchTests)  Time elapsed: 0.296 s
28-May-2019 18:11:39 testSearchForTypesClass1(org.eclipse.jdt.core.groovy.tests.search.TypeReferenceSearchTests)  Time elapsed: 0.176 s
28-May-2019 18:11:39 testSearchForTypesClass2(org.eclipse.jdt.core.groovy.tests.search.TypeReferenceSearchTests)  Time elapsed: 0.381 s
28-May-2019 18:11:39 testSearchForTypesClass3(org.eclipse.jdt.core.groovy.tests.search.TypeReferenceSearchTests)  Time elapsed: 0.217 s
28-May-2019 18:11:39 testSearchForTypesClass4(org.eclipse.jdt.core.groovy.tests.search.TypeReferenceSearchTests)  Time elapsed: 1.172 s
28-May-2019 18:11:39 testSearchForTypesClass5(org.eclipse.jdt.core.groovy.tests.search.TypeReferenceSearchTests)  Time elapsed: 0.393 s
28-May-2019 18:11:39 testSearchForTypesClass6(org.eclipse.jdt.core.groovy.tests.search.TypeReferenceSearchTests)  Time elapsed: 0.214 s
28-May-2019 18:11:39 testSearchForTypesClass7(org.eclipse.jdt.core.groovy.tests.search.TypeReferenceSearchTests)  Time elapsed: 0.288 s
28-May-2019 18:11:39 testSearchForTypesClosure1(org.eclipse.jdt.core.groovy.tests.search.TypeReferenceSearchTests)  Time elapsed: 0.274 s
28-May-2019 18:11:39 testSearchForTypesClosure2(org.eclipse.jdt.core.groovy.tests.search.TypeReferenceSearchTests)  Time elapsed: 1.132 s
28-May-2019 18:11:39 testSearchForTypesClosure3(org.eclipse.jdt.core.groovy.tests.search.TypeReferenceSearchTests)  Time elapsed: 0.279 s
28-May-2019 18:11:39 testCoercion1(org.eclipse.jdt.core.groovy.tests.search.TypeReferenceSearchTests)  Time elapsed: 0.109 s
28-May-2019 18:11:39 testGenerics1(org.eclipse.jdt.core.groovy.tests.search.TypeReferenceSearchTests)  Time elapsed: 0.065 s
28-May-2019 18:11:39 testFindClassDeclaration(org.eclipse.jdt.core.groovy.tests.search.TypeReferenceSearchTests)  Time elapsed: 0.055 s
28-May-2019 18:11:39 testConstructorWithDefaultArgsInCompileStatic(org.eclipse.jdt.core.groovy.tests.search.TypeReferenceSearchTests)  Time elapsed: 1.38 s
28-May-2019 18:11:39
28-May-2019 18:11:39 Results:
28-May-2019 18:11:39
28-May-2019 18:11:39 Failures:
28-May-2019 18:11:39   BasicGroovyBuildTests.testGRE1773:3422->BuilderTestSuite.expectingCompiledClasses:214->BuilderTestSuite.expectingCompiling:230 unexpected recompiled units. lenExpected=3 lenActual=4 expected:<...st.Class1,test.Class[]2,test.Class3}> but was:<...st.Class1,test.Class[1,test.Class]2,test.Class3}>
28-May-2019 18:11:39   DGMInferencingTests.testDGM15:161->assertExprType:33->InferencingTestSuite.assertType:53->InferencingTestSuite.assertType:85->InferencingTestSuite.assertType:90->InferencingTestSuite.assertType:109 Expected type not found.
28-May-2019 18:11:39 Expected: java.util.Map$Entry<java.lang.String,java.lang.Integer>
28-May-2019 18:11:39 Found: java.lang.Object
28-May-2019 18:11:39 Declaring type: groovy.lang.Closure<V extends java.lang.Object>
28-May-2019 18:11:39 ASTNode: org.codehaus.groovy.ast.expr.VariableExpression@f4ba7[variable: it]
28-May-2019 18:11:39 Confidence: INFERRED
28-May-2019 18:11:39
28-May-2019 18:11:39   Groovy20InferencingTests.testCompileStatic13:193->InferencingTestSuite.assertType:53->InferencingTestSuite.assertType:85->InferencingTestSuite.assertType:90->InferencingTestSuite.assertType:109 Expected type not found.
28-May-2019 18:11:39 Expected: java.lang.Number
28-May-2019 18:11:39 Found: java.lang.String
28-May-2019 18:11:39 Declaring type: X
28-May-2019 18:11:39 ASTNode: org.codehaus.groovy.ast.expr.ConstantExpression@11125f[readOnly]
28-May-2019 18:11:39 Confidence: UNKNOWN
28-May-2019 18:11:39
28-May-2019 18:11:39   OperatorOverloadingInferencingTests.testLongExpr2:325->InferencingTestSuite.assertType:53->InferencingTestSuite.assertType:85->InferencingTestSuite.assertType:90->InferencingTestSuite.assertType:109 Expected type not found.
28-May-2019 18:11:39 Expected: Foo
28-May-2019 18:11:39 Found: java.util.List<Foo>
28-May-2019 18:11:39 Declaring type: Search
28-May-2019 18:11:39 ASTNode: org.codehaus.groovy.ast.expr.VariableExpression@1061bc[variable: xxx]
28-May-2019 18:11:39 Confidence: INFERRED
28-May-2019 18:11:39
28-May-2019 18:11:39 Errors:
28-May-2019 18:11:39   StaticInferencingTests.testClassReference14:139->assertKnown:35->InferencingTestSuite.doVisit:195 » NoClassDefFound
28-May-2019 18:11:39   EnumerationTests.testEnum4438:316->GroovyCompilerTestSuite.runNegativeTest:251->GroovyCompilerTestSuite.runNegativeTest:258 » TestTimedOut
28-May-2019 18:11:39   EnumerationTests.testEnum4438:316->GroovyCompilerTestSuite.runNegativeTest:251->GroovyCompilerTestSuite.runNegativeTest:258 » TestTimedOut
28-May-2019 18:11:39
28-May-2019 18:11:39 Tests run: 5732, Failures: 4, Errors: 3, Skipped: 102
28-May-2019 18:11:39
28-May-2019 18:11:46
28-May-2019 18:11:46 !ENTRY org.eclipse.core.resources 2 10035 2019-05-28 18:11:46.489
28-May-2019 18:11:46 !MESSAGE The workspace will exit with unsaved changes in this session.
28-May-2019 18:11:46 [ERROR] There are test failures.
28-May-2019 18:11:46
28-May-2019 18:11:46 Please refer to /opt/bamboo-home/xml-data/build-dir/GRECLIPSE-E410-JOB1/ide-test/org.codehaus.groovy.alltests/target/surefire-reports for the individual test results.
28-May-2019 18:11:46 [INFO]
28-May-2019 18:11:46 [INFO] --- maven-install-plugin:2.3.1:install (default-install) @ org.codehaus.groovy.alltests ---
28-May-2019 18:11:46 [INFO] Installing /opt/bamboo-home/xml-data/build-dir/GRECLIPSE-E410-JOB1/ide-test/org.codehaus.groovy.alltests/target/org.codehaus.groovy.alltests-3.4.0-SNAPSHOT.jar to /home/bamboo/.m2/repository/org/codehaus/groovy/eclipse/org.codehaus.groovy.alltests/3.4.0-SNAPSHOT/org.codehaus.groovy.alltests-3.4.0-SNAPSHOT.jar
28-May-2019 18:11:46 [INFO] Installing /opt/bamboo-home/xml-data/build-dir/GRECLIPSE-E410-JOB1/ide-test/org.codehaus.groovy.alltests/pom.xml to /home/bamboo/.m2/repository/org/codehaus/groovy/eclipse/org.codehaus.groovy.alltests/3.4.0-SNAPSHOT/org.codehaus.groovy.alltests-3.4.0-SNAPSHOT.pom
28-May-2019 18:11:46 [INFO] Installing /opt/bamboo-home/xml-data/build-dir/GRECLIPSE-E410-JOB1/ide-test/org.codehaus.groovy.alltests/target/org.codehaus.groovy.alltests-3.4.0-SNAPSHOT-sources.jar to /home/bamboo/.m2/repository/org/codehaus/groovy/eclipse/org.codehaus.groovy.alltests/3.4.0-SNAPSHOT/org.codehaus.groovy.alltests-3.4.0-SNAPSHOT-sources.jar
28-May-2019 18:11:46 [INFO] Installing /opt/bamboo-home/xml-data/build-dir/GRECLIPSE-E410-JOB1/ide-test/org.codehaus.groovy.alltests/target/p2content.xml to /home/bamboo/.m2/repository/org/codehaus/groovy/eclipse/org.codehaus.groovy.alltests/3.4.0-SNAPSHOT/org.codehaus.groovy.alltests-3.4.0-SNAPSHOT-p2metadata.xml
28-May-2019 18:11:46 [INFO] Installing /opt/bamboo-home/xml-data/build-dir/GRECLIPSE-E410-JOB1/ide-test/org.codehaus.groovy.alltests/target/p2artifacts.xml to /home/bamboo/.m2/repository/org/codehaus/groovy/eclipse/org.codehaus.groovy.alltests/3.4.0-SNAPSHOT/org.codehaus.groovy.alltests-3.4.0-SNAPSHOT-p2artifacts.xml
28-May-2019 18:11:46 [INFO] Installing /opt/bamboo-home/xml-data/build-dir/GRECLIPSE-E410-JOB1/ide-test/org.codehaus.groovy.alltests/target/p2content.xml to /home/bamboo/.m2/repository/org/codehaus/groovy/eclipse/org.codehaus.groovy.alltests/3.4.0-SNAPSHOT/org.codehaus.groovy.alltests-3.4.0-SNAPSHOT-p2metadata.xml
28-May-2019 18:11:46 [INFO] Installing /opt/bamboo-home/xml-data/build-dir/GRECLIPSE-E410-JOB1/ide-test/org.codehaus.groovy.alltests/target/p2artifacts.xml to /home/bamboo/.m2/repository/org/codehaus/groovy/eclipse/org.codehaus.groovy.alltests/3.4.0-SNAPSHOT/org.codehaus.groovy.alltests-3.4.0-SNAPSHOT-p2artifacts.xml
28-May-2019 18:11:46 [INFO]
28-May-2019 18:11:46 [INFO] --- tycho-p2-plugin:1.3.0:update-local-index (default-update-local-index) @ org.codehaus.groovy.alltests ---
28-May-2019 18:11:46 [INFO]
28-May-2019 18:11:46 [INFO] --- maven-deploy-plugin:2.8.2:deploy (default-deploy) @ org.codehaus.groovy.alltests ---
28-May-2019 18:11:46 [INFO] Skipping artifact deployment
28-May-2019 18:11:46 [INFO]                                                                         
28-May-2019 18:11:46 [INFO] ------------------------------------------------------------------------
28-May-2019 18:11:46 [INFO] Building org.codehaus.groovy.m2eclipse 3.4.0-SNAPSHOT
28-May-2019 18:11:46 [INFO] ------------------------------------------------------------------------
28-May-2019 18:11:46 [INFO]
28-May-2019 18:11:46 [INFO] --- maven-clean-plugin:2.5:clean (default-clean) @ org.codehaus.groovy.m2eclipse ---
28-May-2019 18:11:46 [INFO]
28-May-2019 18:11:46 [INFO] --- tycho-packaging-plugin:1.3.0:build-qualifier (default-build-qualifier) @ org.codehaus.groovy.m2eclipse ---
28-May-2019 18:11:46 [INFO] The project's OSGi version is 3.4.0.v201905281626-e1812
28-May-2019 18:11:46 [INFO]
28-May-2019 18:11:46 [INFO] --- tycho-packaging-plugin:1.3.0:validate-id (default-validate-id) @ org.codehaus.groovy.m2eclipse ---
28-May-2019 18:11:46 [INFO]
28-May-2019 18:11:46 [INFO] --- tycho-packaging-plugin:1.3.0:validate-version (default-validate-version) @ org.codehaus.groovy.m2eclipse ---
28-May-2019 18:11:46 [INFO]
28-May-2019 18:11:46 [INFO] --- properties-maven-plugin:1.0.0:read-project-properties (default) @ org.codehaus.groovy.m2eclipse ---
28-May-2019 18:11:46 [INFO]
28-May-2019 18:11:46 [INFO] --- maven-resources-plugin:2.4.3:resources (default-resources) @ org.codehaus.groovy.m2eclipse ---
28-May-2019 18:11:46 [INFO] Using 'UTF-8' encoding to copy filtered resources.
28-May-2019 18:11:46 [INFO] skip non existing resourceDirectory /opt/bamboo-home/xml-data/build-dir/GRECLIPSE-E410-JOB1/extras/org.codehaus.groovy.m2eclipse/src/main/resources
28-May-2019 18:11:46 [INFO]
28-May-2019 18:11:46 [INFO] --- tycho-compiler-plugin:1.3.0:compile (default-compile) @ org.codehaus.groovy.m2eclipse ---
28-May-2019 18:11:46 [INFO] Compiling 2 source files to /opt/bamboo-home/xml-data/build-dir/GRECLIPSE-E410-JOB1/extras/org.codehaus.groovy.m2eclipse/target/classes
28-May-2019 18:11:46 [INFO]
28-May-2019 18:11:46 [INFO] --- maven-resources-plugin:2.4.3:testResources (default-testResources) @ org.codehaus.groovy.m2eclipse ---
28-May-2019 18:11:46 [INFO] Using 'UTF-8' encoding to copy filtered resources.
28-May-2019 18:11:46 [INFO] skip non existing resourceDirectory /opt/bamboo-home/xml-data/build-dir/GRECLIPSE-E410-JOB1/extras/org.codehaus.groovy.m2eclipse/src/test/resources
28-May-2019 18:11:46 [INFO]
28-May-2019 18:11:46 [INFO] --- tycho-source-plugin:1.3.0:plugin-source (plugin-source) @ org.codehaus.groovy.m2eclipse ---
28-May-2019 18:11:46 [INFO] Building jar: /opt/bamboo-home/xml-data/build-dir/GRECLIPSE-E410-JOB1/extras/org.codehaus.groovy.m2eclipse/target/org.codehaus.groovy.m2eclipse-3.4.0-SNAPSHOT-sources.jar
28-May-2019 18:11:46 [INFO]
28-May-2019 18:11:46 [INFO] --- target-platform-configuration:1.3.0:target-platform (default-target-platform) @ org.codehaus.groovy.m2eclipse ---
28-May-2019 18:11:46 [INFO]
28-May-2019 18:11:46 [INFO] --- tycho-packaging-plugin:1.3.0:package-plugin (default-package-plugin) @ org.codehaus.groovy.m2eclipse ---
28-May-2019 18:11:46 [INFO] Building jar: /opt/bamboo-home/xml-data/build-dir/GRECLIPSE-E410-JOB1/extras/org.codehaus.groovy.m2eclipse/target/org.codehaus.groovy.m2eclipse-3.4.0-SNAPSHOT.jar
28-May-2019 18:11:46 [INFO]
28-May-2019 18:11:46 [INFO] --- tycho-p2-plugin:1.3.0:p2-metadata-default (default-p2-metadata-default) @ org.codehaus.groovy.m2eclipse ---
28-May-2019 18:11:47 [INFO]
28-May-2019 18:11:47 [INFO] --- maven-jarsigner-plugin:1.4:sign (sign) @ org.codehaus.groovy.m2eclipse ---
28-May-2019 18:11:47 [INFO] 2 archive(s) processed
28-May-2019 18:11:47 [INFO]
28-May-2019 18:11:47 [INFO] --- tycho-source-feature-plugin:1.3.0:source-feature (source-feature) @ org.codehaus.groovy.m2eclipse ---
28-May-2019 18:11:47 [INFO]
28-May-2019 18:11:47 [INFO] --- tycho-p2-plugin:1.3.0:p2-metadata (attach-p2-metadata) @ org.codehaus.groovy.m2eclipse ---
28-May-2019 18:11:47 [INFO]
28-May-2019 18:11:47 [INFO] --- maven-install-plugin:2.3.1:install (default-install) @ org.codehaus.groovy.m2eclipse ---
28-May-2019 18:11:47 [INFO] Installing /opt/bamboo-home/xml-data/build-dir/GRECLIPSE-E410-JOB1/extras/org.codehaus.groovy.m2eclipse/target/org.codehaus.groovy.m2eclipse-3.4.0-SNAPSHOT.jar to /home/bamboo/.m2/repository/org/codehaus/groovy/eclipse/org.codehaus.groovy.m2eclipse/3.4.0-SNAPSHOT/org.codehaus.groovy.m2eclipse-3.4.0-SNAPSHOT.jar
28-May-2019 18:11:47 [INFO] Installing /opt/bamboo-home/xml-data/build-dir/GRECLIPSE-E410-JOB1/extras/org.codehaus.groovy.m2eclipse/pom.xml to /home/bamboo/.m2/repository/org/codehaus/groovy/eclipse/org.codehaus.groovy.m2eclipse/3.4.0-SNAPSHOT/org.codehaus.groovy.m2eclipse-3.4.0-SNAPSHOT.pom
28-May-2019 18:11:47 [INFO] Installing /opt/bamboo-home/xml-data/build-dir/GRECLIPSE-E410-JOB1/extras/org.codehaus.groovy.m2eclipse/target/org.codehaus.groovy.m2eclipse-3.4.0-SNAPSHOT-sources.jar to /home/bamboo/.m2/repository/org/codehaus/groovy/eclipse/org.codehaus.groovy.m2eclipse/3.4.0-SNAPSHOT/org.codehaus.groovy.m2eclipse-3.4.0-SNAPSHOT-sources.jar
28-May-2019 18:11:47 [INFO] Installing /opt/bamboo-home/xml-data/build-dir/GRECLIPSE-E410-JOB1/extras/org.codehaus.groovy.m2eclipse/target/p2content.xml to /home/bamboo/.m2/repository/org/codehaus/groovy/eclipse/org.codehaus.groovy.m2eclipse/3.4.0-SNAPSHOT/org.codehaus.groovy.m2eclipse-3.4.0-SNAPSHOT-p2metadata.xml
28-May-2019 18:11:47 [INFO] Installing /opt/bamboo-home/xml-data/build-dir/GRECLIPSE-E410-JOB1/extras/org.codehaus.groovy.m2eclipse/target/p2artifacts.xml to /home/bamboo/.m2/repository/org/codehaus/groovy/eclipse/org.codehaus.groovy.m2eclipse/3.4.0-SNAPSHOT/org.codehaus.groovy.m2eclipse-3.4.0-SNAPSHOT-p2artifacts.xml
28-May-2019 18:11:47 [INFO] Installing /opt/bamboo-home/xml-data/build-dir/GRECLIPSE-E410-JOB1/extras/org.codehaus.groovy.m2eclipse/target/p2content.xml to /home/bamboo/.m2/repository/org/codehaus/groovy/eclipse/org.codehaus.groovy.m2eclipse/3.4.0-SNAPSHOT/org.codehaus.groovy.m2eclipse-3.4.0-SNAPSHOT-p2metadata.xml
28-May-2019 18:11:47 [INFO] Installing /opt/bamboo-home/xml-data/build-dir/GRECLIPSE-E410-JOB1/extras/org.codehaus.groovy.m2eclipse/target/p2artifacts.xml to /home/bamboo/.m2/repository/org/codehaus/groovy/eclipse/org.codehaus.groovy.m2eclipse/3.4.0-SNAPSHOT/org.codehaus.groovy.m2eclipse-3.4.0-SNAPSHOT-p2artifacts.xml
28-May-2019 18:11:47 [INFO]
28-May-2019 18:11:47 [INFO] --- tycho-p2-plugin:1.3.0:update-local-index (default-update-local-index) @ org.codehaus.groovy.m2eclipse ---
28-May-2019 18:11:47 [INFO]
28-May-2019 18:11:47 [INFO] --- maven-deploy-plugin:2.8.2:deploy (default-deploy) @ org.codehaus.groovy.m2eclipse ---
28-May-2019 18:11:47 [INFO] Skipping artifact deployment
28-May-2019 18:11:47 [INFO]                                                                         
28-May-2019 18:11:47 [INFO] ------------------------------------------------------------------------
28-May-2019 18:11:47 [INFO] Building org.codehaus.groovy.m2eclipse.feature 3.4.0-SNAPSHOT
28-May-2019 18:11:47 [INFO] ------------------------------------------------------------------------
28-May-2019 18:11:47 [INFO]
28-May-2019 18:11:47 [INFO] --- maven-clean-plugin:2.5:clean (default-clean) @ org.codehaus.groovy.m2eclipse.feature ---
28-May-2019 18:11:47 [INFO] Deleting /opt/bamboo-home/xml-data/build-dir/GRECLIPSE-E410-JOB1/extras/Feature-org.codehaus.groovy.m2eclipse/target
28-May-2019 18:11:47 [INFO]
28-May-2019 18:11:47 [INFO] --- tycho-packaging-plugin:1.3.0:build-qualifier-aggregator (default-build-qualifier-aggregator) @ org.codehaus.groovy.m2eclipse.feature ---
28-May-2019 18:11:47 [INFO] The project's OSGi version is 3.4.0.v201905281626-e1812
28-May-2019 18:11:47 [INFO]
28-May-2019 18:11:47 [INFO] --- tycho-packaging-plugin:1.3.0:validate-id (default-validate-id) @ org.codehaus.groovy.m2eclipse.feature ---
28-May-2019 18:11:47 [INFO]
28-May-2019 18:11:47 [INFO] --- tycho-packaging-plugin:1.3.0:validate-version (default-validate-version) @ org.codehaus.groovy.m2eclipse.feature ---
28-May-2019 18:11:47 [INFO]
28-May-2019 18:11:47 [INFO] --- properties-maven-plugin:1.0.0:read-project-properties (default) @ org.codehaus.groovy.m2eclipse.feature ---
28-May-2019 18:11:47 [INFO]
28-May-2019 18:11:47 [INFO] --- tycho-source-plugin:1.3.0:plugin-source (plugin-source) @ org.codehaus.groovy.m2eclipse.feature ---
28-May-2019 18:11:47 [INFO]
28-May-2019 18:11:47 [INFO] --- target-platform-configuration:1.3.0:target-platform (default-target-platform) @ org.codehaus.groovy.m2eclipse.feature ---
28-May-2019 18:11:47 [INFO]
28-May-2019 18:11:47 [INFO] --- tycho-packaging-plugin:1.3.0:package-feature (default-package-feature) @ org.codehaus.groovy.m2eclipse.feature ---
28-May-2019 18:11:47 [INFO] Building jar: /opt/bamboo-home/xml-data/build-dir/GRECLIPSE-E410-JOB1/extras/Feature-org.codehaus.groovy.m2eclipse/target/org.codehaus.groovy.m2eclipse.feature-3.4.0-SNAPSHOT.jar
28-May-2019 18:11:47 [INFO]
28-May-2019 18:11:47 [INFO] --- tycho-p2-plugin:1.3.0:p2-metadata-default (default-p2-metadata-default) @ org.codehaus.groovy.m2eclipse.feature ---
28-May-2019 18:11:47 [INFO]
28-May-2019 18:11:47 [INFO] --- tycho-p2-plugin:1.3.0:feature-p2-metadata (default-feature-p2-metadata) @ org.codehaus.groovy.m2eclipse.feature ---
28-May-2019 18:11:47 [INFO]
28-May-2019 18:11:47 [INFO] --- maven-jarsigner-plugin:1.4:sign (sign) @ org.codehaus.groovy.m2eclipse.feature ---
28-May-2019 18:11:48 [INFO] 1 archive(s) processed
28-May-2019 18:11:48 [INFO]
28-May-2019 18:11:48 [INFO] --- tycho-source-feature-plugin:1.3.0:source-feature (source-feature) @ org.codehaus.groovy.m2eclipse.feature ---
28-May-2019 18:11:48 [INFO] Building jar: /opt/bamboo-home/xml-data/build-dir/GRECLIPSE-E410-JOB1/extras/Feature-org.codehaus.groovy.m2eclipse/target/org.codehaus.groovy.m2eclipse.feature-3.4.0-SNAPSHOT-sources-feature.jar
28-May-2019 18:11:48 [INFO]
28-May-2019 18:11:48 [INFO] --- tycho-p2-plugin:1.3.0:p2-metadata (attach-p2-metadata) @ org.codehaus.groovy.m2eclipse.feature ---
28-May-2019 18:11:48 [INFO]
28-May-2019 18:11:48 [INFO] --- maven-install-plugin:2.3.1:install (default-install) @ org.codehaus.groovy.m2eclipse.feature ---
28-May-2019 18:11:48 [INFO] Installing /opt/bamboo-home/xml-data/build-dir/GRECLIPSE-E410-JOB1/extras/Feature-org.codehaus.groovy.m2eclipse/target/org.codehaus.groovy.m2eclipse.feature-3.4.0-SNAPSHOT.jar to /home/bamboo/.m2/repository/org/codehaus/groovy/eclipse/org.codehaus.groovy.m2eclipse.feature/3.4.0-SNAPSHOT/org.codehaus.groovy.m2eclipse.feature-3.4.0-SNAPSHOT.jar
28-May-2019 18:11:48 [INFO] Installing /opt/bamboo-home/xml-data/build-dir/GRECLIPSE-E410-JOB1/extras/Feature-org.codehaus.groovy.m2eclipse/pom.xml to /home/bamboo/.m2/repository/org/codehaus/groovy/eclipse/org.codehaus.groovy.m2eclipse.feature/3.4.0-SNAPSHOT/org.codehaus.groovy.m2eclipse.feature-3.4.0-SNAPSHOT.pom
28-May-2019 18:11:48 [INFO] Installing /opt/bamboo-home/xml-data/build-dir/GRECLIPSE-E410-JOB1/extras/Feature-org.codehaus.groovy.m2eclipse/target/p2content.xml to /home/bamboo/.m2/repository/org/codehaus/groovy/eclipse/org.codehaus.groovy.m2eclipse.feature/3.4.0-SNAPSHOT/org.codehaus.groovy.m2eclipse.feature-3.4.0-SNAPSHOT-p2metadata.xml
28-May-2019 18:11:48 [INFO] Installing /opt/bamboo-home/xml-data/build-dir/GRECLIPSE-E410-JOB1/extras/Feature-org.codehaus.groovy.m2eclipse/target/p2artifacts.xml to /home/bamboo/.m2/repository/org/codehaus/groovy/eclipse/org.codehaus.groovy.m2eclipse.feature/3.4.0-SNAPSHOT/org.codehaus.groovy.m2eclipse.feature-3.4.0-SNAPSHOT-p2artifacts.xml
28-May-2019 18:11:48 [INFO] Installing /opt/bamboo-home/xml-data/build-dir/GRECLIPSE-E410-JOB1/extras/Feature-org.codehaus.groovy.m2eclipse/target/org.codehaus.groovy.m2eclipse.feature-3.4.0-SNAPSHOT-sources-feature.jar to /home/bamboo/.m2/repository/org/codehaus/groovy/eclipse/org.codehaus.groovy.m2eclipse.feature/3.4.0-SNAPSHOT/org.codehaus.groovy.m2eclipse.feature-3.4.0-SNAPSHOT-sources-feature.jar
28-May-2019 18:11:48 [INFO] Installing /opt/bamboo-home/xml-data/build-dir/GRECLIPSE-E410-JOB1/extras/Feature-org.codehaus.groovy.m2eclipse/target/p2content.xml to /home/bamboo/.m2/repository/org/codehaus/groovy/eclipse/org.codehaus.groovy.m2eclipse.feature/3.4.0-SNAPSHOT/org.codehaus.groovy.m2eclipse.feature-3.4.0-SNAPSHOT-p2metadata.xml
28-May-2019 18:11:48 [INFO] Installing /opt/bamboo-home/xml-data/build-dir/GRECLIPSE-E410-JOB1/extras/Feature-org.codehaus.groovy.m2eclipse/target/p2artifacts.xml to /home/bamboo/.m2/repository/org/codehaus/groovy/eclipse/org.codehaus.groovy.m2eclipse.feature/3.4.0-SNAPSHOT/org.codehaus.groovy.m2eclipse.feature-3.4.0-SNAPSHOT-p2artifacts.xml
28-May-2019 18:11:48 [INFO]
28-May-2019 18:11:48 [INFO] --- tycho-p2-plugin:1.3.0:update-local-index (default-update-local-index) @ org.codehaus.groovy.m2eclipse.feature ---
28-May-2019 18:11:48 [INFO]
28-May-2019 18:11:48 [INFO] --- maven-deploy-plugin:2.8.2:deploy (default-deploy) @ org.codehaus.groovy.m2eclipse.feature ---
28-May-2019 18:11:48 [INFO] Skipping artifact deployment
28-May-2019 18:11:48 [INFO]                                                                         
28-May-2019 18:11:48 [INFO] ------------------------------------------------------------------------
28-May-2019 18:11:48 [INFO] Building org.codehaus.groovy.eclipse.site 3.4.0-SNAPSHOT
28-May-2019 18:11:48 [INFO] ------------------------------------------------------------------------
28-May-2019 18:11:48 [INFO]
28-May-2019 18:11:48 [INFO] --- maven-clean-plugin:2.5:clean (default-clean) @ org.codehaus.groovy.eclipse.site ---
28-May-2019 18:11:48 [INFO]
28-May-2019 18:11:48 [INFO] --- tycho-packaging-plugin:1.3.0:build-qualifier (default-build-qualifier) @ org.codehaus.groovy.eclipse.site ---
28-May-2019 18:11:48 [INFO] The project's OSGi version is 3.4.0.v201905281626-e1812
28-May-2019 18:11:48 [INFO]
28-May-2019 18:11:48 [INFO] --- properties-maven-plugin:1.0.0:read-project-properties (default) @ org.codehaus.groovy.eclipse.site ---
28-May-2019 18:11:48 [INFO]
28-May-2019 18:11:48 [INFO] --- tycho-source-plugin:1.3.0:plugin-source (plugin-source) @ org.codehaus.groovy.eclipse.site ---
28-May-2019 18:11:48 [INFO]
28-May-2019 18:11:48 [INFO] --- tycho-packaging-plugin:1.3.0:update-site (default-update-site) @ org.codehaus.groovy.eclipse.site ---
28-May-2019 18:11:48 [INFO]
28-May-2019 18:11:48 [INFO] --- tycho-p2-plugin:1.3.0:update-site-p2-metadata (default-update-site-p2-metadata) @ org.codehaus.groovy.eclipse.site ---
28-May-2019 18:11:48 [INFO] Command line:
28-May-2019 18:11:48         [/opt/jdk8u212-b03/jre/bin/java, -jar, /opt/users/bamboo/.m2/repository/org/eclipse/tycho/tycho-bundles-external/1.3.0/eclipse/plugins/org.eclipse.equinox.launcher_1.5.0.v20180512-1130.jar, -configuration, /tmp/GRECLIPSE-E410-JOB1/tycho-p2-runtime2851919318964719403.tmp/configuration, -nosplash, -application, org.eclipse.equinox.p2.publisher.UpdateSitePublisher, -source, /opt/bamboo-home/xml-data/build-dir/GRECLIPSE-E410-JOB1/Site-org.codehaus.groovy.eclipse/target/site, -metadataRepository, file:/opt/bamboo-home/xml-data/build-dir/GRECLIPSE-E410-JOB1/Site-org.codehaus.groovy.eclipse/target/site/, -metadataRepositoryName, org.codehaus.groovy.eclipse.site, -artifactRepository, file:/opt/bamboo-home/xml-data/build-dir/GRECLIPSE-E410-JOB1/Site-org.codehaus.groovy.eclipse/target/site/, -artifactRepositoryName, org.codehaus.groovy.eclipse.site Artifacts, -noDefaultIUs, -compress]
28-May-2019 18:11:49 Generating metadata for ..
28-May-2019 18:11:50 Generation completed with success [0 seconds].
28-May-2019 18:11:50 [INFO]
28-May-2019 18:11:50 [INFO] --- tycho-packaging-plugin:1.3.0:update-site-packaging (default-update-site-packaging) @ org.codehaus.groovy.eclipse.site ---
28-May-2019 18:11:50 [INFO] Building zip: /opt/bamboo-home/xml-data/build-dir/GRECLIPSE-E410-JOB1/Site-org.codehaus.groovy.eclipse/target/site.zip
28-May-2019 18:11:50 [INFO]
28-May-2019 18:11:50 [INFO] --- maven-jarsigner-plugin:1.4:sign (sign) @ org.codehaus.groovy.eclipse.site ---
28-May-2019 18:11:50 [INFO] 1 archive(s) processed
28-May-2019 18:11:50 [INFO]
28-May-2019 18:11:50 [INFO] --- tycho-source-feature-plugin:1.3.0:source-feature (source-feature) @ org.codehaus.groovy.eclipse.site ---
28-May-2019 18:11:50 [INFO]
28-May-2019 18:11:50 [INFO] --- tycho-p2-plugin:1.3.0:p2-metadata (attach-p2-metadata) @ org.codehaus.groovy.eclipse.site ---
28-May-2019 18:11:50 [INFO]
28-May-2019 18:11:50 [INFO] --- maven-install-plugin:2.3.1:install (default-install) @ org.codehaus.groovy.eclipse.site ---
28-May-2019 18:11:50 [INFO] Installing /opt/bamboo-home/xml-data/build-dir/GRECLIPSE-E410-JOB1/Site-org.codehaus.groovy.eclipse/target/site.zip to /home/bamboo/.m2/repository/org/codehaus/groovy/eclipse/org.codehaus.groovy.eclipse.site/3.4.0-SNAPSHOT/org.codehaus.groovy.eclipse.site-3.4.0-SNAPSHOT.zip
28-May-2019 18:11:50 [INFO] Installing /opt/bamboo-home/xml-data/build-dir/GRECLIPSE-E410-JOB1/Site-org.codehaus.groovy.eclipse/pom.xml to /home/bamboo/.m2/repository/org/codehaus/groovy/eclipse/org.codehaus.groovy.eclipse.site/3.4.0-SNAPSHOT/org.codehaus.groovy.eclipse.site-3.4.0-SNAPSHOT.pom
28-May-2019 18:11:50 [INFO]
28-May-2019 18:11:50 [INFO] --- maven-deploy-plugin:2.8.2:deploy (default-deploy) @ org.codehaus.groovy.eclipse.site ---
28-May-2019 18:11:50 [INFO] Skipping artifact deployment
28-May-2019 18:11:50 [INFO]
28-May-2019 18:11:50 [INFO] --- maven-antrun-plugin:1.8:run (upload-dist) @ org.codehaus.groovy.eclipse.site ---
28-May-2019 18:11:51 [INFO] Executing tasks
28-May-2019 18:11:51
28-May-2019 18:11:51 main:
28-May-2019 18:11:51      [echo] Uploading main update site to s3..."
28-May-2019 18:11:51      [echo] ==== dist props are set so we can deploy? ===
28-May-2019 18:11:51      [echo] bamboo.s3.properties=${bamboo.s3.properties}
28-May-2019 18:11:51      [echo] dist_properties=/home/bamboo/tools/s3.properties
28-May-2019 18:11:51      [echo] env.bamboo_s3_properties_rel=/home/bamboo/tools/s3.properties
28-May-2019 18:11:51      [echo] dist.accessKey=AKIAJKUKWKYLMXOFIFDA
28-May-2019 18:11:51      [echo] accessKey=AKIA6I3ZT3GJ2UDU5GRG
28-May-2019 18:11:51      [echo] site.target.dir=/opt/bamboo-home/xml-data/build-dir/GRECLIPSE-E410-JOB1/Site-org.codehaus.groovy.eclipse/target
28-May-2019 18:11:51      [echo] unqualifiedVersion=3.4.0
28-May-2019 18:11:51      [echo] buildQualifier=v201905281626-e1812
28-May-2019 18:11:51      [echo] dist.full.version=3.4.0.v201905281626-e1812
28-May-2019 18:11:51      [echo] dist.file.name=org.codehaus.groovy-3.4.0.v201905281626-e1812-updatesite.zip
28-May-2019 18:11:51       [zip] Building zip: /opt/bamboo-home/xml-data/build-dir/GRECLIPSE-E410-JOB1/Site-org.codehaus.groovy.eclipse/target/site/org.codehaus.groovy-3.4.0.v201905281626-e1812-updatesite.zip
28-May-2019 18:11:54      [echo] Preparing for upload... This will happen:
28-May-2019 18:11:54      [echo] Will Delete:
28-May-2019 18:11:54      [echo] dist.bucket=dist.springsource.org
28-May-2019 18:11:54      [echo] dist.path=snapshot/GRECLIPSE/e4.10
28-May-2019 18:11:54      [echo] Will Upload:
28-May-2019 18:11:54      [echo] dist.bucket=dist.springsource.org
28-May-2019 18:11:54      [echo] fromDir=/opt/bamboo-home/xml-data/build-dir/GRECLIPSE-E410-JOB1/Site-org.codehaus.groovy.eclipse/target/site
28-May-2019 18:11:54      [echo] toDir=snapshot/GRECLIPSE/e4.10
28-May-2019 18:11:54      [echo] Will Upload:
28-May-2019 18:11:54      [echo] dist.bucket=dist.springsource.org
28-May-2019 18:11:54      [echo] fromFile=/opt/bamboo-home/xml-data/build-dir/GRECLIPSE-E410-JOB1/Site-org.codehaus.groovy.eclipse/target/site/org.codehaus.groovy-3.4.0.v201905281626-e1812-updatesite.zip
28-May-2019 18:11:54      [echo] toFile=snapshot/GRECLIPSE/e4.10/org.codehaus.groovy-3.4.0.v201905281626-e1812-updatesite.zip
28-May-2019 18:11:54      [echo] metadata project.name=Groovy Eclipse
28-May-2019 18:11:54      [echo] metadata release.type=snapshot
28-May-2019 18:11:54      [echo] metadata bundle.version=3.4.0.v201905281626-e1812
28-May-2019 18:11:54      [echo] metadata package.file.name=org.codehaus.groovy-3.4.0.v201905281626-e1812-updatesite.zip
28-May-2019 18:11:55 Deleted s3://dist.springsource.org/snapshot/GRECLIPSE/e4.10/artifacts.jar
28-May-2019 18:11:55 Deleted s3://dist.springsource.org/snapshot/GRECLIPSE/e4.10/content.jar
28-May-2019 18:11:55 Deleted s3://dist.springsource.org/snapshot/GRECLIPSE/e4.10/features/
28-May-2019 18:11:55 Deleted s3://dist.springsource.org/snapshot/GRECLIPSE/e4.10/features/org.codehaus.groovy.compilerless.feature_3.4.0.v201905281423-e1812.jar
28-May-2019 18:11:55 Deleted s3://dist.springsource.org/snapshot/GRECLIPSE/e4.10/features/org.codehaus.groovy.eclipse.feature_3.4.0.v201905281423-e1812.jar
28-May-2019 18:11:56 Deleted s3://dist.springsource.org/snapshot/GRECLIPSE/e4.10/features/org.codehaus.groovy.headless.feature_3.4.0.v201905281423-e1812.jar
28-May-2019 18:11:56 Deleted s3://dist.springsource.org/snapshot/GRECLIPSE/e4.10/features/org.codehaus.groovy.jdt.patch_3.4.0.v201905281423-e1812.jar
28-May-2019 18:11:56 Deleted s3://dist.springsource.org/snapshot/GRECLIPSE/e4.10/features/org.codehaus.groovy.m2eclipse.feature_3.4.0.v201905281423-e1812.jar
28-May-2019 18:11:56 Deleted s3://dist.springsource.org/snapshot/GRECLIPSE/e4.10/features/org.codehaus.groovy24.feature_3.4.0.v201905281423-e1812.jar
28-May-2019 18:11:56 Deleted s3://dist.springsource.org/snapshot/GRECLIPSE/e4.10/features/org.codehaus.groovy25.feature_3.4.0.v201905281423-e1812.jar
28-May-2019 18:11:56 Deleted s3://dist.springsource.org/snapshot/GRECLIPSE/e4.10/features/org.codehaus.groovy30.feature_3.4.0.v201905281423-e1812.jar
28-May-2019 18:11:56 Deleted s3://dist.springsource.org/snapshot/GRECLIPSE/e4.10/plugins/
28-May-2019 18:11:56 Deleted s3://dist.springsource.org/snapshot/GRECLIPSE/e4.10/plugins/org.codehaus.groovy.eclipse.ant_3.4.0.v201905281423-e1812.jar
28-May-2019 18:11:56 Deleted s3://dist.springsource.org/snapshot/GRECLIPSE/e4.10/plugins/org.codehaus.groovy.eclipse.astviews_3.4.0.v201905281423-e1812.jar
28-May-2019 18:11:56 Deleted s3://dist.springsource.org/snapshot/GRECLIPSE/e4.10/plugins/org.codehaus.groovy.eclipse.codeassist_3.4.0.v201905281423-e1812.jar
28-May-2019 18:11:57 Deleted s3://dist.springsource.org/snapshot/GRECLIPSE/e4.10/plugins/org.codehaus.groovy.eclipse.codebrowsing_3.4.0.v201905281423-e1812.jar
28-May-2019 18:11:57 Deleted s3://dist.springsource.org/snapshot/GRECLIPSE/e4.10/plugins/org.codehaus.groovy.eclipse.compilerResolver_3.4.0.v201905281423-e1812.jar
28-May-2019 18:11:57 Deleted s3://dist.springsource.org/snapshot/GRECLIPSE/e4.10/plugins/org.codehaus.groovy.eclipse.core_3.4.0.v201905281423-e1812.jar
28-May-2019 18:11:57 Deleted s3://dist.springsource.org/snapshot/GRECLIPSE/e4.10/plugins/org.codehaus.groovy.eclipse.dsl_3.4.0.v201905281423-e1812.jar
28-May-2019 18:11:57 Deleted s3://dist.springsource.org/snapshot/GRECLIPSE/e4.10/plugins/org.codehaus.groovy.eclipse.quickfix_3.4.0.v201905281423-e1812.jar
28-May-2019 18:11:57 Deleted s3://dist.springsource.org/snapshot/GRECLIPSE/e4.10/plugins/org.codehaus.groovy.eclipse.refactoring_3.4.0.v201905281423-e1812.jar
28-May-2019 18:11:57 Deleted s3://dist.springsource.org/snapshot/GRECLIPSE/e4.10/plugins/org.codehaus.groovy.eclipse.ui_3.4.0.v201905281423-e1812.jar
28-May-2019 18:11:57 Deleted s3://dist.springsource.org/snapshot/GRECLIPSE/e4.10/plugins/org.codehaus.groovy.eclipse_3.4.0.v201905281423-e1812.jar
28-May-2019 18:11:57 Deleted s3://dist.springsource.org/snapshot/GRECLIPSE/e4.10/plugins/org.codehaus.groovy.m2eclipse_3.4.0.v201905281423-e1812.jar
28-May-2019 18:11:57 Deleted s3://dist.springsource.org/snapshot/GRECLIPSE/e4.10/plugins/org.codehaus.groovy_2.4.17.v201905281423-e1812.jar
28-May-2019 18:11:58 Deleted s3://dist.springsource.org/snapshot/GRECLIPSE/e4.10/plugins/org.codehaus.groovy_2.5.7.v201905281423-e1812.jar
28-May-2019 18:11:58 Deleted s3://dist.springsource.org/snapshot/GRECLIPSE/e4.10/plugins/org.codehaus.groovy_3.0.0.v201905281423-e1812.jar
28-May-2019 18:11:58 Deleted s3://dist.springsource.org/snapshot/GRECLIPSE/e4.10/plugins/org.eclipse.jdt.core_3.16.0.v201905281423-e1812.jar
28-May-2019 18:11:58 Deleted s3://dist.springsource.org/snapshot/GRECLIPSE/e4.10/plugins/org.eclipse.jdt.groovy.core_3.4.0.v201905281423-e1812.jar
28-May-2019 18:11:58 Deleted s3://dist.springsource.org/snapshot/GRECLIPSE/e4.10/site.xml
28-May-2019 18:11:58 Uploading /opt/bamboo-home/xml-data/build-dir/GRECLIPSE-E410-JOB1/Site-org.codehaus.groovy.eclipse/target/site/artifacts.jar (2.8 KB) to s3://dist.springsource.org/snapshot/GRECLIPSE/e4.10/artifacts.jar
28-May-2019 18:11:58 Transfer Time: .2 s - Transfer Rate: 16.4 KB/s
28-May-2019 18:11:59 Uploading /opt/bamboo-home/xml-data/build-dir/GRECLIPSE-E410-JOB1/Site-org.codehaus.groovy.eclipse/target/site/content.jar (13.3 KB) to s3://dist.springsource.org/snapshot/GRECLIPSE/e4.10/content.jar
28-May-2019 18:11:59 Transfer Time: .2 s - Transfer Rate: 69.1 KB/s
28-May-2019 18:11:59 Uploading /opt/bamboo-home/xml-data/build-dir/GRECLIPSE-E410-JOB1/Site-org.codehaus.groovy.eclipse/target/site/features/org.codehaus.groovy.compilerless.feature_3.4.0.v201905281626-e1812.jar (15.0 KB) to s3://dist.springsource.org/snapshot/GRECLIPSE/e4.10/features/org.codehaus.groovy.compilerless.feature_3.4.0.v201905281626-e1812.jar
28-May-2019 18:12:00 Transfer Time: .2 s - Transfer Rate: 76.0 KB/s
28-May-2019 18:12:00 Uploading /opt/bamboo-home/xml-data/build-dir/GRECLIPSE-E410-JOB1/Site-org.codehaus.groovy.eclipse/target/site/features/org.codehaus.groovy.eclipse.feature_3.4.0.v201905281626-e1812.jar (14.9 KB) to s3://dist.springsource.org/snapshot/GRECLIPSE/e4.10/features/org.codehaus.groovy.eclipse.feature_3.4.0.v201905281626-e1812.jar
28-May-2019 18:12:00 Transfer Time: .2 s - Transfer Rate: 88.7 KB/s
28-May-2019 18:12:01 Uploading /opt/bamboo-home/xml-data/build-dir/GRECLIPSE-E410-JOB1/Site-org.codehaus.groovy.eclipse/target/site/features/org.codehaus.groovy.headless.feature_3.4.0.v201905281626-e1812.jar (14.9 KB) to s3://dist.springsource.org/snapshot/GRECLIPSE/e4.10/features/org.codehaus.groovy.headless.feature_3.4.0.v201905281626-e1812.jar
28-May-2019 18:12:01 Transfer Time: .2 s - Transfer Rate: 87.7 KB/s
28-May-2019 18:12:01 Uploading /opt/bamboo-home/xml-data/build-dir/GRECLIPSE-E410-JOB1/Site-org.codehaus.groovy.eclipse/target/site/features/org.codehaus.groovy.jdt.patch_3.4.0.v201905281626-e1812.jar (9.3 KB) to s3://dist.springsource.org/snapshot/GRECLIPSE/e4.10/features/org.codehaus.groovy.jdt.patch_3.4.0.v201905281626-e1812.jar
28-May-2019 18:12:02 Transfer Time: .2 s - Transfer Rate: 52.6 KB/s
28-May-2019 18:12:02 Uploading /opt/bamboo-home/xml-data/build-dir/GRECLIPSE-E410-JOB1/Site-org.codehaus.groovy.eclipse/target/site/features/org.codehaus.groovy.m2eclipse.feature_3.4.0.v201905281626-e1812.jar (14.9 KB) to s3://dist.springsource.org/snapshot/GRECLIPSE/e4.10/features/org.codehaus.groovy.m2eclipse.feature_3.4.0.v201905281626-e1812.jar
28-May-2019 18:12:02 Transfer Time: .2 s - Transfer Rate: 71.3 KB/s
28-May-2019 18:12:03 Uploading /opt/bamboo-home/xml-data/build-dir/GRECLIPSE-E410-JOB1/Site-org.codehaus.groovy.eclipse/target/site/features/org.codehaus.groovy24.feature_3.4.0.v201905281626-e1812.jar (14.8 KB) to s3://dist.springsource.org/snapshot/GRECLIPSE/e4.10/features/org.codehaus.groovy24.feature_3.4.0.v201905281626-e1812.jar
28-May-2019 18:12:03 Transfer Time: .2 s - Transfer Rate: 88.3 KB/s
28-May-2019 18:12:03 Uploading /opt/bamboo-home/xml-data/build-dir/GRECLIPSE-E410-JOB1/Site-org.codehaus.groovy.eclipse/target/site/features/org.codehaus.groovy25.feature_3.4.0.v201905281626-e1812.jar (14.8 KB) to s3://dist.springsource.org/snapshot/GRECLIPSE/e4.10/features/org.codehaus.groovy25.feature_3.4.0.v201905281626-e1812.jar
28-May-2019 18:12:03 Transfer Time: .2 s - Transfer Rate: 85.3 KB/s
28-May-2019 18:12:04 Uploading /opt/bamboo-home/xml-data/build-dir/GRECLIPSE-E410-JOB1/Site-org.codehaus.groovy.eclipse/target/site/features/org.codehaus.groovy30.feature_3.4.0.v201905281626-e1812.jar (14.8 KB) to s3://dist.springsource.org/snapshot/GRECLIPSE/e4.10/features/org.codehaus.groovy30.feature_3.4.0.v201905281626-e1812.jar
28-May-2019 18:12:04 Transfer Time: .2 s - Transfer Rate: 78.5 KB/s
28-May-2019 18:12:04 Uploading /opt/bamboo-home/xml-data/build-dir/GRECLIPSE-E410-JOB1/Site-org.codehaus.groovy.eclipse/target/site/org.codehaus.groovy-3.4.0.v201905281626-e1812-updatesite.zip.md5 (.0 KB) to s3://dist.springsource.org/snapshot/GRECLIPSE/e4.10/org.codehaus.groovy-3.4.0.v201905281626-e1812-updatesite.zip.md5
28-May-2019 18:12:04 Transfer Time: .2 s - Transfer Rate: .2 KB/s
28-May-2019 18:12:05 Uploading /opt/bamboo-home/xml-data/build-dir/GRECLIPSE-E410-JOB1/Site-org.codehaus.groovy.eclipse/target/site/org.codehaus.groovy-3.4.0.v201905281626-e1812-updatesite.zip.sha1 (.0 KB) to s3://dist.springsource.org/snapshot/GRECLIPSE/e4.10/org.codehaus.groovy-3.4.0.v201905281626-e1812-updatesite.zip.sha1
28-May-2019 18:12:05 Transfer Time: .2 s - Transfer Rate: .2 KB/s
28-May-2019 18:12:05 Uploading /opt/bamboo-home/xml-data/build-dir/GRECLIPSE-E410-JOB1/Site-org.codehaus.groovy.eclipse/target/site/plugins/org.codehaus.groovy.eclipse.ant_3.4.0.v201905281626-e1812.jar (11.5 KB) to s3://dist.springsource.org/snapshot/GRECLIPSE/e4.10/plugins/org.codehaus.groovy.eclipse.ant_3.4.0.v201905281626-e1812.jar
28-May-2019 18:12:06 Transfer Time: .2 s - Transfer Rate: 67.8 KB/s
28-May-2019 18:12:06 Uploading /opt/bamboo-home/xml-data/build-dir/GRECLIPSE-E410-JOB1/Site-org.codehaus.groovy.eclipse/target/site/plugins/org.codehaus.groovy.eclipse.astviews_3.4.0.v201905281626-e1812.jar (79.2 KB) to s3://dist.springsource.org/snapshot/GRECLIPSE/e4.10/plugins/org.codehaus.groovy.eclipse.astviews_3.4.0.v201905281626-e1812.jar
28-May-2019 18:12:06 Transfer Time: .2 s - Transfer Rate: 316.7 KB/s
28-May-2019 18:12:07 Uploading /opt/bamboo-home/xml-data/build-dir/GRECLIPSE-E410-JOB1/Site-org.codehaus.groovy.eclipse/target/site/plugins/org.codehaus.groovy.eclipse.codeassist_3.4.0.v201905281626-e1812.jar (273.7 KB) to s3://dist.springsource.org/snapshot/GRECLIPSE/e4.10/plugins/org.codehaus.groovy.eclipse.codeassist_3.4.0.v201905281626-e1812.jar
28-May-2019 18:12:07 Transfer Time: .5 s - Transfer Rate: 598.9 KB/s
28-May-2019 18:12:08 Uploading /opt/bamboo-home/xml-data/build-dir/GRECLIPSE-E410-JOB1/Site-org.codehaus.groovy.eclipse/target/site/plugins/org.codehaus.groovy.eclipse.codebrowsing_3.4.0.v201905281626-e1812.jar (87.0 KB) to s3://dist.springsource.org/snapshot/GRECLIPSE/e4.10/plugins/org.codehaus.groovy.eclipse.codebrowsing_3.4.0.v201905281626-e1812.jar
28-May-2019 18:12:08 Transfer Time: .2 s - Transfer Rate: 408.4 KB/s
28-May-2019 18:12:08 Uploading /opt/bamboo-home/xml-data/build-dir/GRECLIPSE-E410-JOB1/Site-org.codehaus.groovy.eclipse/target/site/plugins/org.codehaus.groovy.eclipse.compilerResolver_3.4.0.v201905281626-e1812.jar (19.9 KB) to s3://dist.springsource.org/snapshot/GRECLIPSE/e4.10/plugins/org.codehaus.groovy.eclipse.compilerResolver_3.4.0.v201905281626-e1812.jar
28-May-2019 18:12:08 Transfer Time: .2 s - Transfer Rate: 99.3 KB/s
28-May-2019 18:12:09 Uploading /opt/bamboo-home/xml-data/build-dir/GRECLIPSE-E410-JOB1/Site-org.codehaus.groovy.eclipse/target/site/plugins/org.codehaus.groovy.eclipse.core_3.4.0.v201905281626-e1812.jar (82.6 KB) to s3://dist.springsource.org/snapshot/GRECLIPSE/e4.10/plugins/org.codehaus.groovy.eclipse.core_3.4.0.v201905281626-e1812.jar
28-May-2019 18:12:09 Transfer Time: .2 s - Transfer Rate: 395.0 KB/s
28-May-2019 18:12:09 Uploading /opt/bamboo-home/xml-data/build-dir/GRECLIPSE-E410-JOB1/Site-org.codehaus.groovy.eclipse/target/site/plugins/org.codehaus.groovy.eclipse.dsl_3.4.0.v201905281626-e1812.jar (395.7 KB) to s3://dist.springsource.org/snapshot/GRECLIPSE/e4.10/plugins/org.codehaus.groovy.eclipse.dsl_3.4.0.v201905281626-e1812.jar
28-May-2019 18:12:10 Transfer Time: .3 s - Transfer Rate: 1.4 MB/s
28-May-2019 18:12:10 Uploading /opt/bamboo-home/xml-data/build-dir/GRECLIPSE-E410-JOB1/Site-org.codehaus.groovy.eclipse/target/site/plugins/org.codehaus.groovy.eclipse.quickfix_3.4.0.v201905281626-e1812.jar (110.2 KB) to s3://dist.springsource.org/snapshot/GRECLIPSE/e4.10/plugins/org.codehaus.groovy.eclipse.quickfix_3.4.0.v201905281626-e1812.jar
28-May-2019 18:12:10 Transfer Time: .2 s - Transfer Rate: 532.4 KB/s
28-May-2019 18:12:11 Uploading /opt/bamboo-home/xml-data/build-dir/GRECLIPSE-E410-JOB1/Site-org.codehaus.groovy.eclipse/target/site/plugins/org.codehaus.groovy.eclipse.refactoring_3.4.0.v201905281626-e1812.jar (271.7 KB) to s3://dist.springsource.org/snapshot/GRECLIPSE/e4.10/plugins/org.codehaus.groovy.eclipse.refactoring_3.4.0.v201905281626-e1812.jar
28-May-2019 18:12:11 Transfer Time: .3 s - Transfer Rate: 967.0 KB/s
28-May-2019 18:12:11 Uploading /opt/bamboo-home/xml-data/build-dir/GRECLIPSE-E410-JOB1/Site-org.codehaus.groovy.eclipse/target/site/plugins/org.codehaus.groovy.eclipse.ui_3.4.0.v201905281626-e1812.jar (547.2 KB) to s3://dist.springsource.org/snapshot/GRECLIPSE/e4.10/plugins/org.codehaus.groovy.eclipse.ui_3.4.0.v201905281626-e1812.jar
28-May-2019 18:12:12 Transfer Time: .4 s - Transfer Rate: 1.2 MB/s
28-May-2019 18:12:12 Uploading /opt/bamboo-home/xml-data/build-dir/GRECLIPSE-E410-JOB1/Site-org.codehaus.groovy.eclipse/target/site/plugins/org.codehaus.groovy.eclipse_3.4.0.v201905281626-e1812.jar (16.7 KB) to s3://dist.springsource.org/snapshot/GRECLIPSE/e4.10/plugins/org.codehaus.groovy.eclipse_3.4.0.v201905281626-e1812.jar
28-May-2019 18:12:13 Transfer Time: .2 s - Transfer Rate: 85.1 KB/s
28-May-2019 18:12:13 Uploading /opt/bamboo-home/xml-data/build-dir/GRECLIPSE-E410-JOB1/Site-org.codehaus.groovy.eclipse/target/site/plugins/org.codehaus.groovy.m2eclipse_3.4.0.v201905281626-e1812.jar (17.9 KB) to s3://dist.springsource.org/snapshot/GRECLIPSE/e4.10/plugins/org.codehaus.groovy.m2eclipse_3.4.0.v201905281626-e1812.jar
28-May-2019 18:12:13 Transfer Time: .2 s - Transfer Rate: 94.6 KB/s
28-May-2019 18:12:13 Uploading /opt/bamboo-home/xml-data/build-dir/GRECLIPSE-E410-JOB1/Site-org.codehaus.groovy.eclipse/target/site/plugins/org.codehaus.groovy_2.4.17.v201905281626-e1812.jar (18.8 MB) to s3://dist.springsource.org/snapshot/GRECLIPSE/e4.10/plugins/org.codehaus.groovy_2.4.17.v201905281626-e1812.jar
28-May-2019 18:12:16 Transfer Time: 2.5 s - Transfer Rate: 7.4 MB/s
28-May-2019 18:12:16 Uploading /opt/bamboo-home/xml-data/build-dir/GRECLIPSE-E410-JOB1/Site-org.codehaus.groovy.eclipse/target/site/plugins/org.codehaus.groovy_2.5.7.v201905281626-e1812.jar (17.6 MB) to s3://dist.springsource.org/snapshot/GRECLIPSE/e4.10/plugins/org.codehaus.groovy_2.5.7.v201905281626-e1812.jar
28-May-2019 18:12:19 Transfer Time: 2.9 s - Transfer Rate: 6.0 MB/s
28-May-2019 18:12:20 Uploading /opt/bamboo-home/xml-data/build-dir/GRECLIPSE-E410-JOB1/Site-org.codehaus.groovy.eclipse/target/site/plugins/org.codehaus.groovy_3.0.0.v201905281626-e1812.jar (21.4 MB) to s3://dist.springsource.org/snapshot/GRECLIPSE/e4.10/plugins/org.codehaus.groovy_3.0.0.v201905281626-e1812.jar
28-May-2019 18:12:24 Transfer Time: 3.9 s - Transfer Rate: 5.5 MB/s
28-May-2019 18:12:24 Uploading /opt/bamboo-home/xml-data/build-dir/GRECLIPSE-E410-JOB1/Site-org.codehaus.groovy.eclipse/target/site/plugins/org.eclipse.jdt.core_3.16.0.v201905281626-e1812.jar (6.6 MB) to s3://dist.springsource.org/snapshot/GRECLIPSE/e4.10/plugins/org.eclipse.jdt.core_3.16.0.v201905281626-e1812.jar
28-May-2019 18:12:25 Transfer Time: 1.3 s - Transfer Rate: 5.1 MB/s
28-May-2019 18:12:26 Uploading /opt/bamboo-home/xml-data/build-dir/GRECLIPSE-E410-JOB1/Site-org.codehaus.groovy.eclipse/target/site/plugins/org.eclipse.jdt.groovy.core_3.4.0.v201905281626-e1812.jar (451.0 KB) to s3://dist.springsource.org/snapshot/GRECLIPSE/e4.10/plugins/org.eclipse.jdt.groovy.core_3.4.0.v201905281626-e1812.jar
28-May-2019 18:12:26 Transfer Time: .3 s - Transfer Rate: 1.5 MB/s
28-May-2019 18:12:26 Uploading /opt/bamboo-home/xml-data/build-dir/GRECLIPSE-E410-JOB1/Site-org.codehaus.groovy.eclipse/target/site/site.xml (2.8 KB) to s3://dist.springsource.org/snapshot/GRECLIPSE/e4.10/site.xml
28-May-2019 18:12:27 Transfer Time: .2 s - Transfer Rate: 15.2 KB/s
28-May-2019 18:12:27 Uploading /opt/bamboo-home/xml-data/build-dir/GRECLIPSE-E410-JOB1/Site-org.codehaus.groovy.eclipse/target/site/org.codehaus.groovy-3.4.0.v201905281626-e1812-updatesite.zip (66.3 MB) to s3://dist.springsource.org/snapshot/GRECLIPSE/e4.10/org.codehaus.groovy-3.4.0.v201905281626-e1812-updatesite.zip
28-May-2019 18:12:45 Transfer Time: 18.2 s - Transfer Rate: 3.6 MB/s
28-May-2019 18:12:45 [INFO] Executed tasks
28-May-2019 18:12:45 [INFO] ------------------------------------------------------------------------
28-May-2019 18:12:45 [INFO] Reactor Summary:
28-May-2019 18:12:45 [INFO]
28-May-2019 18:12:45 [INFO] org.codehaus.groovy.eclipse.parent ................. SUCCESS [  0.160 s]
28-May-2019 18:12:45 [INFO] org.codehaus.groovy ................................ SUCCESS [  5.572 s]
28-May-2019 18:12:45 [INFO] org.codehaus.groovy ................................ SUCCESS [  3.357 s]
28-May-2019 18:12:45 [INFO] org.codehaus.groovy ................................ SUCCESS [  4.332 s]
28-May-2019 18:12:45 [INFO] org.codehaus.groovy.eclipse.compilerResolver ....... SUCCESS [  0.850 s]
28-May-2019 18:12:45 [INFO] org.eclipse.jdt.core ............................... SUCCESS [  9.708 s]
28-May-2019 18:12:45 [INFO] org.eclipse.jdt.groovy.core ........................ SUCCESS [  1.629 s]
28-May-2019 18:12:45 [INFO] org.codehaus.groovy.eclipse ........................ SUCCESS [  0.337 s]
28-May-2019 18:12:45 [INFO] org.codehaus.groovy.eclipse.core ................... SUCCESS [  0.953 s]
28-May-2019 18:12:45 [INFO] org.codehaus.groovy.eclipse.ant .................... SUCCESS [  0.746 s]
28-May-2019 18:12:45 [INFO] org.codehaus.groovy.eclipse.codebrowsing ........... SUCCESS [  1.021 s]
28-May-2019 18:12:45 [INFO] org.codehaus.groovy.eclipse.refactoring ............ SUCCESS [  1.351 s]
28-May-2019 18:12:45 [INFO] org.codehaus.groovy.eclipse.ui ..................... SUCCESS [  1.637 s]
28-May-2019 18:12:45 [INFO] org.codehaus.groovy.eclipse.astviews ............... SUCCESS [  2.343 s]
28-May-2019 18:12:45 [INFO] org.codehaus.groovy.eclipse.codeassist ............. SUCCESS [  1.447 s]
28-May-2019 18:12:45 [INFO] org.codehaus.groovy.eclipse.dsl .................... SUCCESS [  1.431 s]
28-May-2019 18:12:45 [INFO] org.codehaus.groovy.eclipse.quickfix ............... SUCCESS [  1.054 s]
28-May-2019 18:12:45 [INFO] org.codehaus.groovy24.feature ...................... SUCCESS [  0.455 s]
28-May-2019 18:12:45 [INFO] org.codehaus.groovy25.feature ...................... SUCCESS [  0.402 s]
28-May-2019 18:12:45 [INFO] org.codehaus.groovy30.feature ...................... SUCCESS [  0.397 s]
28-May-2019 18:12:45 [INFO] org.codehaus.groovy.jdt.patch ...................... SUCCESS [  0.493 s]
28-May-2019 18:12:45 [INFO] org.codehaus.groovy.headless.feature ............... SUCCESS [  0.513 s]
28-May-2019 18:12:45 [INFO] org.codehaus.groovy.compilerless.feature ........... SUCCESS [  0.608 s]
28-May-2019 18:12:45 [INFO] org.codehaus.groovy.eclipse.feature ................ SUCCESS [  0.441 s]
28-May-2019 18:12:45 [INFO] org.eclipse.jdt.core.tests.compiler ................ SUCCESS [  4.364 s]
28-May-2019 18:12:45 [INFO] org.eclipse.jdt.core.tests.builder ................. SUCCESS [  1.061 s]
28-May-2019 18:12:45 [INFO] org.eclipse.jdt.groovy.core.tests.compiler ......... SUCCESS [  0.969 s]
28-May-2019 18:12:45 [INFO] org.eclipse.jdt.groovy.core.tests.builder .......... SUCCESS [  1.191 s]
28-May-2019 18:12:45 [INFO] org.codehaus.groovy.eclipse.tests .................. SUCCESS [  2.735 s]
28-May-2019 18:12:45 [INFO] org.codehaus.groovy.eclipse.codeassist.test ........ SUCCESS [  1.864 s]
28-May-2019 18:12:45 [INFO] org.codehaus.groovy.eclipse.codebrowsing.test ...... SUCCESS [  1.439 s]
28-May-2019 18:12:45 [INFO] org.codehaus.groovy.eclipse.core.test .............. SUCCESS [  1.285 s]
28-May-2019 18:12:45 [INFO] org.codehaus.groovy.eclipse.dsl.tests .............. SUCCESS [  1.471 s]
28-May-2019 18:12:45 [INFO] org.codehaus.groovy.eclipse.junit.test ............. SUCCESS [  0.996 s]
28-May-2019 18:12:45 [INFO] org.codehaus.groovy.eclipse.refactoring.test ....... SUCCESS [  1.919 s]
28-May-2019 18:12:45 [INFO] org.codehaus.groovy.eclipse.quickfix.test .......... SUCCESS [  1.277 s]
28-May-2019 18:12:45 [INFO] org.codehaus.groovy.alltests ....................... SUCCESS [  01:42 h]
28-May-2019 18:12:45 [INFO] org.codehaus.groovy.m2eclipse ...................... SUCCESS [  0.839 s]
28-May-2019 18:12:45 [INFO] org.codehaus.groovy.m2eclipse.feature .............. SUCCESS [  0.410 s]
28-May-2019 18:12:45 [INFO] org.codehaus.groovy.eclipse.site ................... SUCCESS [ 57.461 s]
28-May-2019 18:12:45 [INFO] ------------------------------------------------------------------------
28-May-2019 18:12:45 [INFO] BUILD SUCCESS
28-May-2019 18:12:45 [INFO] ------------------------------------------------------------------------
28-May-2019 18:12:45 [INFO] Total time: 01:45 h
28-May-2019 18:12:45 [INFO] Finished at: 2019-05-28T18:12:45+00:00
28-May-2019 18:12:45 [INFO] Final Memory: 162M/1434M
28-May-2019 18:12:45 [INFO] ------------------------------------------------------------------------
28-May-2019 18:12:45 [WARNING] The requested profile "snapshot" could not be activated because it does not exist.
28-May-2019 18:12:46 Parsing test results under /opt/bamboo-home/xml-data/build-dir/GRECLIPSE-E410-JOB1...
28-May-2019 18:12:47 Failing task since 7 failing test cases were found.
28-May-2019 18:12:47 Finished task 'Maven 3.x' with result: Failed
28-May-2019 18:12:47 Running post build plugin 'Docker Container Cleanup'
28-May-2019 18:12:47 Running post build plugin 'NCover Results Collector'
28-May-2019 18:12:47 Running post build plugin 'Artifactory Release Management Staging'
28-May-2019 18:12:47 Running post build plugin 'Artifactory Build Info Copier'
28-May-2019 18:12:47 Running post build plugin 'Artifactory Gradle Properties Info Copier'
28-May-2019 18:12:47 Running post build plugin 'Clover Results Collector'
28-May-2019 18:12:47 Running post build plugin 'npm Cache Cleanup'
28-May-2019 18:12:47 Running post build plugin 'Artifact Copier'
28-May-2019 18:12:47 Publishing an artifact: surefire-reports
28-May-2019 18:12:47 Finished publishing of artifact Non required job artifact: [surefire-reports], pattern: [**/target/TEST-*.xml] in 587.9 ms
28-May-2019 18:12:47 Publishing an artifact: Zipped Update Site
28-May-2019 18:12:50 Finished publishing of artifact Non required job artifact: [Zipped Update Site], pattern: [**/*updatesite.zip] anchored at: [Site-org.codehaus.groovy.eclipse/target/site] in 2.714 s
28-May-2019 18:12:50 Successfully removed working directory at '/opt/bamboo-home/xml-data/build-dir/GRECLIPSE-E410-JOB1'
28-May-2019 18:12:50 Finalising the build...
28-May-2019 18:12:50 Stopping timer.
28-May-2019 18:12:50 Build GRECLIPSE-E410-JOB1-261 completed.
28-May-2019 18:12:51 Running on server: post build plugin 'NCover Results Collector'
28-May-2019 18:12:51 Running on server: post build plugin 'Build Hanging Detection Configuration'
28-May-2019 18:12:51 Running on server: post build plugin 'Clover Delta Calculator'
28-May-2019 18:12:51 Running on server: post build plugin 'Maven Dependencies Postprocessor'
28-May-2019 18:12:51 All post build plugins have finished
28-May-2019 18:12:51 Generating build results summary...
28-May-2019 18:12:51 Saving build results to disk...
28-May-2019 18:12:51 Logging substituted variables...
28-May-2019 18:12:52 Indexing build results...
28-May-2019 18:12:52 Finished building GRECLIPSE-E410-JOB1-261.