Build: #261 failed

Job: Default Job failed

Stages & jobs

  1. Default Stage

Test results

  • 5,731 tests in total
  • 7 tests failed
  • 4 failures are new
  • 7 tests were fixed
  • 102 tests were quarantined / skipped
  • 100 minutes taken in total.

Build 261 has the following 7 errors: 4 new failure(s) occurred since the previous build.

New test failures 4
Status Test Duration
Collapse Failed DGMInferencingTests testDGM15 History
< 1 sec
java.lang.AssertionError: Expected type not found.
Expected: java.util.Map$Entry<java.lang.String,java.lang.Integer>
Found: java.lang.Object
Declaring type: groovy.lang.Closure<V extends java.lang.Object>
ASTNode: org.codehaus.groovy.ast.expr.VariableExpression@f4ba7[variable: it]
Confidence: INFERRED

java.lang.AssertionError: 
(9 more lines...)
Collapse Failed Groovy20InferencingTests testCompileStatic13 History
< 1 sec
java.lang.AssertionError: Expected type not found.
Expected: java.lang.Number
Found: java.lang.String
Declaring type: X
ASTNode: org.codehaus.groovy.ast.expr.ConstantExpression@11125f[readOnly]
Confidence: UNKNOWN

java.lang.AssertionError: 
(8 more lines...)
Collapse Failed OperatorOverloadingInferencingTests testLongExpr2 History
< 1 sec
java.lang.AssertionError: Expected type not found.
Expected: Foo
Found: java.util.List<Foo>
Declaring type: Search
ASTNode: org.codehaus.groovy.ast.expr.VariableExpression@1061bc[variable: xxx]
Confidence: INFERRED

java.lang.AssertionError: 
(8 more lines...)
Collapse Failed StaticInferencingTests testClassReference14 History
< 1 sec
java.lang.NoClassDefFoundError: org/codehaus/groovy/runtime/DefaultGroovyMethodsSupport
	at org.eclipse.jdt.core.groovy.tests.search.StaticInferencingTests.assertKnown(StaticInferencingTests.java:35)
	at org.eclipse.jdt.core.groovy.tests.search.StaticInferencingTests.testClassReference14(StaticInferencingTests.java:139)
Caused by: java.lang.ClassNotFoundException: org.codehaus.groovy.runtime.DefaultGroovyMethodsSupport
	at org.eclipse.jdt.core.groovy.tests.search.StaticInferencingTests.assertKnown(StaticInferencingTests.java:35)
	at org.eclipse.jdt.core.groovy.tests.search.StaticInferencingTests.testClassReference14(StaticInferencingTests.java:139)
Existing test failures 3
Status Test Failing since Duration
org.junit.ComparisonFailure: unexpected recompiled units. lenExpected=3 lenActual=4 expected:<...st.Class1,test.Class[]2,test.Class3}> but was:<...st.Class1,test.Class[1,test.Class]2,test.Class3}>
	at org.eclipse.jdt.core.groovy.tests.builder.BasicGroovyBuildTests.testGRE1773(BasicGroovyBuildTests.java:3422)
org.junit.runners.model.TestTimedOutException: test timed out after 1500 milliseconds
	at org.eclipse.jdt.groovy.core.tests.basic.EnumerationTests.testEnum4438(EnumerationTests.java:316)
org.junit.runners.model.TestTimedOutException: test timed out after 1500 milliseconds
	at org.eclipse.jdt.groovy.core.tests.basic.EnumerationTests.testEnum4438(EnumerationTests.java:316)