Build: #334 failed

Job: Default Job failed

Stages & jobs

  1. Default Stage

Job result summary

Completed
Duration
106 minutes
Agent
bamboo-16.af.pivotal.io
Revision
cfc61efdfe3d1d3d4796bfb51e1097e068824722 cfc61efdfe3d1d3d4796bfb51e1097e068824722
Total tests
5965
Failing since
#332 (Code changes detected – )
Fixed in
#346 (Code changes detected)

Tests

  • 5,965 tests in total
  • 10 tests failed
  • 10 failures are new
  • 3 tests were fixed
  • 117 tests were quarantined / skipped
  • 101 minutes taken in total.
New test failures 10
Status Test Duration
Collapse Failed GroovyContentTypeTests testJavaOnlyProject History
< 1 sec
java.lang.AssertionError: L/Project/bin/p1/HelloJava.class should exist
	at org.eclipse.jdt.core.groovy.tests.model.GroovyContentTypeTests.checkJavaProject(GroovyContentTypeTests.java:152)
	at org.eclipse.jdt.core.groovy.tests.model.GroovyContentTypeTests.testJavaOnlyProject(GroovyContentTypeTests.java:70)
Collapse Failed ArrayInferencingTests testArray6 History
< 1 sec
java.lang.AssertionError: Expected type not found.
Expected: java.lang.CharSequence
Found: java.lang.CharSequence[]
Declaring type: null
ASTNode: org.codehaus.groovy.ast.expr.BinaryExpression@f47e7[org.codehaus.groovy.ast.expr.VariableExpression@f47e4[variable: x]("[" at 1:51:  "[" )org.codehaus.groovy.ast.expr.VariableExpression@f4f68[variable: i type: java.lang.Integer]]
Confidence: EXACT

java.lang.AssertionError: 
(9 more lines...)
Collapse Failed BinarySearchTests testMethodRefInInitializer History
1 sec
java.lang.AssertionError: Expecting 2 matches, but found 0

java.lang.AssertionError: 
Expecting 2 matches, but found 0

	at org.eclipse.jdt.core.groovy.tests.search.BinarySearchTests.assertMatches(BinarySearchTests.java:135)
	at org.eclipse.jdt.core.groovy.tests.search.BinarySearchTests.testMethodRefInInitializer(BinarySearchTests.java:213)
Collapse Failed ClosureInferencingTests testClosure27 History
< 1 sec
java.lang.NoClassDefFoundError: org/codehaus/groovy/runtime/DefaultGroovyMethodsSupport
	at org.eclipse.jdt.core.groovy.tests.search.ClosureInferencingTests.testClosure27(ClosureInferencingTests.java:519)
Caused by: java.lang.ClassNotFoundException: org.codehaus.groovy.runtime.DefaultGroovyMethodsSupport
	at org.eclipse.jdt.core.groovy.tests.search.ClosureInferencingTests.testClosure27(ClosureInferencingTests.java:519)
Collapse Failed ConstructorReferenceSearchTests testConstructorReferences11 History
< 1 sec
java.lang.AssertionError: expected:<2> but was:<0>
	at org.eclipse.jdt.core.groovy.tests.search.ConstructorReferenceSearchTests.testConstructorReferences11(ConstructorReferenceSearchTests.java:276)
Collapse Failed ConstructorReferenceSearchTests testConstructorReferences12 History
< 1 sec
java.lang.AssertionError: expected:<2> but was:<0>
	at org.eclipse.jdt.core.groovy.tests.search.ConstructorReferenceSearchTests.testConstructorReferences12(ConstructorReferenceSearchTests.java:313)
Collapse Failed ConstructorReferenceSearchTests testConstructorReferences13 History
< 1 sec
java.lang.AssertionError: expected:<1> but was:<0>
	at org.eclipse.jdt.core.groovy.tests.search.ConstructorReferenceSearchTests.testConstructorReferences13(ConstructorReferenceSearchTests.java:349)
Collapse Failed DGMInferencingTests testDGM23 History
< 1 sec
java.lang.AssertionError: Expected type not found.
Expected: java.lang.String
Found: java.lang.Object
Declaring type: Search
ASTNode: org.codehaus.groovy.ast.expr.VariableExpression@f2252[variable: key]
Confidence: INFERRED

java.lang.AssertionError: 
(9 more lines...)
Collapse Failed DGMInferencingTests testDGMClosure18 History
< 1 sec
java.lang.AssertionError: Expected type not found.
Expected: java.util.Date
Found: java.lang.Object
Declaring type: Search
ASTNode: org.codehaus.groovy.ast.expr.VariableExpression@f1ace[variable: val]
Confidence: INFERRED

java.lang.AssertionError: 
(9 more lines...)
Collapse Failed MethodReferenceSearchTests testExplicitPropertySetterSearch1 History
1 sec
java.lang.AssertionError: expected:<5> but was:<0>
	at org.eclipse.jdt.core.groovy.tests.search.MethodReferenceSearchTests.testExplicitPropertySetterSearch1(MethodReferenceSearchTests.java:549)
Fixed tests 3
Status Test Failing since Duration
Successful ConstructorReferenceSearchTests testNewifyConstructorReferences1 History
Failing since build #333 (Code changes detected) < 1 sec
Successful MethodReferenceSearchTests testExplicitPropertyGetterSearch1 History
Failing since build #332 (Code changes detected) < 1 sec
Successful MethodReferenceSearchTests testMethodWithDefaultParameters3 History
Failing since build #333 (Code changes detected) < 1 sec

Error summary

The build generated some errors. See the full build log for more details.


(SWT:18528): Gtk-CRITICAL **: 18:39:14.441: gtk_box_gadget_distribute: assertion 'size >= 0' failed in GtkScrollbar
TypeInferencingVisitorWithRequestor.findMethodNode: no match found for Foo(QMap.Entry;, Qjava.lang.Object;)
TypeInferencingVisitorWithRequestor.findMethodNode: no match found for Foo(QMap.Entry;)
TypeInferencingVisitorWithRequestor.findMethodNode: no match found for TestUnit352217.y(QOuter.Inner;)
TypeInferencingVisitorWithRequestor.findMethodNode: no match found for TestUnit352217.y(QOuter.Inner;)
TypeInferencingVisitorWithRequestor.findMethodNode: no match found for TestUnit54276.y(QOuter.Inner;)
TypeInferencingVisitorWithRequestor.findMethodNode: no match found for TestUnit54276.y(QOuter.Inner;)
TypeInferencingVisitorWithRequestor.findMethodNode: no match found for Main.main([Qjava.lang.String;)
TypeInferencingVisitorWithRequestor.findMethodNode: no match found for Main.main([Qjava.lang.String;)
CodeSelectRequestor: Could not proceed due to null declaring type for org.codehaus.groovy.ast.expr.BinaryExpression@ecbea[org.codehaus.groovy.ast.expr.VariableExpression@ecbe3[variable: it]("in" at 1:20:  "in" )org.codehaus.groovy.ast.expr.ListExpression@ee270[]]
CodeSelectRequestor: Could not proceed due to null declaring type for org.codehaus.groovy.ast.expr.RangeExpression@ebcdd
CodeSelectRequestor: Could not proceed due to null declaring type for org.codehaus.groovy.ast.expr.RangeExpression@ebcde
TypeInferencingVisitorWithRequestor.findMethodNode: no match found for Type.x(QList<Qjava.util.Date;>;)
TypeInferencingVisitorWithRequestor.findMethodNode: no match found for Type.x(QList<Qjava.lang.Number;>;)
TypeInferencingVisitorWithRequestor.findMethodNode: no match found for Type.x(QList<Qjava.lang.Number;>;)
TypeInferencingVisitorWithRequestor.findMethodNode: no match found for Type.x(QList<Qjava.util.Date;>;)
TypeInferencingVisitorWithRequestor.findMethodNode: no match found for Type.x(QList<Qjava.lang.Number;>;)
TypeInferencingVisitorWithRequestor.findMethodNode: no match found for Type.x(QList<Qjava.lang.Number;>;)
CodeSelectRequestor: Could not proceed due to null declaring type for org.codehaus.groovy.ast.expr.ConstantExpression@e8fc6[fff]
CodeSelectRequestor: Could not proceed due to null declaring type for org.codehaus.groovy.ast.expr.ConstantExpression@e8fca[fff]
CodeSelectRequestor: Could not proceed due to null declaring type for org.codehaus.groovy.ast.expr.ConstantExpression@e8fca[fff]
Waiting for: Java indexing... 3 files to index (/Project)
Waiting for: Java indexing... 22 files to index (/Project)
Waiting for: Java indexing... 23 files to index (/Project)
Waiting for: Java indexing... 22 files to index (/Project)
Waiting for: Java indexing... 22 files to index (/Project)
Waiting for: Java indexing... 22 files to index (/Project)
Waiting for: Java indexing... 21 files to index (/Project)
Waiting for: Java indexing... 21 files to index (/Project)
Waiting for: Java indexing... 21 files to index (/Project)
Waiting for: Java indexing... 16 files to index (/opt/jdk8u212-b03/jre/lib/rt.jar)