Build: #334 failed

Job: Default Job failed

Stages & jobs

  1. Default Stage

Build log

The build generated 45,842 lines of output.The output is too long and has been truncated to the last 1,000 lines. Download or view full build log

22-Aug-2019 20:22:56 testList7(org.eclipse.jdt.core.groovy.tests.search.GenericInferencingTests)  Time elapsed: 0.166 s
22-Aug-2019 20:22:56 testList8(org.eclipse.jdt.core.groovy.tests.search.GenericInferencingTests)  Time elapsed: 0.176 s
22-Aug-2019 20:22:56 testList9(org.eclipse.jdt.core.groovy.tests.search.GenericInferencingTests)  Time elapsed: 0.188 s
22-Aug-2019 20:22:56 testMap10(org.eclipse.jdt.core.groovy.tests.search.GenericInferencingTests)  Time elapsed: 0.166 s
22-Aug-2019 20:22:56 testMap11(org.eclipse.jdt.core.groovy.tests.search.GenericInferencingTests)  Time elapsed: 0.166 s
22-Aug-2019 20:22:56 testMap12(org.eclipse.jdt.core.groovy.tests.search.GenericInferencingTests)  Time elapsed: 0.16 s
22-Aug-2019 20:22:56 testMap13(org.eclipse.jdt.core.groovy.tests.search.GenericInferencingTests)  Time elapsed: 0.168 s
22-Aug-2019 20:22:56 testMap14(org.eclipse.jdt.core.groovy.tests.search.GenericInferencingTests)  Time elapsed: 0.172 s
22-Aug-2019 20:22:56 testMap15(org.eclipse.jdt.core.groovy.tests.search.GenericInferencingTests)  Time elapsed: 0.182 s
22-Aug-2019 20:22:56 testMap16(org.eclipse.jdt.core.groovy.tests.search.GenericInferencingTests)  Time elapsed: 0.167 s
22-Aug-2019 20:22:56 testMap1(org.eclipse.jdt.core.groovy.tests.search.GenericInferencingTests)  Time elapsed: 0.178 s
22-Aug-2019 20:22:56 testMap2(org.eclipse.jdt.core.groovy.tests.search.GenericInferencingTests)  Time elapsed: 0.268 s
22-Aug-2019 20:22:56 testMap3(org.eclipse.jdt.core.groovy.tests.search.GenericInferencingTests)  Time elapsed: 0.174 s
22-Aug-2019 20:22:56 testMap4(org.eclipse.jdt.core.groovy.tests.search.GenericInferencingTests)  Time elapsed: 0.184 s
22-Aug-2019 20:22:56 testMap5(org.eclipse.jdt.core.groovy.tests.search.GenericInferencingTests)  Time elapsed: 0.175 s
22-Aug-2019 20:22:56 testMap6(org.eclipse.jdt.core.groovy.tests.search.GenericInferencingTests)  Time elapsed: 0.166 s
22-Aug-2019 20:22:56 testMap7(org.eclipse.jdt.core.groovy.tests.search.GenericInferencingTests)  Time elapsed: 0.191 s
22-Aug-2019 20:22:56 testMap8(org.eclipse.jdt.core.groovy.tests.search.GenericInferencingTests)  Time elapsed: 0.181 s
22-Aug-2019 20:22:56 testMap9(org.eclipse.jdt.core.groovy.tests.search.GenericInferencingTests)  Time elapsed: 0.2 s
22-Aug-2019 20:22:56 testSet1(org.eclipse.jdt.core.groovy.tests.search.GenericInferencingTests)  Time elapsed: 0.168 s
22-Aug-2019 20:22:56 testSet2(org.eclipse.jdt.core.groovy.tests.search.GenericInferencingTests)  Time elapsed: 0.174 s
22-Aug-2019 20:22:56 testSet3(org.eclipse.jdt.core.groovy.tests.search.GenericInferencingTests)  Time elapsed: 0.164 s
22-Aug-2019 20:22:56 testSet4(org.eclipse.jdt.core.groovy.tests.search.GenericInferencingTests)  Time elapsed: 0.167 s
22-Aug-2019 20:22:56 testSet5(org.eclipse.jdt.core.groovy.tests.search.GenericInferencingTests)  Time elapsed: 0.176 s
22-Aug-2019 20:22:56 testSet6(org.eclipse.jdt.core.groovy.tests.search.GenericInferencingTests)  Time elapsed: 0.179 s
22-Aug-2019 20:22:56 testSet7(org.eclipse.jdt.core.groovy.tests.search.GenericInferencingTests)  Time elapsed: 0.17 s
22-Aug-2019 20:22:56 testSet8(org.eclipse.jdt.core.groovy.tests.search.GenericInferencingTests)  Time elapsed: 0.266 s
22-Aug-2019 20:22:56 testStaticMethod1(org.eclipse.jdt.core.groovy.tests.search.GenericInferencingTests)  Time elapsed: 0.178 s
22-Aug-2019 20:22:56 testStaticMethod2(org.eclipse.jdt.core.groovy.tests.search.GenericInferencingTests)  Time elapsed: 0.17 s
22-Aug-2019 20:22:56 testStaticMethod3(org.eclipse.jdt.core.groovy.tests.search.GenericInferencingTests)  Time elapsed: 0.203 s
22-Aug-2019 20:22:56 testStaticMethod4(org.eclipse.jdt.core.groovy.tests.search.GenericInferencingTests)  Time elapsed: 0.166 s
22-Aug-2019 20:22:56 testStaticMethod5(org.eclipse.jdt.core.groovy.tests.search.GenericInferencingTests)  Time elapsed: 0.247 s
22-Aug-2019 20:22:56 testStaticMethod6(org.eclipse.jdt.core.groovy.tests.search.GenericInferencingTests)  Time elapsed: 0.151 s
22-Aug-2019 20:22:56 testStaticMethod7(org.eclipse.jdt.core.groovy.tests.search.GenericInferencingTests)  Time elapsed: 0.378 s
22-Aug-2019 20:22:56 testStaticMethod8(org.eclipse.jdt.core.groovy.tests.search.GenericInferencingTests) skipped
22-Aug-2019 20:22:56 testStaticMethod9(org.eclipse.jdt.core.groovy.tests.search.GenericInferencingTests)  Time elapsed: 0.185 s
22-Aug-2019 20:22:56 testArrayDGM(org.eclipse.jdt.core.groovy.tests.search.GenericInferencingTests)  Time elapsed: 0.413 s
22-Aug-2019 20:22:56 testListOfMap1(org.eclipse.jdt.core.groovy.tests.search.GenericInferencingTests)  Time elapsed: 0.179 s
22-Aug-2019 20:22:56 testListOfMap3(org.eclipse.jdt.core.groovy.tests.search.GenericInferencingTests)  Time elapsed: 0.146 s
22-Aug-2019 20:22:56 testStaticMethodOverloads10(org.eclipse.jdt.core.groovy.tests.search.GenericInferencingTests)  Time elapsed: 0.161 s
22-Aug-2019 20:22:56 testStaticMethodOverloads11(org.eclipse.jdt.core.groovy.tests.search.GenericInferencingTests)  Time elapsed: 0.393 s
22-Aug-2019 20:22:56 testStaticMethodOverloads1(org.eclipse.jdt.core.groovy.tests.search.GenericInferencingTests)  Time elapsed: 0.178 s
22-Aug-2019 20:22:56 testStaticMethodOverloads2(org.eclipse.jdt.core.groovy.tests.search.GenericInferencingTests)  Time elapsed: 0.175 s
22-Aug-2019 20:22:56 testStaticMethodOverloads3(org.eclipse.jdt.core.groovy.tests.search.GenericInferencingTests)  Time elapsed: 0.164 s
22-Aug-2019 20:22:56 testStaticMethodOverloads4(org.eclipse.jdt.core.groovy.tests.search.GenericInferencingTests)  Time elapsed: 0.164 s
22-Aug-2019 20:22:56 testStaticMethodOverloads5(org.eclipse.jdt.core.groovy.tests.search.GenericInferencingTests)  Time elapsed: 0.205 s
22-Aug-2019 20:22:56 testStaticMethodOverloads6(org.eclipse.jdt.core.groovy.tests.search.GenericInferencingTests)  Time elapsed: 0.24 s
22-Aug-2019 20:22:56 testStaticMethodOverloads7(org.eclipse.jdt.core.groovy.tests.search.GenericInferencingTests)  Time elapsed: 0.237 s
22-Aug-2019 20:22:56 testStaticMethodOverloads8(org.eclipse.jdt.core.groovy.tests.search.GenericInferencingTests)  Time elapsed: 0.17 s
22-Aug-2019 20:22:56 testStaticMethodOverloads9(org.eclipse.jdt.core.groovy.tests.search.GenericInferencingTests)  Time elapsed: 0.186 s
22-Aug-2019 20:22:56 testNestedGenerics1(org.eclipse.jdt.core.groovy.tests.search.GenericInferencingTests)  Time elapsed: 0.193 s
22-Aug-2019 20:22:56 testNestedGenerics2(org.eclipse.jdt.core.groovy.tests.search.GenericInferencingTests)  Time elapsed: 0.171 s
22-Aug-2019 20:22:56 testNestedGenerics3(org.eclipse.jdt.core.groovy.tests.search.GenericInferencingTests)  Time elapsed: 0.175 s
22-Aug-2019 20:22:56 testNestedGenerics4(org.eclipse.jdt.core.groovy.tests.search.GenericInferencingTests)  Time elapsed: 0.209 s
22-Aug-2019 20:22:56 testNestedGenerics5(org.eclipse.jdt.core.groovy.tests.search.GenericInferencingTests)  Time elapsed: 0.223 s
22-Aug-2019 20:22:56 testNestedGenerics6(org.eclipse.jdt.core.groovy.tests.search.GenericInferencingTests)  Time elapsed: 0.183 s
22-Aug-2019 20:22:56 testNestedGenerics7(org.eclipse.jdt.core.groovy.tests.search.GenericInferencingTests)  Time elapsed: 0.199 s
22-Aug-2019 20:22:56 testNestedGenerics8(org.eclipse.jdt.core.groovy.tests.search.GenericInferencingTests)  Time elapsed: 0.197 s
22-Aug-2019 20:22:56 testStaticMethod10(org.eclipse.jdt.core.groovy.tests.search.GenericInferencingTests)  Time elapsed: 0.366 s
22-Aug-2019 20:22:56 testStaticMethod11(org.eclipse.jdt.core.groovy.tests.search.GenericInferencingTests)  Time elapsed: 0.36 s
22-Aug-2019 20:22:56 testMethod1(org.eclipse.jdt.core.groovy.tests.search.GenericInferencingTests)  Time elapsed: 0.264 s
22-Aug-2019 20:22:56 testMethod2(org.eclipse.jdt.core.groovy.tests.search.GenericInferencingTests)  Time elapsed: 0.182 s
22-Aug-2019 20:22:56 testMethod3(org.eclipse.jdt.core.groovy.tests.search.GenericInferencingTests)  Time elapsed: 0.188 s
22-Aug-2019 20:22:56 testMethod4(org.eclipse.jdt.core.groovy.tests.search.GenericInferencingTests)  Time elapsed: 0.208 s
22-Aug-2019 20:22:56 testGetClass1(org.eclipse.jdt.core.groovy.tests.search.GenericInferencingTests)  Time elapsed: 0.174 s
22-Aug-2019 20:22:56 testGetClass2(org.eclipse.jdt.core.groovy.tests.search.GenericInferencingTests)  Time elapsed: 0.191 s
22-Aug-2019 20:22:56 testGetClass3(org.eclipse.jdt.core.groovy.tests.search.GenericInferencingTests)  Time elapsed: 0.148 s
22-Aug-2019 20:22:56 testCircularReference(org.eclipse.jdt.core.groovy.tests.search.GenericInferencingTests)  Time elapsed: 0.331 s
22-Aug-2019 20:22:56 testForLoop1(org.eclipse.jdt.core.groovy.tests.search.GenericInferencingTests)  Time elapsed: 0.205 s
22-Aug-2019 20:22:56 testForLoop2(org.eclipse.jdt.core.groovy.tests.search.GenericInferencingTests)  Time elapsed: 0.173 s
22-Aug-2019 20:22:56 testForLoop3(org.eclipse.jdt.core.groovy.tests.search.GenericInferencingTests)  Time elapsed: 0.17 s
22-Aug-2019 20:22:56 testForLoop4(org.eclipse.jdt.core.groovy.tests.search.GenericInferencingTests)  Time elapsed: 0.181 s
22-Aug-2019 20:22:56 testForLoop5(org.eclipse.jdt.core.groovy.tests.search.GenericInferencingTests)  Time elapsed: 0.276 s
22-Aug-2019 20:22:56 testForLoop6(org.eclipse.jdt.core.groovy.tests.search.GenericInferencingTests)  Time elapsed: 0.17 s
22-Aug-2019 20:22:56 testForLoop7(org.eclipse.jdt.core.groovy.tests.search.GenericInferencingTests)  Time elapsed: 0.176 s
22-Aug-2019 20:22:56 testForLoop8(org.eclipse.jdt.core.groovy.tests.search.GenericInferencingTests)  Time elapsed: 0.163 s
22-Aug-2019 20:22:56 testForLoop9(org.eclipse.jdt.core.groovy.tests.search.GenericInferencingTests)  Time elapsed: 0.186 s
22-Aug-2019 20:22:56 testMapOfMaps(org.eclipse.jdt.core.groovy.tests.search.GenericInferencingTests)  Time elapsed: 0.249 s
22-Aug-2019 20:22:56 testList10(org.eclipse.jdt.core.groovy.tests.search.GenericInferencingTests)  Time elapsed: 0.159 s
22-Aug-2019 20:22:56 testList11(org.eclipse.jdt.core.groovy.tests.search.GenericInferencingTests)  Time elapsed: 0.166 s
22-Aug-2019 20:22:56 testList12(org.eclipse.jdt.core.groovy.tests.search.GenericInferencingTests)  Time elapsed: 0.16 s
22-Aug-2019 20:22:56 testList13(org.eclipse.jdt.core.groovy.tests.search.GenericInferencingTests)  Time elapsed: 0.181 s
22-Aug-2019 20:22:56 testForLoop11(org.eclipse.jdt.core.groovy.tests.search.GenericInferencingTests)  Time elapsed: 0.191 s
22-Aug-2019 20:22:56 testForLoop2a(org.eclipse.jdt.core.groovy.tests.search.GenericInferencingTests)  Time elapsed: 0.181 s
22-Aug-2019 20:22:56 testRange1(org.eclipse.jdt.core.groovy.tests.search.GenericInferencingTests)  Time elapsed: 0.175 s
22-Aug-2019 20:22:56 testRange2(org.eclipse.jdt.core.groovy.tests.search.GenericInferencingTests)  Time elapsed: 0.177 s
22-Aug-2019 20:22:56 testClosure1(org.eclipse.jdt.core.groovy.tests.search.GenericInferencingTests)  Time elapsed: 0.184 s
22-Aug-2019 20:22:56 testClosure2(org.eclipse.jdt.core.groovy.tests.search.GenericInferencingTests)  Time elapsed: 0.17 s
22-Aug-2019 20:22:56 testClosure3(org.eclipse.jdt.core.groovy.tests.search.GenericInferencingTests)  Time elapsed: 0.194 s
22-Aug-2019 20:22:56 testClosure4(org.eclipse.jdt.core.groovy.tests.search.GenericInferencingTests)  Time elapsed: 0.184 s
22-Aug-2019 20:22:56 testMapOfList1(org.eclipse.jdt.core.groovy.tests.search.GenericInferencingTests)  Time elapsed: 0.198 s
22-Aug-2019 20:22:56 testMapOfList2(org.eclipse.jdt.core.groovy.tests.search.GenericInferencingTests)  Time elapsed: 0.175 s
22-Aug-2019 20:22:56 testMapOfList3(org.eclipse.jdt.core.groovy.tests.search.GenericInferencingTests)  Time elapsed: 0.162 s
22-Aug-2019 20:22:56 testMapOfList4(org.eclipse.jdt.core.groovy.tests.search.GenericInferencingTests)  Time elapsed: 0.217 s
22-Aug-2019 20:22:56 testMapOfList5(org.eclipse.jdt.core.groovy.tests.search.GenericInferencingTests)  Time elapsed: 0.27 s
22-Aug-2019 20:22:56 testMapOfList6(org.eclipse.jdt.core.groovy.tests.search.GenericInferencingTests)  Time elapsed: 0.184 s
22-Aug-2019 20:22:56 testMapOfList7(org.eclipse.jdt.core.groovy.tests.search.GenericInferencingTests)  Time elapsed: 0.184 s
22-Aug-2019 20:22:56 testGenericsMapper(org.eclipse.jdt.core.groovy.tests.search.GenericsMappingTests)  Time elapsed: 0.077 s
22-Aug-2019 20:22:56 testCompileStatic10(org.eclipse.jdt.core.groovy.tests.search.Groovy20InferencingTests)  Time elapsed: 0.198 s
22-Aug-2019 20:22:56 testCompileStatic11(org.eclipse.jdt.core.groovy.tests.search.Groovy20InferencingTests)  Time elapsed: 0.302 s
22-Aug-2019 20:22:56 testCompileStatic12(org.eclipse.jdt.core.groovy.tests.search.Groovy20InferencingTests)  Time elapsed: 0.277 s
22-Aug-2019 20:22:56 testCompileStatic13(org.eclipse.jdt.core.groovy.tests.search.Groovy20InferencingTests)  Time elapsed: 0.31 s
22-Aug-2019 20:22:56 testCompileStatic14(org.eclipse.jdt.core.groovy.tests.search.Groovy20InferencingTests)  Time elapsed: 0.344 s
22-Aug-2019 20:22:56 testCompileStatic15(org.eclipse.jdt.core.groovy.tests.search.Groovy20InferencingTests)  Time elapsed: 1.698 s
22-Aug-2019 20:22:56 testCompileStatic16(org.eclipse.jdt.core.groovy.tests.search.Groovy20InferencingTests)  Time elapsed: 0.336 s
22-Aug-2019 20:22:56 testCompileStatic1(org.eclipse.jdt.core.groovy.tests.search.Groovy20InferencingTests)  Time elapsed: 0.172 s
22-Aug-2019 20:22:56 testCompileStatic2(org.eclipse.jdt.core.groovy.tests.search.Groovy20InferencingTests)  Time elapsed: 0.162 s
22-Aug-2019 20:22:56 testCompileStatic3(org.eclipse.jdt.core.groovy.tests.search.Groovy20InferencingTests)  Time elapsed: 0.16 s
22-Aug-2019 20:22:56 testCompileStatic4(org.eclipse.jdt.core.groovy.tests.search.Groovy20InferencingTests)  Time elapsed: 0.187 s
22-Aug-2019 20:22:56 testCompileStatic5(org.eclipse.jdt.core.groovy.tests.search.Groovy20InferencingTests)  Time elapsed: 0.189 s
22-Aug-2019 20:22:56 testCompileStatic6(org.eclipse.jdt.core.groovy.tests.search.Groovy20InferencingTests)  Time elapsed: 0.18 s
22-Aug-2019 20:22:56 testCompileStatic7(org.eclipse.jdt.core.groovy.tests.search.Groovy20InferencingTests)  Time elapsed: 0.196 s
22-Aug-2019 20:22:56 testCompileStatic8(org.eclipse.jdt.core.groovy.tests.search.Groovy20InferencingTests)  Time elapsed: 0.186 s
22-Aug-2019 20:22:56 testCompileStatic9(org.eclipse.jdt.core.groovy.tests.search.Groovy20InferencingTests)  Time elapsed: 0.176 s
22-Aug-2019 20:22:56 testTypeChecked1(org.eclipse.jdt.core.groovy.tests.search.Groovy20InferencingTests)  Time elapsed: 0.204 s
22-Aug-2019 20:22:56 testTypeChecked2(org.eclipse.jdt.core.groovy.tests.search.Groovy20InferencingTests)  Time elapsed: 0.176 s
22-Aug-2019 20:22:56 testTypeChecked3(org.eclipse.jdt.core.groovy.tests.search.Groovy20InferencingTests)  Time elapsed: 0.188 s
22-Aug-2019 20:22:56 testTypeChecked4(org.eclipse.jdt.core.groovy.tests.search.Groovy20InferencingTests)  Time elapsed: 0.174 s
22-Aug-2019 20:22:56 testTypeChecked5(org.eclipse.jdt.core.groovy.tests.search.Groovy20InferencingTests)  Time elapsed: 0.159 s
22-Aug-2019 20:22:56 testTypeChecked6(org.eclipse.jdt.core.groovy.tests.search.Groovy20InferencingTests)  Time elapsed: 0.206 s
22-Aug-2019 20:22:56 testTypeChecked7(org.eclipse.jdt.core.groovy.tests.search.Groovy20InferencingTests)  Time elapsed: 0.162 s
22-Aug-2019 20:22:56 testTypeChecked8(org.eclipse.jdt.core.groovy.tests.search.Groovy20InferencingTests)  Time elapsed: 0.168 s
22-Aug-2019 20:22:56 testDelegatesToResolveStrategy2(org.eclipse.jdt.core.groovy.tests.search.Groovy21InferencingTests)  Time elapsed: 0.303 s
22-Aug-2019 20:22:56 testDelegatesToResolveStrategy3(org.eclipse.jdt.core.groovy.tests.search.Groovy21InferencingTests)  Time elapsed: 0.299 s
22-Aug-2019 20:22:56 testDelegatesToResolveStrategy4(org.eclipse.jdt.core.groovy.tests.search.Groovy21InferencingTests)  Time elapsed: 0.342 s
22-Aug-2019 20:22:56 testDelegatesToTarget2a(org.eclipse.jdt.core.groovy.tests.search.Groovy21InferencingTests)  Time elapsed: 0.313 s
22-Aug-2019 20:22:56 testTypeCheckingExtension(org.eclipse.jdt.core.groovy.tests.search.Groovy21InferencingTests)  Time elapsed: 0.661 s
22-Aug-2019 20:22:56 testDelegatesToTarget1(org.eclipse.jdt.core.groovy.tests.search.Groovy21InferencingTests)  Time elapsed: 0.327 s
22-Aug-2019 20:22:56 testDelegatesToTarget2(org.eclipse.jdt.core.groovy.tests.search.Groovy21InferencingTests)  Time elapsed: 0.327 s
22-Aug-2019 20:22:56 testDelegatesToTarget3(org.eclipse.jdt.core.groovy.tests.search.Groovy21InferencingTests)  Time elapsed: 0.335 s
22-Aug-2019 20:22:56 testDelegatesToTarget4(org.eclipse.jdt.core.groovy.tests.search.Groovy21InferencingTests)  Time elapsed: 0.592 s
22-Aug-2019 20:22:56 testDelegatesToTarget5(org.eclipse.jdt.core.groovy.tests.search.Groovy21InferencingTests)  Time elapsed: 0.41 s
22-Aug-2019 20:22:56 testDelegatesToTarget6(org.eclipse.jdt.core.groovy.tests.search.Groovy21InferencingTests)  Time elapsed: 0.482 s
22-Aug-2019 20:22:56 testDelegatesToValue2(org.eclipse.jdt.core.groovy.tests.search.Groovy21InferencingTests)  Time elapsed: 0.176 s
22-Aug-2019 20:22:56 testDelegatesToValue3(org.eclipse.jdt.core.groovy.tests.search.Groovy21InferencingTests)  Time elapsed: 0.195 s
22-Aug-2019 20:22:56 testDelegatesToValue4(org.eclipse.jdt.core.groovy.tests.search.Groovy21InferencingTests)  Time elapsed: 0.175 s
22-Aug-2019 20:22:56 testDelegatesToValue5(org.eclipse.jdt.core.groovy.tests.search.Groovy21InferencingTests)  Time elapsed: 0.18 s
22-Aug-2019 20:22:56 testDelegatesToValue6(org.eclipse.jdt.core.groovy.tests.search.Groovy21InferencingTests)  Time elapsed: 0.178 s
22-Aug-2019 20:22:56 testDelegatesToTypeName1(org.eclipse.jdt.core.groovy.tests.search.Groovy21InferencingTests)  Time elapsed: 0.21 s
22-Aug-2019 20:22:56 testDelegatesToTypeName2(org.eclipse.jdt.core.groovy.tests.search.Groovy21InferencingTests)  Time elapsed: 0.194 s
22-Aug-2019 20:22:56 testDelegatesToValue(org.eclipse.jdt.core.groovy.tests.search.Groovy21InferencingTests)  Time elapsed: 0.171 s
22-Aug-2019 20:22:56 testEnumOverrides(org.eclipse.jdt.core.groovy.tests.search.Groovy21InferencingTests)  Time elapsed: 0.194 s
22-Aug-2019 20:22:56 testEnumOverrides2(org.eclipse.jdt.core.groovy.tests.search.Groovy21InferencingTests)  Time elapsed: 0.21 s
22-Aug-2019 20:22:56 org.eclipse.jdt.core.groovy.tests.search.Groovy25InferencingTests skipped
22-Aug-2019 20:22:56 testFieldAndPropertyWithSameName(org.eclipse.jdt.core.groovy.tests.search.InferencingTests)  Time elapsed: 0.299 s
22-Aug-2019 20:22:56 testObjectMethodOnInterface(org.eclipse.jdt.core.groovy.tests.search.InferencingTests)  Time elapsed: 0.181 s
22-Aug-2019 20:22:56 testLocalWithInitializer1(org.eclipse.jdt.core.groovy.tests.search.InferencingTests)  Time elapsed: 0.228 s
22-Aug-2019 20:22:56 testLocalWithInitializer2(org.eclipse.jdt.core.groovy.tests.search.InferencingTests)  Time elapsed: 0.202 s
22-Aug-2019 20:22:56 testLocalWithInitializer3(org.eclipse.jdt.core.groovy.tests.search.InferencingTests)  Time elapsed: 0.175 s
22-Aug-2019 20:22:56 testLocalWithInitializer4(org.eclipse.jdt.core.groovy.tests.search.InferencingTests)  Time elapsed: 0.18 s
22-Aug-2019 20:22:56 testLocalWithInitializer5(org.eclipse.jdt.core.groovy.tests.search.InferencingTests)  Time elapsed: 0.191 s
22-Aug-2019 20:22:56 testNothingIsUnknown(org.eclipse.jdt.core.groovy.tests.search.InferencingTests)  Time elapsed: 0.207 s
22-Aug-2019 20:22:56 testInnerClass1(org.eclipse.jdt.core.groovy.tests.search.InferencingTests)  Time elapsed: 0.173 s
22-Aug-2019 20:22:56 testInnerClass2(org.eclipse.jdt.core.groovy.tests.search.InferencingTests)  Time elapsed: 0.183 s
22-Aug-2019 20:22:56 testInnerClass3(org.eclipse.jdt.core.groovy.tests.search.InferencingTests)  Time elapsed: 0.174 s
22-Aug-2019 20:22:56 testInnerClass4(org.eclipse.jdt.core.groovy.tests.search.InferencingTests)  Time elapsed: 0.169 s
22-Aug-2019 20:22:56 testInnerClass5(org.eclipse.jdt.core.groovy.tests.search.InferencingTests)  Time elapsed: 0.083 s
22-Aug-2019 20:22:56 testInnerClass6(org.eclipse.jdt.core.groovy.tests.search.InferencingTests)  Time elapsed: 0.144 s
22-Aug-2019 20:22:56 testInnerClass7(org.eclipse.jdt.core.groovy.tests.search.InferencingTests)  Time elapsed: 0.492 s
22-Aug-2019 20:22:56 testInnerClass8(org.eclipse.jdt.core.groovy.tests.search.InferencingTests)  Time elapsed: 0.478 s
22-Aug-2019 20:22:56 testInnerClass9(org.eclipse.jdt.core.groovy.tests.search.InferencingTests)  Time elapsed: 0.322 s
22-Aug-2019 20:22:56 testMethodOverloadsArgumentMatching1(org.eclipse.jdt.core.groovy.tests.search.InferencingTests)  Time elapsed: 0.359 s
22-Aug-2019 20:22:56 testMethodOverloadsArgumentMatching2(org.eclipse.jdt.core.groovy.tests.search.InferencingTests)  Time elapsed: 0.3 s
22-Aug-2019 20:22:56 testMethodOverloadsArgumentMatching3(org.eclipse.jdt.core.groovy.tests.search.InferencingTests)  Time elapsed: 0.342 s
22-Aug-2019 20:22:56 testMethodOverloadsArgumentMatching4(org.eclipse.jdt.core.groovy.tests.search.InferencingTests)  Time elapsed: 0.305 s
22-Aug-2019 20:22:56 testMethodOverloadsArgumentMatching5(org.eclipse.jdt.core.groovy.tests.search.InferencingTests)  Time elapsed: 0.272 s
22-Aug-2019 20:22:56 testMethodOverloadsArgumentMatching6(org.eclipse.jdt.core.groovy.tests.search.InferencingTests)  Time elapsed: 0.289 s
22-Aug-2019 20:22:56 testMethodOverloadsArgumentMatching7(org.eclipse.jdt.core.groovy.tests.search.InferencingTests)  Time elapsed: 0.334 s
22-Aug-2019 20:22:56 testBoolean1(org.eclipse.jdt.core.groovy.tests.search.InferencingTests)  Time elapsed: 0.207 s
22-Aug-2019 20:22:56 testBoolean2(org.eclipse.jdt.core.groovy.tests.search.InferencingTests)  Time elapsed: 0.176 s
22-Aug-2019 20:22:56 testBoolean3(org.eclipse.jdt.core.groovy.tests.search.InferencingTests)  Time elapsed: 0.167 s
22-Aug-2019 20:22:56 testBoolean4(org.eclipse.jdt.core.groovy.tests.search.InferencingTests)  Time elapsed: 0.21 s
22-Aug-2019 20:22:56 testBoolean5(org.eclipse.jdt.core.groovy.tests.search.InferencingTests)  Time elapsed: 0.167 s
22-Aug-2019 20:22:56 testBoolean6(org.eclipse.jdt.core.groovy.tests.search.InferencingTests)  Time elapsed: 0.207 s
22-Aug-2019 20:22:56 testBoolean7(org.eclipse.jdt.core.groovy.tests.search.InferencingTests)  Time elapsed: 0.202 s
22-Aug-2019 20:22:56 testDeclarationAtBeginningOfMethod(org.eclipse.jdt.core.groovy.tests.search.InferencingTests)  Time elapsed: 0.174 s
22-Aug-2019 20:22:56 testLocalTypeAndDefaultImportCollision(org.eclipse.jdt.core.groovy.tests.search.InferencingTests)  Time elapsed: 0.286 s
22-Aug-2019 20:22:56 testTernaryInitializer(org.eclipse.jdt.core.groovy.tests.search.InferencingTests)  Time elapsed: 0.167 s
22-Aug-2019 20:22:56 testSuperFieldReference3a(org.eclipse.jdt.core.groovy.tests.search.InferencingTests)  Time elapsed: 0.169 s
22-Aug-2019 20:22:56 testSuperFieldReference3b(org.eclipse.jdt.core.groovy.tests.search.InferencingTests)  Time elapsed: 0.204 s
22-Aug-2019 20:22:56 testSuperFieldReference3c(org.eclipse.jdt.core.groovy.tests.search.InferencingTests)  Time elapsed: 0.169 s
22-Aug-2019 20:22:56 testSuperFieldReference5a(org.eclipse.jdt.core.groovy.tests.search.InferencingTests)  Time elapsed: 0.183 s
22-Aug-2019 20:22:56 testSuperFieldReference5b(org.eclipse.jdt.core.groovy.tests.search.InferencingTests)  Time elapsed: 0.19 s
22-Aug-2019 20:22:56 testSpecialConstructor1(org.eclipse.jdt.core.groovy.tests.search.InferencingTests)  Time elapsed: 0.169 s
22-Aug-2019 20:22:56 testSpecialConstructor2(org.eclipse.jdt.core.groovy.tests.search.InferencingTests)  Time elapsed: 0.184 s
22-Aug-2019 20:22:56 testInnerClass10(org.eclipse.jdt.core.groovy.tests.search.InferencingTests)  Time elapsed: 0.332 s
22-Aug-2019 20:22:56 testInnerClass11(org.eclipse.jdt.core.groovy.tests.search.InferencingTests)  Time elapsed: 0.287 s
22-Aug-2019 20:22:56 testMultiDecl10(org.eclipse.jdt.core.groovy.tests.search.InferencingTests)  Time elapsed: 0.314 s
22-Aug-2019 20:22:56 testMultiDecl11(org.eclipse.jdt.core.groovy.tests.search.InferencingTests)  Time elapsed: 0.404 s
22-Aug-2019 20:22:56 testMultiDecl12(org.eclipse.jdt.core.groovy.tests.search.InferencingTests)  Time elapsed: 0.314 s
22-Aug-2019 20:22:56 testMultiDecl13(org.eclipse.jdt.core.groovy.tests.search.InferencingTests)  Time elapsed: 0.318 s
22-Aug-2019 20:22:56 testAsExpression1(org.eclipse.jdt.core.groovy.tests.search.InferencingTests)  Time elapsed: 0.172 s
22-Aug-2019 20:22:56 testAsExpression2(org.eclipse.jdt.core.groovy.tests.search.InferencingTests)  Time elapsed: 0.169 s
22-Aug-2019 20:22:56 testSuperClassMethod1(org.eclipse.jdt.core.groovy.tests.search.InferencingTests)  Time elapsed: 0.229 s
22-Aug-2019 20:22:56 testSuperClassMethod2(org.eclipse.jdt.core.groovy.tests.search.InferencingTests)  Time elapsed: 0.201 s
22-Aug-2019 20:22:56 testSuperClassMethod3(org.eclipse.jdt.core.groovy.tests.search.InferencingTests)  Time elapsed: 0.179 s
22-Aug-2019 20:22:56 testSuperClassMethod4(org.eclipse.jdt.core.groovy.tests.search.InferencingTests)  Time elapsed: 0.176 s
22-Aug-2019 20:22:56 testSuperClassMethod5(org.eclipse.jdt.core.groovy.tests.search.InferencingTests)  Time elapsed: 0.277 s
22-Aug-2019 20:22:56 testElvisInitializer(org.eclipse.jdt.core.groovy.tests.search.InferencingTests)  Time elapsed: 0.176 s
22-Aug-2019 20:22:56 testRangeExpression1(org.eclipse.jdt.core.groovy.tests.search.InferencingTests)  Time elapsed: 0.195 s
22-Aug-2019 20:22:56 testRangeExpression2(org.eclipse.jdt.core.groovy.tests.search.InferencingTests)  Time elapsed: 0.186 s
22-Aug-2019 20:22:56 testRangeExpression3(org.eclipse.jdt.core.groovy.tests.search.InferencingTests)  Time elapsed: 0.286 s
22-Aug-2019 20:22:56 testRangeExpression4(org.eclipse.jdt.core.groovy.tests.search.InferencingTests)  Time elapsed: 0.19 s
22-Aug-2019 20:22:56 testRangeExpression5(org.eclipse.jdt.core.groovy.tests.search.InferencingTests)  Time elapsed: 0.199 s
22-Aug-2019 20:22:56 testRangeExpression6(org.eclipse.jdt.core.groovy.tests.search.InferencingTests)  Time elapsed: 0.223 s
22-Aug-2019 20:22:56 testSpread10(org.eclipse.jdt.core.groovy.tests.search.InferencingTests)  Time elapsed: 0.162 s
22-Aug-2019 20:22:56 testSpread11(org.eclipse.jdt.core.groovy.tests.search.InferencingTests)  Time elapsed: 0.189 s
22-Aug-2019 20:22:56 testSpread12(org.eclipse.jdt.core.groovy.tests.search.InferencingTests)  Time elapsed: 0.189 s
22-Aug-2019 20:22:56 testSpread13(org.eclipse.jdt.core.groovy.tests.search.InferencingTests)  Time elapsed: 0.31 s
22-Aug-2019 20:22:56 testSpread14(org.eclipse.jdt.core.groovy.tests.search.InferencingTests)  Time elapsed: 0.2 s
22-Aug-2019 20:22:56 testSpread15(org.eclipse.jdt.core.groovy.tests.search.InferencingTests)  Time elapsed: 0.196 s
22-Aug-2019 20:22:56 testSpread16(org.eclipse.jdt.core.groovy.tests.search.InferencingTests)  Time elapsed: 0.221 s
22-Aug-2019 20:22:56 testSpread17(org.eclipse.jdt.core.groovy.tests.search.InferencingTests)  Time elapsed: 0.19 s
22-Aug-2019 20:22:56 testStaticThisAndSuper1(org.eclipse.jdt.core.groovy.tests.search.InferencingTests)  Time elapsed: 0.264 s
22-Aug-2019 20:22:56 testStaticThisAndSuper2(org.eclipse.jdt.core.groovy.tests.search.InferencingTests)  Time elapsed: 0.342 s
22-Aug-2019 20:22:56 testMethodOverloadsArgumentMatching4a(org.eclipse.jdt.core.groovy.tests.search.InferencingTests)  Time elapsed: 0.293 s
22-Aug-2019 20:22:56 testMethodOverloadsArgumentMatching4b(org.eclipse.jdt.core.groovy.tests.search.InferencingTests)  Time elapsed: 0.28 s
22-Aug-2019 20:22:56 testMethodOverloadsArgumentMatching5a(org.eclipse.jdt.core.groovy.tests.search.InferencingTests)  Time elapsed: 0.28 s
22-Aug-2019 20:22:56 testMethodOverloadsArgumentMatching5b(org.eclipse.jdt.core.groovy.tests.search.InferencingTests)  Time elapsed: 1.396 s
22-Aug-2019 20:22:56 testMethodOverloadsArgumentMatching6a(org.eclipse.jdt.core.groovy.tests.search.InferencingTests)  Time elapsed: 0.297 s
22-Aug-2019 20:22:56 testMethodOverloadsArgumentMatching6b(org.eclipse.jdt.core.groovy.tests.search.InferencingTests)  Time elapsed: 0.352 s
22-Aug-2019 20:22:56 testConstructor1(org.eclipse.jdt.core.groovy.tests.search.InferencingTests)  Time elapsed: 0.75 s
22-Aug-2019 20:22:56 testConstructor2(org.eclipse.jdt.core.groovy.tests.search.InferencingTests)  Time elapsed: 0.69 s
22-Aug-2019 20:22:56 testConstructor3(org.eclipse.jdt.core.groovy.tests.search.InferencingTests)  Time elapsed: 0.409 s
22-Aug-2019 20:22:56 testConstructor4(org.eclipse.jdt.core.groovy.tests.search.InferencingTests)  Time elapsed: 1.238 s
22-Aug-2019 20:22:56 testConstructor5(org.eclipse.jdt.core.groovy.tests.search.InferencingTests)  Time elapsed: 0.494 s
22-Aug-2019 20:22:56 testConstructor6(org.eclipse.jdt.core.groovy.tests.search.InferencingTests)  Time elapsed: 1.57 s
22-Aug-2019 20:22:56 testInterfaceMethodsAsProperty(org.eclipse.jdt.core.groovy.tests.search.InferencingTests)  Time elapsed: 0.264 s
22-Aug-2019 20:22:56 testStaticMethod1(org.eclipse.jdt.core.groovy.tests.search.InferencingTests)  Time elapsed: 0.167 s
22-Aug-2019 20:22:56 testStaticMethod2(org.eclipse.jdt.core.groovy.tests.search.InferencingTests)  Time elapsed: 0.219 s
22-Aug-2019 20:22:56 testStaticMethod3(org.eclipse.jdt.core.groovy.tests.search.InferencingTests)  Time elapsed: 0.108 s
22-Aug-2019 20:22:56 testStaticMethod4(org.eclipse.jdt.core.groovy.tests.search.InferencingTests)  Time elapsed: 1.458 s
22-Aug-2019 20:22:56 testStaticMethod5(org.eclipse.jdt.core.groovy.tests.search.InferencingTests)  Time elapsed: 0.126 s
22-Aug-2019 20:22:56 testStaticMethod6(org.eclipse.jdt.core.groovy.tests.search.InferencingTests)  Time elapsed: 0.122 s
22-Aug-2019 20:22:56 testStaticMethod7(org.eclipse.jdt.core.groovy.tests.search.InferencingTests)  Time elapsed: 0.201 s
22-Aug-2019 20:22:56 testStaticMethod8(org.eclipse.jdt.core.groovy.tests.search.InferencingTests)  Time elapsed: 0.188 s
22-Aug-2019 20:22:56 testStaticMethod9(org.eclipse.jdt.core.groovy.tests.search.InferencingTests)  Time elapsed: 0.192 s
22-Aug-2019 20:22:56 testClassWithInitializer1(org.eclipse.jdt.core.groovy.tests.search.InferencingTests)  Time elapsed: 1.257 s
22-Aug-2019 20:22:56 testClassWithInitializer2(org.eclipse.jdt.core.groovy.tests.search.InferencingTests)  Time elapsed: 0.173 s
22-Aug-2019 20:22:56 testClassWithInitializer3(org.eclipse.jdt.core.groovy.tests.search.InferencingTests)  Time elapsed: 0.199 s
22-Aug-2019 20:22:56 testPostfix(org.eclipse.jdt.core.groovy.tests.search.InferencingTests)  Time elapsed: 0.162 s
22-Aug-2019 20:22:56 testSuperClassMethod4a(org.eclipse.jdt.core.groovy.tests.search.InferencingTests)  Time elapsed: 0.187 s
22-Aug-2019 20:22:56 testSuperClassMethod4b(org.eclipse.jdt.core.groovy.tests.search.InferencingTests)  Time elapsed: 1.477 s
22-Aug-2019 20:22:56 testSuperClassMethod4c(org.eclipse.jdt.core.groovy.tests.search.InferencingTests)  Time elapsed: 0.177 s
22-Aug-2019 20:22:56 testSuperClassMethod5a(org.eclipse.jdt.core.groovy.tests.search.InferencingTests)  Time elapsed: 0.402 s
22-Aug-2019 20:22:56 testSuperClassMethod5b(org.eclipse.jdt.core.groovy.tests.search.InferencingTests)  Time elapsed: 0.29 s
22-Aug-2019 20:22:56 testListSort1(org.eclipse.jdt.core.groovy.tests.search.InferencingTests)  Time elapsed: 1.255 s
22-Aug-2019 20:22:56 testListSort2(org.eclipse.jdt.core.groovy.tests.search.InferencingTests)  Time elapsed: 0.408 s
22-Aug-2019 20:22:56 testListSort3(org.eclipse.jdt.core.groovy.tests.search.InferencingTests)  Time elapsed: 0.288 s
22-Aug-2019 20:22:56 testLocalVar1(org.eclipse.jdt.core.groovy.tests.search.InferencingTests)  Time elapsed: 0.171 s
22-Aug-2019 20:22:56 testLocalVar2(org.eclipse.jdt.core.groovy.tests.search.InferencingTests)  Time elapsed: 1.518 s
22-Aug-2019 20:22:56 testLocalVar3(org.eclipse.jdt.core.groovy.tests.search.InferencingTests)  Time elapsed: 0.192 s
22-Aug-2019 20:22:56 testLocalVar4(org.eclipse.jdt.core.groovy.tests.search.InferencingTests)  Time elapsed: 0.181 s
22-Aug-2019 20:22:56 testLocalVar5(org.eclipse.jdt.core.groovy.tests.search.InferencingTests)  Time elapsed: 0.163 s
22-Aug-2019 20:22:56 testLocalVar6(org.eclipse.jdt.core.groovy.tests.search.InferencingTests)  Time elapsed: 0.174 s
22-Aug-2019 20:22:56 testLocalVar7(org.eclipse.jdt.core.groovy.tests.search.InferencingTests)  Time elapsed: 1.15 s
22-Aug-2019 20:22:56 testLocalVar8(org.eclipse.jdt.core.groovy.tests.search.InferencingTests)  Time elapsed: 0.173 s
22-Aug-2019 20:22:56 testLocalVar9(org.eclipse.jdt.core.groovy.tests.search.InferencingTests)  Time elapsed: 0.187 s
22-Aug-2019 20:22:56 testIndirectInterfaceMethod(org.eclipse.jdt.core.groovy.tests.search.InferencingTests)  Time elapsed: 0.404 s
22-Aug-2019 20:22:56 testMapLiteral(org.eclipse.jdt.core.groovy.tests.search.InferencingTests)  Time elapsed: 1.513 s
22-Aug-2019 20:22:56 testListRemove(org.eclipse.jdt.core.groovy.tests.search.InferencingTests)  Time elapsed: 0.283 s
22-Aug-2019 20:22:56 testCategoryMethodAsProperty(org.eclipse.jdt.core.groovy.tests.search.InferencingTests)  Time elapsed: 0.195 s
22-Aug-2019 20:22:56 testNothingIsUnknownWithCategories(org.eclipse.jdt.core.groovy.tests.search.InferencingTests)  Time elapsed: 0.193 s
22-Aug-2019 20:22:56 testImplicitVar1(org.eclipse.jdt.core.groovy.tests.search.InferencingTests)  Time elapsed: 0.185 s
22-Aug-2019 20:22:56 testImplicitVar2(org.eclipse.jdt.core.groovy.tests.search.InferencingTests)  Time elapsed: 1.468 s
22-Aug-2019 20:22:56 testImplicitVar3(org.eclipse.jdt.core.groovy.tests.search.InferencingTests)  Time elapsed: 0.174 s
22-Aug-2019 20:22:56 testImplicitVar4(org.eclipse.jdt.core.groovy.tests.search.InferencingTests)  Time elapsed: 0.303 s
22-Aug-2019 20:22:56 testImplicitVar5(org.eclipse.jdt.core.groovy.tests.search.InferencingTests)  Time elapsed: 0.191 s
22-Aug-2019 20:22:56 testImplicitVar6(org.eclipse.jdt.core.groovy.tests.search.InferencingTests)  Time elapsed: 0.171 s
22-Aug-2019 20:22:56 testImplicitVar7(org.eclipse.jdt.core.groovy.tests.search.InferencingTests)  Time elapsed: 1.487 s
22-Aug-2019 20:22:56 testClassLiteral1(org.eclipse.jdt.core.groovy.tests.search.InferencingTests)  Time elapsed: 0.174 s
22-Aug-2019 20:22:56 testClassLiteral2(org.eclipse.jdt.core.groovy.tests.search.InferencingTests)  Time elapsed: 0.082 s
22-Aug-2019 20:22:56 testClassLiteral3(org.eclipse.jdt.core.groovy.tests.search.InferencingTests)  Time elapsed: 0.168 s
22-Aug-2019 20:22:56 testClassLiteral4(org.eclipse.jdt.core.groovy.tests.search.InferencingTests)  Time elapsed: 0.223 s
22-Aug-2019 20:22:56 testClassLiteral5(org.eclipse.jdt.core.groovy.tests.search.InferencingTests)  Time elapsed: 1.617 s
22-Aug-2019 20:22:56 testScriptDeclaringType(org.eclipse.jdt.core.groovy.tests.search.InferencingTests)  Time elapsed: 0.193 s
22-Aug-2019 20:22:56 testInstanceOf10(org.eclipse.jdt.core.groovy.tests.search.InferencingTests)  Time elapsed: 0.602 s
22-Aug-2019 20:22:56 testInstanceOf11(org.eclipse.jdt.core.groovy.tests.search.InferencingTests)  Time elapsed: 2.008 s
22-Aug-2019 20:22:56 testInstanceOf1a(org.eclipse.jdt.core.groovy.tests.search.InferencingTests)  Time elapsed: 0.605 s
22-Aug-2019 20:22:56 testInstanceOf1b(org.eclipse.jdt.core.groovy.tests.search.InferencingTests)  Time elapsed: 2.112 s
22-Aug-2019 20:22:56 testThisInInnerClass(org.eclipse.jdt.core.groovy.tests.search.InferencingTests)  Time elapsed: 0.302 s
22-Aug-2019 20:22:56 testStaticImports1(org.eclipse.jdt.core.groovy.tests.search.InferencingTests)  Time elapsed: 1.47 s
22-Aug-2019 20:22:56 testStaticImports2(org.eclipse.jdt.core.groovy.tests.search.InferencingTests)  Time elapsed: 0.214 s
22-Aug-2019 20:22:56 testStaticImports3(org.eclipse.jdt.core.groovy.tests.search.InferencingTests)  Time elapsed: 0.188 s
22-Aug-2019 20:22:56 testStaticImports4(org.eclipse.jdt.core.groovy.tests.search.InferencingTests)  Time elapsed: 0.2 s
22-Aug-2019 20:22:56 testMultiDecl1(org.eclipse.jdt.core.groovy.tests.search.InferencingTests)  Time elapsed: 0.988 s
22-Aug-2019 20:22:56 testMultiDecl2(org.eclipse.jdt.core.groovy.tests.search.InferencingTests)  Time elapsed: 0.297 s
22-Aug-2019 20:22:56 testMultiDecl3(org.eclipse.jdt.core.groovy.tests.search.InferencingTests)  Time elapsed: 0.282 s
22-Aug-2019 20:22:56 testMultiDecl4(org.eclipse.jdt.core.groovy.tests.search.InferencingTests)  Time elapsed: 0.312 s
22-Aug-2019 20:22:56 testMultiDecl6(org.eclipse.jdt.core.groovy.tests.search.InferencingTests)  Time elapsed: 1.661 s
22-Aug-2019 20:22:56 testMultiDecl7(org.eclipse.jdt.core.groovy.tests.search.InferencingTests)  Time elapsed: 0.279 s
22-Aug-2019 20:22:56 testMultiDecl8(org.eclipse.jdt.core.groovy.tests.search.InferencingTests)  Time elapsed: 0.285 s
22-Aug-2019 20:22:56 testMultiDecl9(org.eclipse.jdt.core.groovy.tests.search.InferencingTests)  Time elapsed: 1.25 s
22-Aug-2019 20:22:56 testLocalMethod1(org.eclipse.jdt.core.groovy.tests.search.InferencingTests)  Time elapsed: 0.182 s
22-Aug-2019 20:22:56 testLocalMethod2(org.eclipse.jdt.core.groovy.tests.search.InferencingTests)  Time elapsed: 0.175 s
22-Aug-2019 20:22:56 testLocalMethod3(org.eclipse.jdt.core.groovy.tests.search.InferencingTests)  Time elapsed: 0.193 s
22-Aug-2019 20:22:56 testLocalMethod4(org.eclipse.jdt.core.groovy.tests.search.InferencingTests)  Time elapsed: 1.23 s
22-Aug-2019 20:22:56 testLocalMethod5(org.eclipse.jdt.core.groovy.tests.search.InferencingTests)  Time elapsed: 0.173 s
22-Aug-2019 20:22:56 testLocalVar10(org.eclipse.jdt.core.groovy.tests.search.InferencingTests)  Time elapsed: 0.182 s
22-Aug-2019 20:22:56 testLocalVar11(org.eclipse.jdt.core.groovy.tests.search.InferencingTests)  Time elapsed: 0.174 s
22-Aug-2019 20:22:56 testLocalVar12(org.eclipse.jdt.core.groovy.tests.search.InferencingTests)  Time elapsed: 0.976 s
22-Aug-2019 20:22:56 testLocalVar13(org.eclipse.jdt.core.groovy.tests.search.InferencingTests)  Time elapsed: 0.197 s
22-Aug-2019 20:22:56 testLocalVar14(org.eclipse.jdt.core.groovy.tests.search.InferencingTests)  Time elapsed: 0.202 s
22-Aug-2019 20:22:56 testLocalVar15(org.eclipse.jdt.core.groovy.tests.search.InferencingTests)  Time elapsed: 1.294 s
22-Aug-2019 20:22:56 testLocalVar16(org.eclipse.jdt.core.groovy.tests.search.InferencingTests)  Time elapsed: 0.521 s
22-Aug-2019 20:22:56 testLocalVar17(org.eclipse.jdt.core.groovy.tests.search.InferencingTests)  Time elapsed: 1.242 s
22-Aug-2019 20:22:56 testLocalVar18(org.eclipse.jdt.core.groovy.tests.search.InferencingTests)  Time elapsed: 0.658 s
22-Aug-2019 20:22:56 testLocalVar19(org.eclipse.jdt.core.groovy.tests.search.InferencingTests)  Time elapsed: 1.518 s
22-Aug-2019 20:22:56 testLocalVar20(org.eclipse.jdt.core.groovy.tests.search.InferencingTests)  Time elapsed: 0.549 s
22-Aug-2019 20:22:56 testLocalVar21(org.eclipse.jdt.core.groovy.tests.search.InferencingTests)  Time elapsed: 1.329 s
22-Aug-2019 20:22:56 testLocalVar22(org.eclipse.jdt.core.groovy.tests.search.InferencingTests)  Time elapsed: 1.333 s
22-Aug-2019 20:22:56 testLocalVar23(org.eclipse.jdt.core.groovy.tests.search.InferencingTests)  Time elapsed: 0.666 s
22-Aug-2019 20:22:56 testLocalVar24(org.eclipse.jdt.core.groovy.tests.search.InferencingTests)  Time elapsed: 1.734 s
22-Aug-2019 20:22:56 testLocalVar25(org.eclipse.jdt.core.groovy.tests.search.InferencingTests)  Time elapsed: 2.2 s
22-Aug-2019 20:22:56 testLocalVar26(org.eclipse.jdt.core.groovy.tests.search.InferencingTests)  Time elapsed: 0.192 s
22-Aug-2019 20:22:56 testLocalVar27(org.eclipse.jdt.core.groovy.tests.search.InferencingTests)  Time elapsed: 0.185 s
22-Aug-2019 20:22:56 testLocalVar28(org.eclipse.jdt.core.groovy.tests.search.InferencingTests)  Time elapsed: 1.159 s
22-Aug-2019 20:22:56 testNoGString(org.eclipse.jdt.core.groovy.tests.search.InferencingTests)  Time elapsed: 0.18 s
22-Aug-2019 20:22:56 testObjectMethodOnInterfaceAsProperty(org.eclipse.jdt.core.groovy.tests.search.InferencingTests)  Time elapsed: 0.207 s
22-Aug-2019 20:22:56 testMatcher1(org.eclipse.jdt.core.groovy.tests.search.InferencingTests)  Time elapsed: 0.189 s
22-Aug-2019 20:22:56 testMatcher2(org.eclipse.jdt.core.groovy.tests.search.InferencingTests)  Time elapsed: 1.222 s
22-Aug-2019 20:22:56 testCatchBlock1(org.eclipse.jdt.core.groovy.tests.search.InferencingTests)  Time elapsed: 0.185 s
22-Aug-2019 20:22:56 testCatchBlock2(org.eclipse.jdt.core.groovy.tests.search.InferencingTests)  Time elapsed: 0.181 s
22-Aug-2019 20:22:56 testCatchBlock3(org.eclipse.jdt.core.groovy.tests.search.InferencingTests)  Time elapsed: 0.203 s
22-Aug-2019 20:22:56 testCatchBlock4(org.eclipse.jdt.core.groovy.tests.search.InferencingTests)  Time elapsed: 1.1 s
22-Aug-2019 20:22:56 testCatchBlock5(org.eclipse.jdt.core.groovy.tests.search.InferencingTests)  Time elapsed: 0.149 s
22-Aug-2019 20:22:56 testInterfaceMethodAsProperty2(org.eclipse.jdt.core.groovy.tests.search.InferencingTests)  Time elapsed: 0.31 s
22-Aug-2019 20:22:56 testInterfaceMethodAsProperty3(org.eclipse.jdt.core.groovy.tests.search.InferencingTests)  Time elapsed: 1.39 s
22-Aug-2019 20:22:56 testGetAt1(org.eclipse.jdt.core.groovy.tests.search.InferencingTests)  Time elapsed: 0.196 s
22-Aug-2019 20:22:56 testGetAt2(org.eclipse.jdt.core.groovy.tests.search.InferencingTests)  Time elapsed: 0.21 s
22-Aug-2019 20:22:56 testGetAt3(org.eclipse.jdt.core.groovy.tests.search.InferencingTests)  Time elapsed: 1.326 s
22-Aug-2019 20:22:56 testGetAt4(org.eclipse.jdt.core.groovy.tests.search.InferencingTests)  Time elapsed: 0.199 s
22-Aug-2019 20:22:56 testGetAt5(org.eclipse.jdt.core.groovy.tests.search.InferencingTests)  Time elapsed: 0.297 s
22-Aug-2019 20:22:56 testGetAt6(org.eclipse.jdt.core.groovy.tests.search.InferencingTests)  Time elapsed: 1.577 s
22-Aug-2019 20:22:56 testGetAt7(org.eclipse.jdt.core.groovy.tests.search.InferencingTests)  Time elapsed: 0.3 s
22-Aug-2019 20:22:56 testGetAt8(org.eclipse.jdt.core.groovy.tests.search.InferencingTests) skipped
22-Aug-2019 20:22:56 testGetAt9(org.eclipse.jdt.core.groovy.tests.search.InferencingTests) skipped
22-Aug-2019 20:22:56 testFieldWithInitializer1(org.eclipse.jdt.core.groovy.tests.search.InferencingTests)  Time elapsed: 0.188 s
22-Aug-2019 20:22:56 testFieldWithInitializer2(org.eclipse.jdt.core.groovy.tests.search.InferencingTests)  Time elapsed: 0.204 s
22-Aug-2019 20:22:56 testNested1(org.eclipse.jdt.core.groovy.tests.search.InferencingTests)  Time elapsed: 0.174 s
22-Aug-2019 20:22:56 testNested2(org.eclipse.jdt.core.groovy.tests.search.InferencingTests)  Time elapsed: 1.213 s
22-Aug-2019 20:22:56 testNested3(org.eclipse.jdt.core.groovy.tests.search.InferencingTests)  Time elapsed: 0.189 s
22-Aug-2019 20:22:56 testNested4(org.eclipse.jdt.core.groovy.tests.search.InferencingTests)  Time elapsed: 0.185 s
22-Aug-2019 20:22:56 testIndirectInterfaceConstant(org.eclipse.jdt.core.groovy.tests.search.InferencingTests)  Time elapsed: 1.705 s
22-Aug-2019 20:22:56 testInstanceOf1(org.eclipse.jdt.core.groovy.tests.search.InferencingTests)  Time elapsed: 0.515 s
22-Aug-2019 20:22:56 testInstanceOf2(org.eclipse.jdt.core.groovy.tests.search.InferencingTests)  Time elapsed: 1.22 s
22-Aug-2019 20:22:56 testInstanceOf3(org.eclipse.jdt.core.groovy.tests.search.InferencingTests)  Time elapsed: 1.568 s
22-Aug-2019 20:22:56 testInstanceOf4(org.eclipse.jdt.core.groovy.tests.search.InferencingTests)  Time elapsed: 2.035 s
22-Aug-2019 20:22:56 testInstanceOf5(org.eclipse.jdt.core.groovy.tests.search.InferencingTests)  Time elapsed: 6.316 s
22-Aug-2019 20:22:56 testInstanceOf6(org.eclipse.jdt.core.groovy.tests.search.InferencingTests)  Time elapsed: 0.656 s
22-Aug-2019 20:22:56 testInstanceOf7(org.eclipse.jdt.core.groovy.tests.search.InferencingTests)  Time elapsed: 1.635 s
22-Aug-2019 20:22:56 testInstanceOf8(org.eclipse.jdt.core.groovy.tests.search.InferencingTests)  Time elapsed: 1.386 s
22-Aug-2019 20:22:56 testInstanceOf9(org.eclipse.jdt.core.groovy.tests.search.InferencingTests)  Time elapsed: 1.324 s
22-Aug-2019 20:22:56 testAnonInner1(org.eclipse.jdt.core.groovy.tests.search.InferencingTests)  Time elapsed: 0.196 s
22-Aug-2019 20:22:56 testAnonInner2(org.eclipse.jdt.core.groovy.tests.search.InferencingTests)  Time elapsed: 0.206 s
22-Aug-2019 20:22:56 testAnonInner3(org.eclipse.jdt.core.groovy.tests.search.InferencingTests)  Time elapsed: 1.202 s
22-Aug-2019 20:22:56 testAnonInner4(org.eclipse.jdt.core.groovy.tests.search.InferencingTests)  Time elapsed: 0.22 s
22-Aug-2019 20:22:56 testAnonInner5(org.eclipse.jdt.core.groovy.tests.search.InferencingTests)  Time elapsed: 0.197 s
22-Aug-2019 20:22:56 testAnonInner6(org.eclipse.jdt.core.groovy.tests.search.InferencingTests)  Time elapsed: 1.536 s
22-Aug-2019 20:22:56 testAnonInner7(org.eclipse.jdt.core.groovy.tests.search.InferencingTests)  Time elapsed: 0.612 s
22-Aug-2019 20:22:56 testNumber1(org.eclipse.jdt.core.groovy.tests.search.InferencingTests)  Time elapsed: 1.059 s
22-Aug-2019 20:22:56 testNumber2(org.eclipse.jdt.core.groovy.tests.search.InferencingTests)  Time elapsed: 0.2 s
22-Aug-2019 20:22:56 testNumber3(org.eclipse.jdt.core.groovy.tests.search.InferencingTests)  Time elapsed: 0.214 s
22-Aug-2019 20:22:56 testNumber4(org.eclipse.jdt.core.groovy.tests.search.InferencingTests)  Time elapsed: 1.188 s
22-Aug-2019 20:22:56 testNumber5(org.eclipse.jdt.core.groovy.tests.search.InferencingTests)  Time elapsed: 0.203 s
22-Aug-2019 20:22:56 testNumber6(org.eclipse.jdt.core.groovy.tests.search.InferencingTests)  Time elapsed: 0.187 s
22-Aug-2019 20:22:56 testSpread1(org.eclipse.jdt.core.groovy.tests.search.InferencingTests)  Time elapsed: 1.128 s
22-Aug-2019 20:22:56 testSpread2(org.eclipse.jdt.core.groovy.tests.search.InferencingTests)  Time elapsed: 0.208 s
22-Aug-2019 20:22:56 testSpread3(org.eclipse.jdt.core.groovy.tests.search.InferencingTests)  Time elapsed: 0.21 s
22-Aug-2019 20:22:56 testSpread4(org.eclipse.jdt.core.groovy.tests.search.InferencingTests)  Time elapsed: 1.441 s
22-Aug-2019 20:22:56 testSpread5(org.eclipse.jdt.core.groovy.tests.search.InferencingTests)  Time elapsed: 0.324 s
22-Aug-2019 20:22:56 testSpread6(org.eclipse.jdt.core.groovy.tests.search.InferencingTests)  Time elapsed: 0.183 s
22-Aug-2019 20:22:56 testSpread7(org.eclipse.jdt.core.groovy.tests.search.InferencingTests)  Time elapsed: 1.021 s
22-Aug-2019 20:22:56 testSpread8(org.eclipse.jdt.core.groovy.tests.search.InferencingTests)  Time elapsed: 0.213 s
22-Aug-2019 20:22:56 testSpread9(org.eclipse.jdt.core.groovy.tests.search.InferencingTests)  Time elapsed: 0.207 s
22-Aug-2019 20:22:56 testPattern1(org.eclipse.jdt.core.groovy.tests.search.InferencingTests)  Time elapsed: 0.199 s
22-Aug-2019 20:22:56 testPattern2(org.eclipse.jdt.core.groovy.tests.search.InferencingTests)  Time elapsed: 1.074 s
22-Aug-2019 20:22:56 testClassReference2a(org.eclipse.jdt.core.groovy.tests.search.InferencingTests)  Time elapsed: 0.279 s
22-Aug-2019 20:22:56 testClassReference3a(org.eclipse.jdt.core.groovy.tests.search.InferencingTests)  Time elapsed: 0.284 s
22-Aug-2019 20:22:56 testClassReference4a(org.eclipse.jdt.core.groovy.tests.search.InferencingTests)  Time elapsed: 0.999 s
22-Aug-2019 20:22:56 testClassReference4b(org.eclipse.jdt.core.groovy.tests.search.InferencingTests)  Time elapsed: 0.33 s
22-Aug-2019 20:22:56 testString1(org.eclipse.jdt.core.groovy.tests.search.InferencingTests)  Time elapsed: 0.955 s
22-Aug-2019 20:22:56 testString2(org.eclipse.jdt.core.groovy.tests.search.InferencingTests)  Time elapsed: 0.184 s
22-Aug-2019 20:22:56 testString3(org.eclipse.jdt.core.groovy.tests.search.InferencingTests)  Time elapsed: 0.187 s
22-Aug-2019 20:22:56 testSuperFieldReference1(org.eclipse.jdt.core.groovy.tests.search.InferencingTests)  Time elapsed: 0.193 s
22-Aug-2019 20:22:56 testSuperFieldReference2(org.eclipse.jdt.core.groovy.tests.search.InferencingTests)  Time elapsed: 0.9 s
22-Aug-2019 20:22:56 testSuperFieldReference3(org.eclipse.jdt.core.groovy.tests.search.InferencingTests)  Time elapsed: 0.209 s
22-Aug-2019 20:22:56 testSuperFieldReference4(org.eclipse.jdt.core.groovy.tests.search.InferencingTests)  Time elapsed: 0.194 s
22-Aug-2019 20:22:56 testSuperFieldReference5(org.eclipse.jdt.core.groovy.tests.search.InferencingTests)  Time elapsed: 1.13 s
22-Aug-2019 20:22:56 testClassReference1(org.eclipse.jdt.core.groovy.tests.search.InferencingTests)  Time elapsed: 0.179 s
22-Aug-2019 20:22:56 testClassReference2(org.eclipse.jdt.core.groovy.tests.search.InferencingTests)  Time elapsed: 0.292 s
22-Aug-2019 20:22:56 testClassReference3(org.eclipse.jdt.core.groovy.tests.search.InferencingTests)  Time elapsed: 1.124 s
22-Aug-2019 20:22:56 testClassReference4(org.eclipse.jdt.core.groovy.tests.search.InferencingTests)  Time elapsed: 0.327 s
22-Aug-2019 20:22:56 testPropertyNodeFromJava1(org.eclipse.jdt.core.groovy.tests.search.JDTPropertyNodeInferencingTests)  Time elapsed: 1.314 s
22-Aug-2019 20:22:56 testPropertyNodeFromJava2(org.eclipse.jdt.core.groovy.tests.search.JDTPropertyNodeInferencingTests)  Time elapsed: 0.221 s
22-Aug-2019 20:22:56 testPropertyNodeFromJava3(org.eclipse.jdt.core.groovy.tests.search.JDTPropertyNodeInferencingTests)  Time elapsed: 0.189 s
22-Aug-2019 20:22:56 testPropertyNodeFromJava4(org.eclipse.jdt.core.groovy.tests.search.JDTPropertyNodeInferencingTests)  Time elapsed: 0.212 s
22-Aug-2019 20:22:56 testNodeFromJava1(org.eclipse.jdt.core.groovy.tests.search.JDTPropertyNodeInferencingTests)  Time elapsed: 1.068 s
22-Aug-2019 20:22:56 testPropertyNodeReferenceInBinary1(org.eclipse.jdt.core.groovy.tests.search.JDTPropertyNodeInferencingTests)  Time elapsed: 0.2 s
22-Aug-2019 20:22:56 testVarReferenceInGString1(org.eclipse.jdt.core.groovy.tests.search.LocalVariableReferenceSearchTests)  Time elapsed: 0.224 s
22-Aug-2019 20:22:56 testVarReferenceInGString2(org.eclipse.jdt.core.groovy.tests.search.LocalVariableReferenceSearchTests)  Time elapsed: 1.209 s
22-Aug-2019 20:22:56 testVarReferenceInGString3(org.eclipse.jdt.core.groovy.tests.search.LocalVariableReferenceSearchTests)  Time elapsed: 0.196 s
22-Aug-2019 20:22:56 testVarReferenceInGString4(org.eclipse.jdt.core.groovy.tests.search.LocalVariableReferenceSearchTests)  Time elapsed: 0.196 s
22-Aug-2019 20:22:56 testVarReferenceInGString5(org.eclipse.jdt.core.groovy.tests.search.LocalVariableReferenceSearchTests)  Time elapsed: 0.894 s
22-Aug-2019 20:22:56 testVarReference10(org.eclipse.jdt.core.groovy.tests.search.LocalVariableReferenceSearchTests)  Time elapsed: 0.213 s
22-Aug-2019 20:22:56 testVarReference1(org.eclipse.jdt.core.groovy.tests.search.LocalVariableReferenceSearchTests)  Time elapsed: 0.19 s
22-Aug-2019 20:22:56 testVarReference2(org.eclipse.jdt.core.groovy.tests.search.LocalVariableReferenceSearchTests)  Time elapsed: 0.185 s
22-Aug-2019 20:22:56 testVarReference3(org.eclipse.jdt.core.groovy.tests.search.LocalVariableReferenceSearchTests)  Time elapsed: 0.912 s
22-Aug-2019 20:22:56 testVarReference4(org.eclipse.jdt.core.groovy.tests.search.LocalVariableReferenceSearchTests)  Time elapsed: 0.189 s
22-Aug-2019 20:22:56 testVarReference5(org.eclipse.jdt.core.groovy.tests.search.LocalVariableReferenceSearchTests)  Time elapsed: 0.169 s
22-Aug-2019 20:22:56 testVarReference6(org.eclipse.jdt.core.groovy.tests.search.LocalVariableReferenceSearchTests)  Time elapsed: 0.944 s
22-Aug-2019 20:22:56 testVarReference7(org.eclipse.jdt.core.groovy.tests.search.LocalVariableReferenceSearchTests)  Time elapsed: 0.193 s
22-Aug-2019 20:22:56 testVarReference8(org.eclipse.jdt.core.groovy.tests.search.LocalVariableReferenceSearchTests)  Time elapsed: 0.197 s
22-Aug-2019 20:22:56 testVarReference9(org.eclipse.jdt.core.groovy.tests.search.LocalVariableReferenceSearchTests)  Time elapsed: 0.17 s
22-Aug-2019 20:22:56 testExplicitPropertySetterSearch1(org.eclipse.jdt.core.groovy.tests.search.MethodReferenceSearchTests)  Time elapsed: 1.174 s  <<< FAILURE!
22-Aug-2019 20:22:56 java.lang.AssertionError: expected:<5> but was:<0>
22-Aug-2019 20:22:56         at org.eclipse.jdt.core.groovy.tests.search.MethodReferenceSearchTests.testExplicitPropertySetterSearch1(MethodReferenceSearchTests.java:549)
22-Aug-2019 20:22:56
22-Aug-2019 20:22:56 testExplicitPropertySetterSearch2(org.eclipse.jdt.core.groovy.tests.search.MethodReferenceSearchTests)  Time elapsed: 0.723 s
22-Aug-2019 20:22:56 testOverloadedMethodReferences1(org.eclipse.jdt.core.groovy.tests.search.MethodReferenceSearchTests)  Time elapsed: 0.242 s
22-Aug-2019 20:22:56 testOverloadedMethodReferences2(org.eclipse.jdt.core.groovy.tests.search.MethodReferenceSearchTests)  Time elapsed: 1.773 s
22-Aug-2019 20:22:56 testOverloadedMethodReferences3(org.eclipse.jdt.core.groovy.tests.search.MethodReferenceSearchTests)  Time elapsed: 0.301 s
22-Aug-2019 20:22:56 testOverloadedMethodReferences4(org.eclipse.jdt.core.groovy.tests.search.MethodReferenceSearchTests)  Time elapsed: 1.351 s
22-Aug-2019 20:22:56 testOverloadedMethodReferences5(org.eclipse.jdt.core.groovy.tests.search.MethodReferenceSearchTests)  Time elapsed: 0.268 s
22-Aug-2019 20:22:56 testOverloadedMethodReferences6(org.eclipse.jdt.core.groovy.tests.search.MethodReferenceSearchTests)  Time elapsed: 1.369 s
22-Aug-2019 20:22:56 testStaticMethodReferenceSearch(org.eclipse.jdt.core.groovy.tests.search.MethodReferenceSearchTests)  Time elapsed: 0.126 s
22-Aug-2019 20:22:56 testMethodReferencesInClass1(org.eclipse.jdt.core.groovy.tests.search.MethodReferenceSearchTests)  Time elapsed: 0.248 s
22-Aug-2019 20:22:56 testMethodReferencesInClass2(org.eclipse.jdt.core.groovy.tests.search.MethodReferenceSearchTests)  Time elapsed: 1.187 s
22-Aug-2019 20:22:56 testMethodReferencesInClass3(org.eclipse.jdt.core.groovy.tests.search.MethodReferenceSearchTests)  Time elapsed: 0.266 s
22-Aug-2019 20:22:56 testGenericsMethodReferenceSearch(org.eclipse.jdt.core.groovy.tests.search.MethodReferenceSearchTests)  Time elapsed: 0.276 s
22-Aug-2019 20:22:56 testMethodReferencesInScript1(org.eclipse.jdt.core.groovy.tests.search.MethodReferenceSearchTests)  Time elapsed: 0.965 s
22-Aug-2019 20:22:56 testMethodReferencesInScript2(org.eclipse.jdt.core.groovy.tests.search.MethodReferenceSearchTests)  Time elapsed: 0.255 s
22-Aug-2019 20:22:56 testMethodReferencesInScript3(org.eclipse.jdt.core.groovy.tests.search.MethodReferenceSearchTests)  Time elapsed: 0.239 s
22-Aug-2019 20:22:56 testMethodReferencesInScript4(org.eclipse.jdt.core.groovy.tests.search.MethodReferenceSearchTests)  Time elapsed: 1.166 s
22-Aug-2019 20:22:56 testMethodReferencesInScript5(org.eclipse.jdt.core.groovy.tests.search.MethodReferenceSearchTests)  Time elapsed: 0.243 s
22-Aug-2019 20:22:56 testMethodReferencesInScript6(org.eclipse.jdt.core.groovy.tests.search.MethodReferenceSearchTests)  Time elapsed: 0.938 s
22-Aug-2019 20:22:56 testMethodReferencesInScript7(org.eclipse.jdt.core.groovy.tests.search.MethodReferenceSearchTests)  Time elapsed: 0.244 s
22-Aug-2019 20:22:56 testMethodReferencesInScript8(org.eclipse.jdt.core.groovy.tests.search.MethodReferenceSearchTests)  Time elapsed: 0.258 s
22-Aug-2019 20:22:56 testMethodReferencesInScript9(org.eclipse.jdt.core.groovy.tests.search.MethodReferenceSearchTests)  Time elapsed: 1.424 s
22-Aug-2019 20:22:56 testMethodWithDefaultParameters1(org.eclipse.jdt.core.groovy.tests.search.MethodReferenceSearchTests)  Time elapsed: 0.249 s
22-Aug-2019 20:22:56 testMethodWithDefaultParameters2(org.eclipse.jdt.core.groovy.tests.search.MethodReferenceSearchTests)  Time elapsed: 0.939 s
22-Aug-2019 20:22:56 testMethodWithDefaultParameters3(org.eclipse.jdt.core.groovy.tests.search.MethodReferenceSearchTests)  Time elapsed: 0.74 s
22-Aug-2019 20:22:56 testMethodWithDefaultParameters4(org.eclipse.jdt.core.groovy.tests.search.MethodReferenceSearchTests) skipped
22-Aug-2019 20:22:56 testExplicitPropertyGetterSearch1(org.eclipse.jdt.core.groovy.tests.search.MethodReferenceSearchTests)  Time elapsed: 0.66 s
22-Aug-2019 20:22:56 testExplicitPropertyGetterSearch2(org.eclipse.jdt.core.groovy.tests.search.MethodReferenceSearchTests)  Time elapsed: 0.676 s
22-Aug-2019 20:22:56 testRightShift(org.eclipse.jdt.core.groovy.tests.search.OperatorOverloadingInferencingTests)  Time elapsed: 1.192 s
22-Aug-2019 20:22:56 testLeftShift(org.eclipse.jdt.core.groovy.tests.search.OperatorOverloadingInferencingTests)  Time elapsed: 0.191 s
22-Aug-2019 20:22:56 testAnd(org.eclipse.jdt.core.groovy.tests.search.OperatorOverloadingInferencingTests)  Time elapsed: 0.203 s
22-Aug-2019 20:22:56 testMod(org.eclipse.jdt.core.groovy.tests.search.OperatorOverloadingInferencingTests)  Time elapsed: 1.038 s
22-Aug-2019 20:22:56 testXor(org.eclipse.jdt.core.groovy.tests.search.OperatorOverloadingInferencingTests)  Time elapsed: 0.201 s
22-Aug-2019 20:22:56 testPlus1(org.eclipse.jdt.core.groovy.tests.search.OperatorOverloadingInferencingTests)  Time elapsed: 0.199 s
22-Aug-2019 20:22:56 testPlus2(org.eclipse.jdt.core.groovy.tests.search.OperatorOverloadingInferencingTests)  Time elapsed: 0.189 s
22-Aug-2019 20:22:56 testPlus3(org.eclipse.jdt.core.groovy.tests.search.OperatorOverloadingInferencingTests)  Time elapsed: 0.903 s
22-Aug-2019 20:22:56 testOr(org.eclipse.jdt.core.groovy.tests.search.OperatorOverloadingInferencingTests)  Time elapsed: 0.205 s
22-Aug-2019 20:22:56 testPrefix1(org.eclipse.jdt.core.groovy.tests.search.OperatorOverloadingInferencingTests)  Time elapsed: 0.176 s
22-Aug-2019 20:22:56 testPrefix2(org.eclipse.jdt.core.groovy.tests.search.OperatorOverloadingInferencingTests)  Time elapsed: 0.177 s
22-Aug-2019 20:22:56 testPrefix3(org.eclipse.jdt.core.groovy.tests.search.OperatorOverloadingInferencingTests)  Time elapsed: 0.951 s
22-Aug-2019 20:22:56 testPrefix4(org.eclipse.jdt.core.groovy.tests.search.OperatorOverloadingInferencingTests)  Time elapsed: 0.184 s
22-Aug-2019 20:22:56 testPrefix5(org.eclipse.jdt.core.groovy.tests.search.OperatorOverloadingInferencingTests)  Time elapsed: 0.208 s
22-Aug-2019 20:22:56 testPrefix6(org.eclipse.jdt.core.groovy.tests.search.OperatorOverloadingInferencingTests)  Time elapsed: 1.141 s
22-Aug-2019 20:22:56 testLongExpr1(org.eclipse.jdt.core.groovy.tests.search.OperatorOverloadingInferencingTests)  Time elapsed: 0.215 s
22-Aug-2019 20:22:56 testLongExpr2(org.eclipse.jdt.core.groovy.tests.search.OperatorOverloadingInferencingTests)  Time elapsed: 0.184 s
22-Aug-2019 20:22:56 testLongExpr3(org.eclipse.jdt.core.groovy.tests.search.OperatorOverloadingInferencingTests)  Time elapsed: 0.19 s
22-Aug-2019 20:22:56 testAttributeExpr1(org.eclipse.jdt.core.groovy.tests.search.OperatorOverloadingInferencingTests)  Time elapsed: 1.195 s
22-Aug-2019 20:22:56 testAttributeExpr2(org.eclipse.jdt.core.groovy.tests.search.OperatorOverloadingInferencingTests)  Time elapsed: 0.211 s
22-Aug-2019 20:22:56 testDivide(org.eclipse.jdt.core.groovy.tests.search.OperatorOverloadingInferencingTests)  Time elapsed: 0.175 s
22-Aug-2019 20:22:56 testMultiply(org.eclipse.jdt.core.groovy.tests.search.OperatorOverloadingInferencingTests)  Time elapsed: 0.188 s
22-Aug-2019 20:22:56 testGetAt1(org.eclipse.jdt.core.groovy.tests.search.OperatorOverloadingInferencingTests)  Time elapsed: 1.24 s
22-Aug-2019 20:22:56 testGetAt2(org.eclipse.jdt.core.groovy.tests.search.OperatorOverloadingInferencingTests)  Time elapsed: 0.224 s
22-Aug-2019 20:22:56 testGetAt3(org.eclipse.jdt.core.groovy.tests.search.OperatorOverloadingInferencingTests)  Time elapsed: 0.211 s
22-Aug-2019 20:22:56 testGetAt4(org.eclipse.jdt.core.groovy.tests.search.OperatorOverloadingInferencingTests)  Time elapsed: 1.165 s
22-Aug-2019 20:22:56 testGetAt5(org.eclipse.jdt.core.groovy.tests.search.OperatorOverloadingInferencingTests)  Time elapsed: 0.204 s
22-Aug-2019 20:22:56 testGetAt6(org.eclipse.jdt.core.groovy.tests.search.OperatorOverloadingInferencingTests)  Time elapsed: 0.2 s
22-Aug-2019 20:22:56 testGetAt7(org.eclipse.jdt.core.groovy.tests.search.OperatorOverloadingInferencingTests)  Time elapsed: 0.2 s
22-Aug-2019 20:22:56 testGetAt8(org.eclipse.jdt.core.groovy.tests.search.OperatorOverloadingInferencingTests)  Time elapsed: 0.975 s
22-Aug-2019 20:22:56 testGetAt9(org.eclipse.jdt.core.groovy.tests.search.OperatorOverloadingInferencingTests)  Time elapsed: 0.221 s
22-Aug-2019 20:22:56 testPostfix1(org.eclipse.jdt.core.groovy.tests.search.OperatorOverloadingInferencingTests)  Time elapsed: 0.178 s
22-Aug-2019 20:22:56 testPostfix2(org.eclipse.jdt.core.groovy.tests.search.OperatorOverloadingInferencingTests)  Time elapsed: 1.143 s
22-Aug-2019 20:22:56 testMinus1(org.eclipse.jdt.core.groovy.tests.search.OperatorOverloadingInferencingTests)  Time elapsed: 0.198 s
22-Aug-2019 20:22:56 testMinus2(org.eclipse.jdt.core.groovy.tests.search.OperatorOverloadingInferencingTests)  Time elapsed: 0.201 s
22-Aug-2019 20:22:56 testNumberPlusString1(org.eclipse.jdt.core.groovy.tests.search.OperatorOverloadingInferencingTests)  Time elapsed: 0.189 s
22-Aug-2019 20:22:56 testNumberPlusString2(org.eclipse.jdt.core.groovy.tests.search.OperatorOverloadingInferencingTests)  Time elapsed: 1.152 s
22-Aug-2019 20:22:56 testCompleteExpr1(org.eclipse.jdt.core.groovy.tests.search.OperatorOverloadingInferencingTests)  Time elapsed: 0.199 s
22-Aug-2019 20:22:56 testCompleteExpr2(org.eclipse.jdt.core.groovy.tests.search.OperatorOverloadingInferencingTests)  Time elapsed: 0.186 s
22-Aug-2019 20:22:56 testCompleteExpr3(org.eclipse.jdt.core.groovy.tests.search.OperatorOverloadingInferencingTests)  Time elapsed: 0.181 s
22-Aug-2019 20:22:56 testCompleteExpr4(org.eclipse.jdt.core.groovy.tests.search.OperatorOverloadingInferencingTests)  Time elapsed: 1.292 s
22-Aug-2019 20:22:56 testCompleteExpr5(org.eclipse.jdt.core.groovy.tests.search.OperatorOverloadingInferencingTests)  Time elapsed: 0.216 s
22-Aug-2019 20:22:56 testCompleteExpr6(org.eclipse.jdt.core.groovy.tests.search.OperatorOverloadingInferencingTests)  Time elapsed: 0.19 s
22-Aug-2019 20:22:56 testCompleteExpr7(org.eclipse.jdt.core.groovy.tests.search.OperatorOverloadingInferencingTests)  Time elapsed: 1.263 s
22-Aug-2019 20:22:56 testCompleteExpr8(org.eclipse.jdt.core.groovy.tests.search.OperatorOverloadingInferencingTests)  Time elapsed: 0.185 s
22-Aug-2019 20:22:56 testEqualsCheck(org.eclipse.jdt.core.groovy.tests.search.SpockInferencingTests) skipped
22-Aug-2019 20:22:56 testDataTableChecks(org.eclipse.jdt.core.groovy.tests.search.SpockInferencingTests) skipped
22-Aug-2019 20:22:56 testGetterCheck(org.eclipse.jdt.core.groovy.tests.search.SpockInferencingTests) skipped
22-Aug-2019 20:22:56 testPropertyCheck(org.eclipse.jdt.core.groovy.tests.search.SpockInferencingTests) skipped
22-Aug-2019 20:22:56 testBasics(org.eclipse.jdt.core.groovy.tests.search.SpockInferencingTests) skipped
22-Aug-2019 20:22:56 testNonStaticReference1(org.eclipse.jdt.core.groovy.tests.search.StaticInferencingTests)  Time elapsed: 1.403 s
22-Aug-2019 20:22:56 testNonStaticReference2(org.eclipse.jdt.core.groovy.tests.search.StaticInferencingTests)  Time elapsed: 0.212 s
22-Aug-2019 20:22:56 testNonStaticReference3(org.eclipse.jdt.core.groovy.tests.search.StaticInferencingTests)  Time elapsed: 0.179 s
22-Aug-2019 20:22:56 testNonStaticReference4(org.eclipse.jdt.core.groovy.tests.search.StaticInferencingTests)  Time elapsed: 0.195 s
22-Aug-2019 20:22:56 testNonStaticReference5(org.eclipse.jdt.core.groovy.tests.search.StaticInferencingTests)  Time elapsed: 1.057 s
22-Aug-2019 20:22:56 testNonStaticReference6(org.eclipse.jdt.core.groovy.tests.search.StaticInferencingTests)  Time elapsed: 0.207 s
22-Aug-2019 20:22:56 testNonStaticReference7(org.eclipse.jdt.core.groovy.tests.search.StaticInferencingTests)  Time elapsed: 0.193 s
22-Aug-2019 20:22:56 testNonStaticReference8(org.eclipse.jdt.core.groovy.tests.search.StaticInferencingTests)  Time elapsed: 1.182 s
22-Aug-2019 20:22:56 testStaticReference1(org.eclipse.jdt.core.groovy.tests.search.StaticInferencingTests)  Time elapsed: 0.198 s
22-Aug-2019 20:22:56 testStaticReference2(org.eclipse.jdt.core.groovy.tests.search.StaticInferencingTests)  Time elapsed: 0.141 s
22-Aug-2019 20:22:56 testStaticReference3(org.eclipse.jdt.core.groovy.tests.search.StaticInferencingTests)  Time elapsed: 0.199 s
22-Aug-2019 20:22:56 testStaticReference4(org.eclipse.jdt.core.groovy.tests.search.StaticInferencingTests)  Time elapsed: 1.349 s
22-Aug-2019 20:22:56 testStaticReference5(org.eclipse.jdt.core.groovy.tests.search.StaticInferencingTests)  Time elapsed: 0.184 s
22-Aug-2019 20:22:56 testStaticReference6(org.eclipse.jdt.core.groovy.tests.search.StaticInferencingTests)  Time elapsed: 0.19 s
22-Aug-2019 20:22:56 testStaticReference7(org.eclipse.jdt.core.groovy.tests.search.StaticInferencingTests)  Time elapsed: 0.197 s
22-Aug-2019 20:22:56 testStaticReference8(org.eclipse.jdt.core.groovy.tests.search.StaticInferencingTests)  Time elapsed: 1.077 s
22-Aug-2019 20:22:56 testStaticReference9(org.eclipse.jdt.core.groovy.tests.search.StaticInferencingTests)  Time elapsed: 0.197 s
22-Aug-2019 20:22:56 testStaticImport1(org.eclipse.jdt.core.groovy.tests.search.StaticInferencingTests)  Time elapsed: 0.188 s
22-Aug-2019 20:22:56 testStaticImport2(org.eclipse.jdt.core.groovy.tests.search.StaticInferencingTests)  Time elapsed: 1.133 s
22-Aug-2019 20:22:56 testStaticImport3(org.eclipse.jdt.core.groovy.tests.search.StaticInferencingTests)  Time elapsed: 0.182 s
22-Aug-2019 20:22:56 testStaticImport4(org.eclipse.jdt.core.groovy.tests.search.StaticInferencingTests)  Time elapsed: 0.198 s
22-Aug-2019 20:22:56 testStaticImport5(org.eclipse.jdt.core.groovy.tests.search.StaticInferencingTests)  Time elapsed: 0.191 s
22-Aug-2019 20:22:56 testStaticImport6(org.eclipse.jdt.core.groovy.tests.search.StaticInferencingTests)  Time elapsed: 1.401 s
22-Aug-2019 20:22:56 testStaticImport7(org.eclipse.jdt.core.groovy.tests.search.StaticInferencingTests)  Time elapsed: 0.207 s
22-Aug-2019 20:22:56 testStaticImport8(org.eclipse.jdt.core.groovy.tests.search.StaticInferencingTests)  Time elapsed: 0.206 s
22-Aug-2019 20:22:56 testStaticImport9(org.eclipse.jdt.core.groovy.tests.search.StaticInferencingTests)  Time elapsed: 1.017 s
22-Aug-2019 20:22:56 testStaticImport10(org.eclipse.jdt.core.groovy.tests.search.StaticInferencingTests)  Time elapsed: 0.235 s
22-Aug-2019 20:22:56 testStaticImport11(org.eclipse.jdt.core.groovy.tests.search.StaticInferencingTests)  Time elapsed: 0.198 s
22-Aug-2019 20:22:56 testStaticImport12(org.eclipse.jdt.core.groovy.tests.search.StaticInferencingTests)  Time elapsed: 0.2 s
22-Aug-2019 20:22:56 testStaticImport13(org.eclipse.jdt.core.groovy.tests.search.StaticInferencingTests) skipped
22-Aug-2019 20:22:56 testStaticImport14(org.eclipse.jdt.core.groovy.tests.search.StaticInferencingTests) skipped
22-Aug-2019 20:22:56 testStaticImport15(org.eclipse.jdt.core.groovy.tests.search.StaticInferencingTests) skipped
22-Aug-2019 20:22:56 testClassReference16a(org.eclipse.jdt.core.groovy.tests.search.StaticInferencingTests)  Time elapsed: 1.221 s
22-Aug-2019 20:22:56 testClassReference17a(org.eclipse.jdt.core.groovy.tests.search.StaticInferencingTests)  Time elapsed: 0.193 s
22-Aug-2019 20:22:56 testStaticReference10a(org.eclipse.jdt.core.groovy.tests.search.StaticInferencingTests)  Time elapsed: 0.186 s
22-Aug-2019 20:22:56 testClassReference10(org.eclipse.jdt.core.groovy.tests.search.StaticInferencingTests)  Time elapsed: 0.187 s
22-Aug-2019 20:22:56 testClassReference11(org.eclipse.jdt.core.groovy.tests.search.StaticInferencingTests)  Time elapsed: 1.162 s
22-Aug-2019 20:22:56 testClassReference12(org.eclipse.jdt.core.groovy.tests.search.StaticInferencingTests)  Time elapsed: 0.214 s
22-Aug-2019 20:22:56 testClassReference13(org.eclipse.jdt.core.groovy.tests.search.StaticInferencingTests)  Time elapsed: 0.194 s
22-Aug-2019 20:22:56 testClassReference14(org.eclipse.jdt.core.groovy.tests.search.StaticInferencingTests)  Time elapsed: 0.867 s
22-Aug-2019 20:22:56 testClassReference15(org.eclipse.jdt.core.groovy.tests.search.StaticInferencingTests)  Time elapsed: 0.191 s
22-Aug-2019 20:22:56 testClassReference16(org.eclipse.jdt.core.groovy.tests.search.StaticInferencingTests)  Time elapsed: 0.162 s
22-Aug-2019 20:22:56 testClassReference17(org.eclipse.jdt.core.groovy.tests.search.StaticInferencingTests)  Time elapsed: 0.183 s
22-Aug-2019 20:22:56 testClassReference4a(org.eclipse.jdt.core.groovy.tests.search.StaticInferencingTests)  Time elapsed: 1.066 s
22-Aug-2019 20:22:56 testStaticReference10(org.eclipse.jdt.core.groovy.tests.search.StaticInferencingTests)  Time elapsed: 0.225 s
22-Aug-2019 20:22:56 testStaticReference1a(org.eclipse.jdt.core.groovy.tests.search.StaticInferencingTests)  Time elapsed: 0.198 s
22-Aug-2019 20:22:56 testStaticReference1b(org.eclipse.jdt.core.groovy.tests.search.StaticInferencingTests)  Time elapsed: 0.204 s
22-Aug-2019 20:22:56 testStaticReference9a(org.eclipse.jdt.core.groovy.tests.search.StaticInferencingTests)  Time elapsed: 1.085 s
22-Aug-2019 20:22:56 testClassReference1(org.eclipse.jdt.core.groovy.tests.search.StaticInferencingTests)  Time elapsed: 0.182 s
22-Aug-2019 20:22:56 testClassReference2(org.eclipse.jdt.core.groovy.tests.search.StaticInferencingTests)  Time elapsed: 0.2 s
22-Aug-2019 20:22:56 testClassReference3(org.eclipse.jdt.core.groovy.tests.search.StaticInferencingTests)  Time elapsed: 0.259 s
22-Aug-2019 20:22:56 testClassReference4(org.eclipse.jdt.core.groovy.tests.search.StaticInferencingTests)  Time elapsed: 0.862 s
22-Aug-2019 20:22:56 testClassReference5(org.eclipse.jdt.core.groovy.tests.search.StaticInferencingTests)  Time elapsed: 0.18 s
22-Aug-2019 20:22:56 testClassReference6(org.eclipse.jdt.core.groovy.tests.search.StaticInferencingTests)  Time elapsed: 0.191 s
22-Aug-2019 20:22:56 testClassReference7(org.eclipse.jdt.core.groovy.tests.search.StaticInferencingTests)  Time elapsed: 0.193 s
22-Aug-2019 20:22:56 testClassReference8(org.eclipse.jdt.core.groovy.tests.search.StaticInferencingTests)  Time elapsed: 0.86 s
22-Aug-2019 20:22:56 testClassReference9(org.eclipse.jdt.core.groovy.tests.search.StaticInferencingTests)  Time elapsed: 0.189 s
22-Aug-2019 20:22:56 testSyntheticAccessors1(org.eclipse.jdt.core.groovy.tests.search.SyntheticAccessorInferencingTests)  Time elapsed: 0.384 s
22-Aug-2019 20:22:56 testSyntheticAccessors2(org.eclipse.jdt.core.groovy.tests.search.SyntheticAccessorInferencingTests)  Time elapsed: 1.494 s
22-Aug-2019 20:22:56 testSyntheticAccessors3(org.eclipse.jdt.core.groovy.tests.search.SyntheticAccessorInferencingTests)  Time elapsed: 0.373 s
22-Aug-2019 20:22:56 testSyntheticAccessors4(org.eclipse.jdt.core.groovy.tests.search.SyntheticAccessorInferencingTests)  Time elapsed: 5.477 s
22-Aug-2019 20:22:56 testPrivateMethod(org.eclipse.jdt.core.groovy.tests.search.TraitInferencingTests)  Time elapsed: 1.34 s
22-Aug-2019 20:22:56 testPrivateStaticField(org.eclipse.jdt.core.groovy.tests.search.TraitInferencingTests)  Time elapsed: 0.321 s
22-Aug-2019 20:22:56 testPrivateMethod2(org.eclipse.jdt.core.groovy.tests.search.TraitInferencingTests)  Time elapsed: 0.309 s
22-Aug-2019 20:22:56 testPrivateMethod3(org.eclipse.jdt.core.groovy.tests.search.TraitInferencingTests)  Time elapsed: 1.387 s
22-Aug-2019 20:22:56 testPrivateMethod4(org.eclipse.jdt.core.groovy.tests.search.TraitInferencingTests)  Time elapsed: 0.32 s
22-Aug-2019 20:22:56 testPrivateStaticMethod(org.eclipse.jdt.core.groovy.tests.search.TraitInferencingTests)  Time elapsed: 0.311 s
22-Aug-2019 20:22:56 testPublicStaticSuperMethod(org.eclipse.jdt.core.groovy.tests.search.TraitInferencingTests)  Time elapsed: 1.128 s
22-Aug-2019 20:22:56 testPrivateStaticFinalField(org.eclipse.jdt.core.groovy.tests.search.TraitInferencingTests)  Time elapsed: 0.321 s
22-Aug-2019 20:22:56 testPrivateField(org.eclipse.jdt.core.groovy.tests.search.TraitInferencingTests)  Time elapsed: 0.282 s
22-Aug-2019 20:22:56 testFindClassDeclarationWithPattern(org.eclipse.jdt.core.groovy.tests.search.TypeReferenceSearchTests)  Time elapsed: 1.442 s
22-Aug-2019 20:22:56 testInnerTypes1(org.eclipse.jdt.core.groovy.tests.search.TypeReferenceSearchTests)  Time elapsed: 1.121 s
22-Aug-2019 20:22:56 testInnerTypes2(org.eclipse.jdt.core.groovy.tests.search.TypeReferenceSearchTests)  Time elapsed: 1.127 s
22-Aug-2019 20:22:56 testInnerTypes3(org.eclipse.jdt.core.groovy.tests.search.TypeReferenceSearchTests)  Time elapsed: 2.206 s
22-Aug-2019 20:22:56 testSearchForTypesScript1(org.eclipse.jdt.core.groovy.tests.search.TypeReferenceSearchTests)  Time elapsed: 0.175 s
22-Aug-2019 20:22:56 testSearchForTypesScript2(org.eclipse.jdt.core.groovy.tests.search.TypeReferenceSearchTests)  Time elapsed: 0.196 s
22-Aug-2019 20:22:56 testSearchForTypesScript3(org.eclipse.jdt.core.groovy.tests.search.TypeReferenceSearchTests)  Time elapsed: 0.222 s
22-Aug-2019 20:22:56 testSearchForTypesScript4(org.eclipse.jdt.core.groovy.tests.search.TypeReferenceSearchTests)  Time elapsed: 1.025 s
22-Aug-2019 20:22:56 testSearchForTypesScript5(org.eclipse.jdt.core.groovy.tests.search.TypeReferenceSearchTests)  Time elapsed: 0.172 s
22-Aug-2019 20:22:56 testSearchForTypesScript6(org.eclipse.jdt.core.groovy.tests.search.TypeReferenceSearchTests)  Time elapsed: 0.202 s
22-Aug-2019 20:22:56 testShouldntFindClassDeclarationInScript(org.eclipse.jdt.core.groovy.tests.search.TypeReferenceSearchTests)  Time elapsed: 0.202 s
22-Aug-2019 20:22:56 testSearchForTypesArray1(org.eclipse.jdt.core.groovy.tests.search.TypeReferenceSearchTests)  Time elapsed: 0.94 s
22-Aug-2019 20:22:56 testSearchForTypesClass1(org.eclipse.jdt.core.groovy.tests.search.TypeReferenceSearchTests)  Time elapsed: 0.1 s
22-Aug-2019 20:22:56 testSearchForTypesClass2(org.eclipse.jdt.core.groovy.tests.search.TypeReferenceSearchTests)  Time elapsed: 0.104 s
22-Aug-2019 20:22:56 testSearchForTypesClass3(org.eclipse.jdt.core.groovy.tests.search.TypeReferenceSearchTests)  Time elapsed: 0.243 s
22-Aug-2019 20:22:56 testSearchForTypesClass4(org.eclipse.jdt.core.groovy.tests.search.TypeReferenceSearchTests)  Time elapsed: 0.133 s
22-Aug-2019 20:22:56 testSearchForTypesClass5(org.eclipse.jdt.core.groovy.tests.search.TypeReferenceSearchTests)  Time elapsed: 0.913 s
22-Aug-2019 20:22:56 testSearchForTypesClass6(org.eclipse.jdt.core.groovy.tests.search.TypeReferenceSearchTests)  Time elapsed: 0.12 s
22-Aug-2019 20:22:56 testSearchForTypesClass7(org.eclipse.jdt.core.groovy.tests.search.TypeReferenceSearchTests)  Time elapsed: 0.192 s
22-Aug-2019 20:22:56 testSearchForTypesClosure1(org.eclipse.jdt.core.groovy.tests.search.TypeReferenceSearchTests)  Time elapsed: 0.212 s
22-Aug-2019 20:22:56 testSearchForTypesClosure2(org.eclipse.jdt.core.groovy.tests.search.TypeReferenceSearchTests)  Time elapsed: 0.974 s
22-Aug-2019 20:22:56 testSearchForTypesClosure3(org.eclipse.jdt.core.groovy.tests.search.TypeReferenceSearchTests)  Time elapsed: 0.218 s
22-Aug-2019 20:22:56 testCoercion1(org.eclipse.jdt.core.groovy.tests.search.TypeReferenceSearchTests)  Time elapsed: 0.108 s
22-Aug-2019 20:22:56 testGenerics1(org.eclipse.jdt.core.groovy.tests.search.TypeReferenceSearchTests)  Time elapsed: 0.087 s
22-Aug-2019 20:22:56 testFindClassDeclaration(org.eclipse.jdt.core.groovy.tests.search.TypeReferenceSearchTests)  Time elapsed: 0.084 s
22-Aug-2019 20:22:56 testConstructorWithDefaultArgsInCompileStatic(org.eclipse.jdt.core.groovy.tests.search.TypeReferenceSearchTests)  Time elapsed: 1.348 s
22-Aug-2019 20:22:56
22-Aug-2019 20:22:56 Results:
22-Aug-2019 20:22:56
22-Aug-2019 20:22:56 Failures:
22-Aug-2019 20:22:56   GroovyContentTypeTests.testJavaOnlyProject:70->checkJavaProject:152 L/Project/bin/p1/HelloJava.class should exist
22-Aug-2019 20:22:56   ArrayInferencingTests.testArray6:62->assertExprType:24->InferencingTestSuite.assertType:53->InferencingTestSuite.assertType:85->InferencingTestSuite.assertType:90->InferencingTestSuite.assertType:109 Expected type not found.
22-Aug-2019 20:22:56 Expected: java.lang.CharSequence
22-Aug-2019 20:22:56 Found: java.lang.CharSequence[]
22-Aug-2019 20:22:56 Declaring type: null
22-Aug-2019 20:22:56 ASTNode: org.codehaus.groovy.ast.expr.BinaryExpression@f47e7[org.codehaus.groovy.ast.expr.VariableExpression@f47e4[variable: x]("[" at 1:51:  "[" )org.codehaus.groovy.ast.expr.VariableExpression@f4f68[variable: i type: java.lang.Integer]]
22-Aug-2019 20:22:56 Confidence: EXACT
22-Aug-2019 20:22:56
22-Aug-2019 20:22:56   BinarySearchTests.testMethodRefInInitializer:213->assertMatches:135 Expecting 2 matches, but found 0
22-Aug-2019 20:22:56
22-Aug-2019 20:22:56   ConstructorReferenceSearchTests.testConstructorReferences11:276 expected:<2> but was:<0>
22-Aug-2019 20:22:56   ConstructorReferenceSearchTests.testConstructorReferences12:313 expected:<2> but was:<0>
22-Aug-2019 20:22:56   ConstructorReferenceSearchTests.testConstructorReferences13:349 expected:<1> but was:<0>
22-Aug-2019 20:22:56   DGMInferencingTests.testDGM23:209->assertExprType:33->InferencingTestSuite.assertType:53->InferencingTestSuite.assertType:85->InferencingTestSuite.assertType:90->InferencingTestSuite.assertType:109 Expected type not found.
22-Aug-2019 20:22:56 Expected: java.lang.String
22-Aug-2019 20:22:56 Found: java.lang.Object
22-Aug-2019 20:22:56 Declaring type: Search
22-Aug-2019 20:22:56 ASTNode: org.codehaus.groovy.ast.expr.VariableExpression@f2252[variable: key]
22-Aug-2019 20:22:56 Confidence: INFERRED
22-Aug-2019 20:22:56
22-Aug-2019 20:22:56   DGMInferencingTests.testDGMClosure18:566->assertExprType:33->InferencingTestSuite.assertType:53->InferencingTestSuite.assertType:85->InferencingTestSuite.assertType:90->InferencingTestSuite.assertType:109 Expected type not found.
22-Aug-2019 20:22:56 Expected: java.util.Date
22-Aug-2019 20:22:56 Found: java.lang.Object
22-Aug-2019 20:22:56 Declaring type: Search
22-Aug-2019 20:22:56 ASTNode: org.codehaus.groovy.ast.expr.VariableExpression@f1ace[variable: val]
22-Aug-2019 20:22:56 Confidence: INFERRED
22-Aug-2019 20:22:56
22-Aug-2019 20:22:56   MethodReferenceSearchTests.testExplicitPropertySetterSearch1:549 expected:<5> but was:<0>
22-Aug-2019 20:22:56 Errors:
22-Aug-2019 20:22:56   ClosureInferencingTests.testClosure27:519->InferencingTestSuite.assertType:53->InferencingTestSuite.assertType:85->InferencingTestSuite.assertType:90->InferencingTestSuite.assertType:98->InferencingTestSuite.doVisit:195 » NoClassDefFound
22-Aug-2019 20:22:56
22-Aug-2019 20:22:56 Tests run: 5966, Failures: 9, Errors: 1, Skipped: 117
22-Aug-2019 20:22:56
22-Aug-2019 20:22:58
22-Aug-2019 20:22:58 !ENTRY org.eclipse.core.resources 2 10035 2019-08-22 20:22:58.961
22-Aug-2019 20:22:58 !MESSAGE The workspace will exit with unsaved changes in this session.
22-Aug-2019 20:22:59 [ERROR] There are test failures.
22-Aug-2019 20:22:59
22-Aug-2019 20:22:59 Please refer to /opt/bamboo-home/xml-data/build-dir/GRECLIPSE-E410-JOB1/ide-test/org.codehaus.groovy.alltests/target/surefire-reports for the individual test results.
22-Aug-2019 20:22:59 [INFO]
22-Aug-2019 20:22:59 [INFO] --- maven-install-plugin:2.3.1:install (default-install) @ org.codehaus.groovy.alltests ---
22-Aug-2019 20:22:59 [INFO] Installing /opt/bamboo-home/xml-data/build-dir/GRECLIPSE-E410-JOB1/ide-test/org.codehaus.groovy.alltests/target/org.codehaus.groovy.alltests-3.5.0-SNAPSHOT.jar to /home/bamboo/.m2/repository/org/codehaus/groovy/eclipse/org.codehaus.groovy.alltests/3.5.0-SNAPSHOT/org.codehaus.groovy.alltests-3.5.0-SNAPSHOT.jar
22-Aug-2019 20:22:59 [INFO] Installing /opt/bamboo-home/xml-data/build-dir/GRECLIPSE-E410-JOB1/ide-test/org.codehaus.groovy.alltests/pom.xml to /home/bamboo/.m2/repository/org/codehaus/groovy/eclipse/org.codehaus.groovy.alltests/3.5.0-SNAPSHOT/org.codehaus.groovy.alltests-3.5.0-SNAPSHOT.pom
22-Aug-2019 20:22:59 [INFO] Installing /opt/bamboo-home/xml-data/build-dir/GRECLIPSE-E410-JOB1/ide-test/org.codehaus.groovy.alltests/target/org.codehaus.groovy.alltests-3.5.0-SNAPSHOT-sources.jar to /home/bamboo/.m2/repository/org/codehaus/groovy/eclipse/org.codehaus.groovy.alltests/3.5.0-SNAPSHOT/org.codehaus.groovy.alltests-3.5.0-SNAPSHOT-sources.jar
22-Aug-2019 20:22:59 [INFO] Installing /opt/bamboo-home/xml-data/build-dir/GRECLIPSE-E410-JOB1/ide-test/org.codehaus.groovy.alltests/target/p2content.xml to /home/bamboo/.m2/repository/org/codehaus/groovy/eclipse/org.codehaus.groovy.alltests/3.5.0-SNAPSHOT/org.codehaus.groovy.alltests-3.5.0-SNAPSHOT-p2metadata.xml
22-Aug-2019 20:22:59 [INFO] Installing /opt/bamboo-home/xml-data/build-dir/GRECLIPSE-E410-JOB1/ide-test/org.codehaus.groovy.alltests/target/p2artifacts.xml to /home/bamboo/.m2/repository/org/codehaus/groovy/eclipse/org.codehaus.groovy.alltests/3.5.0-SNAPSHOT/org.codehaus.groovy.alltests-3.5.0-SNAPSHOT-p2artifacts.xml
22-Aug-2019 20:22:59 [INFO] Installing /opt/bamboo-home/xml-data/build-dir/GRECLIPSE-E410-JOB1/ide-test/org.codehaus.groovy.alltests/target/p2content.xml to /home/bamboo/.m2/repository/org/codehaus/groovy/eclipse/org.codehaus.groovy.alltests/3.5.0-SNAPSHOT/org.codehaus.groovy.alltests-3.5.0-SNAPSHOT-p2metadata.xml
22-Aug-2019 20:22:59 [INFO] Installing /opt/bamboo-home/xml-data/build-dir/GRECLIPSE-E410-JOB1/ide-test/org.codehaus.groovy.alltests/target/p2artifacts.xml to /home/bamboo/.m2/repository/org/codehaus/groovy/eclipse/org.codehaus.groovy.alltests/3.5.0-SNAPSHOT/org.codehaus.groovy.alltests-3.5.0-SNAPSHOT-p2artifacts.xml
22-Aug-2019 20:22:59 [INFO]
22-Aug-2019 20:22:59 [INFO] --- tycho-p2-plugin:1.4.0:update-local-index (default-update-local-index) @ org.codehaus.groovy.alltests ---
22-Aug-2019 20:22:59 [INFO]
22-Aug-2019 20:22:59 [INFO] --- maven-deploy-plugin:2.8.2:deploy (default-deploy) @ org.codehaus.groovy.alltests ---
22-Aug-2019 20:22:59 [INFO] Skipping artifact deployment
22-Aug-2019 20:22:59 [INFO]                                                                         
22-Aug-2019 20:22:59 [INFO] ------------------------------------------------------------------------
22-Aug-2019 20:22:59 [INFO] Building org.codehaus.groovy.m2eclipse 3.5.0-SNAPSHOT
22-Aug-2019 20:22:59 [INFO] ------------------------------------------------------------------------
22-Aug-2019 20:22:59 [INFO]
22-Aug-2019 20:22:59 [INFO] --- maven-clean-plugin:2.5:clean (default-clean) @ org.codehaus.groovy.m2eclipse ---
22-Aug-2019 20:22:59 [INFO]
22-Aug-2019 20:22:59 [INFO] --- tycho-packaging-plugin:1.4.0:build-qualifier (default-build-qualifier) @ org.codehaus.groovy.m2eclipse ---
22-Aug-2019 20:22:59 [INFO] The project's OSGi version is 3.5.0.v201908221837-e1812
22-Aug-2019 20:22:59 [INFO]
22-Aug-2019 20:22:59 [INFO] --- tycho-packaging-plugin:1.4.0:validate-id (default-validate-id) @ org.codehaus.groovy.m2eclipse ---
22-Aug-2019 20:22:59 [INFO]
22-Aug-2019 20:22:59 [INFO] --- tycho-packaging-plugin:1.4.0:validate-version (default-validate-version) @ org.codehaus.groovy.m2eclipse ---
22-Aug-2019 20:22:59 [INFO]
22-Aug-2019 20:22:59 [INFO] --- properties-maven-plugin:1.0.0:read-project-properties (default) @ org.codehaus.groovy.m2eclipse ---
22-Aug-2019 20:22:59 [INFO]
22-Aug-2019 20:22:59 [INFO] --- maven-resources-plugin:2.4.3:resources (default-resources) @ org.codehaus.groovy.m2eclipse ---
22-Aug-2019 20:22:59 [INFO] Using 'UTF-8' encoding to copy filtered resources.
22-Aug-2019 20:22:59 [INFO] skip non existing resourceDirectory /opt/bamboo-home/xml-data/build-dir/GRECLIPSE-E410-JOB1/extras/org.codehaus.groovy.m2eclipse/src/main/resources
22-Aug-2019 20:22:59 [INFO]
22-Aug-2019 20:22:59 [INFO] --- tycho-compiler-plugin:1.4.0:compile (default-compile) @ org.codehaus.groovy.m2eclipse ---
22-Aug-2019 20:22:59 [INFO] Compiling 2 source files to /opt/bamboo-home/xml-data/build-dir/GRECLIPSE-E410-JOB1/extras/org.codehaus.groovy.m2eclipse/target/classes
22-Aug-2019 20:22:59 [INFO]
22-Aug-2019 20:22:59 [INFO] --- maven-resources-plugin:2.4.3:testResources (default-testResources) @ org.codehaus.groovy.m2eclipse ---
22-Aug-2019 20:22:59 [INFO] Using 'UTF-8' encoding to copy filtered resources.
22-Aug-2019 20:22:59 [INFO] skip non existing resourceDirectory /opt/bamboo-home/xml-data/build-dir/GRECLIPSE-E410-JOB1/extras/org.codehaus.groovy.m2eclipse/src/test/resources
22-Aug-2019 20:22:59 [INFO]
22-Aug-2019 20:22:59 [INFO] --- tycho-source-plugin:1.4.0:plugin-source (plugin-source) @ org.codehaus.groovy.m2eclipse ---
22-Aug-2019 20:22:59 [INFO] Building jar: /opt/bamboo-home/xml-data/build-dir/GRECLIPSE-E410-JOB1/extras/org.codehaus.groovy.m2eclipse/target/org.codehaus.groovy.m2eclipse-3.5.0-SNAPSHOT-sources.jar
22-Aug-2019 20:22:59 [INFO]
22-Aug-2019 20:22:59 [INFO] --- target-platform-configuration:1.4.0:target-platform (default-target-platform) @ org.codehaus.groovy.m2eclipse ---
22-Aug-2019 20:22:59 [INFO]
22-Aug-2019 20:22:59 [INFO] --- tycho-packaging-plugin:1.4.0:package-plugin (default-package-plugin) @ org.codehaus.groovy.m2eclipse ---
22-Aug-2019 20:22:59 [INFO] Building jar: /opt/bamboo-home/xml-data/build-dir/GRECLIPSE-E410-JOB1/extras/org.codehaus.groovy.m2eclipse/target/org.codehaus.groovy.m2eclipse-3.5.0-SNAPSHOT.jar
22-Aug-2019 20:22:59 [INFO]
22-Aug-2019 20:22:59 [INFO] --- tycho-p2-plugin:1.4.0:p2-metadata-default (default-p2-metadata-default) @ org.codehaus.groovy.m2eclipse ---
22-Aug-2019 20:22:59 [INFO]
22-Aug-2019 20:22:59 [INFO] --- maven-jarsigner-plugin:1.4:sign (sign) @ org.codehaus.groovy.m2eclipse ---
22-Aug-2019 20:23:00 [INFO] 2 archive(s) processed
22-Aug-2019 20:23:00 [INFO]
22-Aug-2019 20:23:00 [INFO] --- tycho-source-feature-plugin:1.4.0:source-feature (source-feature) @ org.codehaus.groovy.m2eclipse ---
22-Aug-2019 20:23:00 [INFO]
22-Aug-2019 20:23:00 [INFO] --- tycho-p2-plugin:1.4.0:p2-metadata (attach-p2-metadata) @ org.codehaus.groovy.m2eclipse ---
22-Aug-2019 20:23:00 [INFO]
22-Aug-2019 20:23:00 [INFO] --- maven-install-plugin:2.3.1:install (default-install) @ org.codehaus.groovy.m2eclipse ---
22-Aug-2019 20:23:00 [INFO] Installing /opt/bamboo-home/xml-data/build-dir/GRECLIPSE-E410-JOB1/extras/org.codehaus.groovy.m2eclipse/target/org.codehaus.groovy.m2eclipse-3.5.0-SNAPSHOT.jar to /home/bamboo/.m2/repository/org/codehaus/groovy/eclipse/org.codehaus.groovy.m2eclipse/3.5.0-SNAPSHOT/org.codehaus.groovy.m2eclipse-3.5.0-SNAPSHOT.jar
22-Aug-2019 20:23:00 [INFO] Installing /opt/bamboo-home/xml-data/build-dir/GRECLIPSE-E410-JOB1/extras/org.codehaus.groovy.m2eclipse/pom.xml to /home/bamboo/.m2/repository/org/codehaus/groovy/eclipse/org.codehaus.groovy.m2eclipse/3.5.0-SNAPSHOT/org.codehaus.groovy.m2eclipse-3.5.0-SNAPSHOT.pom
22-Aug-2019 20:23:00 [INFO] Installing /opt/bamboo-home/xml-data/build-dir/GRECLIPSE-E410-JOB1/extras/org.codehaus.groovy.m2eclipse/target/org.codehaus.groovy.m2eclipse-3.5.0-SNAPSHOT-sources.jar to /home/bamboo/.m2/repository/org/codehaus/groovy/eclipse/org.codehaus.groovy.m2eclipse/3.5.0-SNAPSHOT/org.codehaus.groovy.m2eclipse-3.5.0-SNAPSHOT-sources.jar
22-Aug-2019 20:23:00 [INFO] Installing /opt/bamboo-home/xml-data/build-dir/GRECLIPSE-E410-JOB1/extras/org.codehaus.groovy.m2eclipse/target/p2content.xml to /home/bamboo/.m2/repository/org/codehaus/groovy/eclipse/org.codehaus.groovy.m2eclipse/3.5.0-SNAPSHOT/org.codehaus.groovy.m2eclipse-3.5.0-SNAPSHOT-p2metadata.xml
22-Aug-2019 20:23:00 [INFO] Installing /opt/bamboo-home/xml-data/build-dir/GRECLIPSE-E410-JOB1/extras/org.codehaus.groovy.m2eclipse/target/p2artifacts.xml to /home/bamboo/.m2/repository/org/codehaus/groovy/eclipse/org.codehaus.groovy.m2eclipse/3.5.0-SNAPSHOT/org.codehaus.groovy.m2eclipse-3.5.0-SNAPSHOT-p2artifacts.xml
22-Aug-2019 20:23:00 [INFO] Installing /opt/bamboo-home/xml-data/build-dir/GRECLIPSE-E410-JOB1/extras/org.codehaus.groovy.m2eclipse/target/p2content.xml to /home/bamboo/.m2/repository/org/codehaus/groovy/eclipse/org.codehaus.groovy.m2eclipse/3.5.0-SNAPSHOT/org.codehaus.groovy.m2eclipse-3.5.0-SNAPSHOT-p2metadata.xml
22-Aug-2019 20:23:00 [INFO] Installing /opt/bamboo-home/xml-data/build-dir/GRECLIPSE-E410-JOB1/extras/org.codehaus.groovy.m2eclipse/target/p2artifacts.xml to /home/bamboo/.m2/repository/org/codehaus/groovy/eclipse/org.codehaus.groovy.m2eclipse/3.5.0-SNAPSHOT/org.codehaus.groovy.m2eclipse-3.5.0-SNAPSHOT-p2artifacts.xml
22-Aug-2019 20:23:00 [INFO]
22-Aug-2019 20:23:00 [INFO] --- tycho-p2-plugin:1.4.0:update-local-index (default-update-local-index) @ org.codehaus.groovy.m2eclipse ---
22-Aug-2019 20:23:00 [INFO]
22-Aug-2019 20:23:00 [INFO] --- maven-deploy-plugin:2.8.2:deploy (default-deploy) @ org.codehaus.groovy.m2eclipse ---
22-Aug-2019 20:23:00 [INFO] Skipping artifact deployment
22-Aug-2019 20:23:00 [INFO]                                                                         
22-Aug-2019 20:23:00 [INFO] ------------------------------------------------------------------------
22-Aug-2019 20:23:00 [INFO] Building org.codehaus.groovy.m2eclipse.feature 3.5.0-SNAPSHOT
22-Aug-2019 20:23:00 [INFO] ------------------------------------------------------------------------
22-Aug-2019 20:23:00 [INFO]
22-Aug-2019 20:23:00 [INFO] --- maven-clean-plugin:2.5:clean (default-clean) @ org.codehaus.groovy.m2eclipse.feature ---
22-Aug-2019 20:23:00 [INFO] Deleting /opt/bamboo-home/xml-data/build-dir/GRECLIPSE-E410-JOB1/extras/Feature-org.codehaus.groovy.m2eclipse/target
22-Aug-2019 20:23:00 [INFO]
22-Aug-2019 20:23:00 [INFO] --- tycho-packaging-plugin:1.4.0:build-qualifier-aggregator (default-build-qualifier-aggregator) @ org.codehaus.groovy.m2eclipse.feature ---
22-Aug-2019 20:23:00 [INFO] The project's OSGi version is 3.5.0.v201908221837-e1812
22-Aug-2019 20:23:00 [INFO]
22-Aug-2019 20:23:00 [INFO] --- tycho-packaging-plugin:1.4.0:validate-id (default-validate-id) @ org.codehaus.groovy.m2eclipse.feature ---
22-Aug-2019 20:23:00 [INFO]
22-Aug-2019 20:23:00 [INFO] --- tycho-packaging-plugin:1.4.0:validate-version (default-validate-version) @ org.codehaus.groovy.m2eclipse.feature ---
22-Aug-2019 20:23:00 [INFO]
22-Aug-2019 20:23:00 [INFO] --- properties-maven-plugin:1.0.0:read-project-properties (default) @ org.codehaus.groovy.m2eclipse.feature ---
22-Aug-2019 20:23:00 [INFO]
22-Aug-2019 20:23:00 [INFO] --- tycho-source-plugin:1.4.0:plugin-source (plugin-source) @ org.codehaus.groovy.m2eclipse.feature ---
22-Aug-2019 20:23:00 [INFO]
22-Aug-2019 20:23:00 [INFO] --- target-platform-configuration:1.4.0:target-platform (default-target-platform) @ org.codehaus.groovy.m2eclipse.feature ---
22-Aug-2019 20:23:00 [INFO]
22-Aug-2019 20:23:00 [INFO] --- tycho-packaging-plugin:1.4.0:package-feature (default-package-feature) @ org.codehaus.groovy.m2eclipse.feature ---
22-Aug-2019 20:23:00 [INFO] Building jar: /opt/bamboo-home/xml-data/build-dir/GRECLIPSE-E410-JOB1/extras/Feature-org.codehaus.groovy.m2eclipse/target/org.codehaus.groovy.m2eclipse.feature-3.5.0-SNAPSHOT.jar
22-Aug-2019 20:23:00 [INFO]
22-Aug-2019 20:23:00 [INFO] --- tycho-p2-plugin:1.4.0:p2-metadata-default (default-p2-metadata-default) @ org.codehaus.groovy.m2eclipse.feature ---
22-Aug-2019 20:23:00 [INFO]
22-Aug-2019 20:23:00 [INFO] --- tycho-p2-plugin:1.4.0:feature-p2-metadata (default-feature-p2-metadata) @ org.codehaus.groovy.m2eclipse.feature ---
22-Aug-2019 20:23:00 [INFO]
22-Aug-2019 20:23:00 [INFO] --- maven-jarsigner-plugin:1.4:sign (sign) @ org.codehaus.groovy.m2eclipse.feature ---
22-Aug-2019 20:23:00 [INFO] 1 archive(s) processed
22-Aug-2019 20:23:00 [INFO]
22-Aug-2019 20:23:00 [INFO] --- tycho-source-feature-plugin:1.4.0:source-feature (source-feature) @ org.codehaus.groovy.m2eclipse.feature ---
22-Aug-2019 20:23:00 [INFO] Building jar: /opt/bamboo-home/xml-data/build-dir/GRECLIPSE-E410-JOB1/extras/Feature-org.codehaus.groovy.m2eclipse/target/org.codehaus.groovy.m2eclipse.feature-3.5.0-SNAPSHOT-sources-feature.jar
22-Aug-2019 20:23:00 [INFO]
22-Aug-2019 20:23:00 [INFO] --- tycho-p2-plugin:1.4.0:p2-metadata (attach-p2-metadata) @ org.codehaus.groovy.m2eclipse.feature ---
22-Aug-2019 20:23:00 [INFO]
22-Aug-2019 20:23:00 [INFO] --- maven-install-plugin:2.3.1:install (default-install) @ org.codehaus.groovy.m2eclipse.feature ---
22-Aug-2019 20:23:00 [INFO] Installing /opt/bamboo-home/xml-data/build-dir/GRECLIPSE-E410-JOB1/extras/Feature-org.codehaus.groovy.m2eclipse/target/org.codehaus.groovy.m2eclipse.feature-3.5.0-SNAPSHOT.jar to /home/bamboo/.m2/repository/org/codehaus/groovy/eclipse/org.codehaus.groovy.m2eclipse.feature/3.5.0-SNAPSHOT/org.codehaus.groovy.m2eclipse.feature-3.5.0-SNAPSHOT.jar
22-Aug-2019 20:23:00 [INFO] Installing /opt/bamboo-home/xml-data/build-dir/GRECLIPSE-E410-JOB1/extras/Feature-org.codehaus.groovy.m2eclipse/pom.xml to /home/bamboo/.m2/repository/org/codehaus/groovy/eclipse/org.codehaus.groovy.m2eclipse.feature/3.5.0-SNAPSHOT/org.codehaus.groovy.m2eclipse.feature-3.5.0-SNAPSHOT.pom
22-Aug-2019 20:23:00 [INFO] Installing /opt/bamboo-home/xml-data/build-dir/GRECLIPSE-E410-JOB1/extras/Feature-org.codehaus.groovy.m2eclipse/target/p2content.xml to /home/bamboo/.m2/repository/org/codehaus/groovy/eclipse/org.codehaus.groovy.m2eclipse.feature/3.5.0-SNAPSHOT/org.codehaus.groovy.m2eclipse.feature-3.5.0-SNAPSHOT-p2metadata.xml
22-Aug-2019 20:23:00 [INFO] Installing /opt/bamboo-home/xml-data/build-dir/GRECLIPSE-E410-JOB1/extras/Feature-org.codehaus.groovy.m2eclipse/target/p2artifacts.xml to /home/bamboo/.m2/repository/org/codehaus/groovy/eclipse/org.codehaus.groovy.m2eclipse.feature/3.5.0-SNAPSHOT/org.codehaus.groovy.m2eclipse.feature-3.5.0-SNAPSHOT-p2artifacts.xml
22-Aug-2019 20:23:00 [INFO] Installing /opt/bamboo-home/xml-data/build-dir/GRECLIPSE-E410-JOB1/extras/Feature-org.codehaus.groovy.m2eclipse/target/org.codehaus.groovy.m2eclipse.feature-3.5.0-SNAPSHOT-sources-feature.jar to /home/bamboo/.m2/repository/org/codehaus/groovy/eclipse/org.codehaus.groovy.m2eclipse.feature/3.5.0-SNAPSHOT/org.codehaus.groovy.m2eclipse.feature-3.5.0-SNAPSHOT-sources-feature.jar
22-Aug-2019 20:23:00 [INFO] Installing /opt/bamboo-home/xml-data/build-dir/GRECLIPSE-E410-JOB1/extras/Feature-org.codehaus.groovy.m2eclipse/target/p2content.xml to /home/bamboo/.m2/repository/org/codehaus/groovy/eclipse/org.codehaus.groovy.m2eclipse.feature/3.5.0-SNAPSHOT/org.codehaus.groovy.m2eclipse.feature-3.5.0-SNAPSHOT-p2metadata.xml
22-Aug-2019 20:23:00 [INFO] Installing /opt/bamboo-home/xml-data/build-dir/GRECLIPSE-E410-JOB1/extras/Feature-org.codehaus.groovy.m2eclipse/target/p2artifacts.xml to /home/bamboo/.m2/repository/org/codehaus/groovy/eclipse/org.codehaus.groovy.m2eclipse.feature/3.5.0-SNAPSHOT/org.codehaus.groovy.m2eclipse.feature-3.5.0-SNAPSHOT-p2artifacts.xml
22-Aug-2019 20:23:00 [INFO]
22-Aug-2019 20:23:00 [INFO] --- tycho-p2-plugin:1.4.0:update-local-index (default-update-local-index) @ org.codehaus.groovy.m2eclipse.feature ---
22-Aug-2019 20:23:00 [INFO]
22-Aug-2019 20:23:00 [INFO] --- maven-deploy-plugin:2.8.2:deploy (default-deploy) @ org.codehaus.groovy.m2eclipse.feature ---
22-Aug-2019 20:23:00 [INFO] Skipping artifact deployment
22-Aug-2019 20:23:00 [INFO]                                                                         
22-Aug-2019 20:23:00 [INFO] ------------------------------------------------------------------------
22-Aug-2019 20:23:00 [INFO] Building org.codehaus.groovy.eclipse.site 3.5.0-SNAPSHOT
22-Aug-2019 20:23:00 [INFO] ------------------------------------------------------------------------
22-Aug-2019 20:23:00 [INFO]
22-Aug-2019 20:23:00 [INFO] --- maven-clean-plugin:2.5:clean (default-clean) @ org.codehaus.groovy.eclipse.site ---
22-Aug-2019 20:23:00 [INFO]
22-Aug-2019 20:23:00 [INFO] --- tycho-packaging-plugin:1.4.0:build-qualifier (default-build-qualifier) @ org.codehaus.groovy.eclipse.site ---
22-Aug-2019 20:23:00 [INFO] The project's OSGi version is 3.5.0.v201908221837-e1812
22-Aug-2019 20:23:00 [INFO]
22-Aug-2019 20:23:00 [INFO] --- properties-maven-plugin:1.0.0:read-project-properties (default) @ org.codehaus.groovy.eclipse.site ---
22-Aug-2019 20:23:00 [INFO]
22-Aug-2019 20:23:00 [INFO] --- tycho-source-plugin:1.4.0:plugin-source (plugin-source) @ org.codehaus.groovy.eclipse.site ---
22-Aug-2019 20:23:00 [INFO]
22-Aug-2019 20:23:00 [INFO] --- tycho-packaging-plugin:1.4.0:update-site (default-update-site) @ org.codehaus.groovy.eclipse.site ---
22-Aug-2019 20:23:00 [INFO]
22-Aug-2019 20:23:00 [INFO] --- tycho-p2-plugin:1.4.0:update-site-p2-metadata (default-update-site-p2-metadata) @ org.codehaus.groovy.eclipse.site ---
22-Aug-2019 20:23:00 [INFO] Command line:
22-Aug-2019 20:23:00         [/opt/jdk8u212-b03/jre/bin/java, -jar, /opt/users/bamboo/.m2/repository/org/eclipse/tycho/tycho-bundles-external/1.4.0/eclipse/plugins/org.eclipse.equinox.launcher_1.5.300.v20190213-1655.jar, -configuration, /tmp/GRECLIPSE-E410-JOB1/tycho-p2-runtime6074097898231740006.tmp/configuration, -nosplash, -application, org.eclipse.equinox.p2.publisher.UpdateSitePublisher, -source, /opt/bamboo-home/xml-data/build-dir/GRECLIPSE-E410-JOB1/Site-org.codehaus.groovy.eclipse/target/site, -metadataRepository, file:/opt/bamboo-home/xml-data/build-dir/GRECLIPSE-E410-JOB1/Site-org.codehaus.groovy.eclipse/target/site/, -metadataRepositoryName, org.codehaus.groovy.eclipse.site, -artifactRepository, file:/opt/bamboo-home/xml-data/build-dir/GRECLIPSE-E410-JOB1/Site-org.codehaus.groovy.eclipse/target/site/, -artifactRepositoryName, org.codehaus.groovy.eclipse.site Artifacts, -noDefaultIUs, -compress]
22-Aug-2019 20:23:01 Generating metadata for ..
22-Aug-2019 20:23:02 Generation completed with success [1 seconds].
22-Aug-2019 20:23:03 [INFO]
22-Aug-2019 20:23:03 [INFO] --- tycho-packaging-plugin:1.4.0:update-site-packaging (default-update-site-packaging) @ org.codehaus.groovy.eclipse.site ---
22-Aug-2019 20:23:03 [INFO] Building zip: /opt/bamboo-home/xml-data/build-dir/GRECLIPSE-E410-JOB1/Site-org.codehaus.groovy.eclipse/target/site.zip
22-Aug-2019 20:23:03 [INFO]
22-Aug-2019 20:23:03 [INFO] --- maven-jarsigner-plugin:1.4:sign (sign) @ org.codehaus.groovy.eclipse.site ---
22-Aug-2019 20:23:04 [INFO] 1 archive(s) processed
22-Aug-2019 20:23:04 [INFO]
22-Aug-2019 20:23:04 [INFO] --- tycho-source-feature-plugin:1.4.0:source-feature (source-feature) @ org.codehaus.groovy.eclipse.site ---
22-Aug-2019 20:23:04 [INFO]
22-Aug-2019 20:23:04 [INFO] --- tycho-p2-plugin:1.4.0:p2-metadata (attach-p2-metadata) @ org.codehaus.groovy.eclipse.site ---
22-Aug-2019 20:23:04 [INFO]
22-Aug-2019 20:23:04 [INFO] --- maven-install-plugin:2.3.1:install (default-install) @ org.codehaus.groovy.eclipse.site ---
22-Aug-2019 20:23:04 [INFO] Installing /opt/bamboo-home/xml-data/build-dir/GRECLIPSE-E410-JOB1/Site-org.codehaus.groovy.eclipse/target/site.zip to /home/bamboo/.m2/repository/org/codehaus/groovy/eclipse/org.codehaus.groovy.eclipse.site/3.5.0-SNAPSHOT/org.codehaus.groovy.eclipse.site-3.5.0-SNAPSHOT.zip
22-Aug-2019 20:23:04 [INFO] Installing /opt/bamboo-home/xml-data/build-dir/GRECLIPSE-E410-JOB1/Site-org.codehaus.groovy.eclipse/pom.xml to /home/bamboo/.m2/repository/org/codehaus/groovy/eclipse/org.codehaus.groovy.eclipse.site/3.5.0-SNAPSHOT/org.codehaus.groovy.eclipse.site-3.5.0-SNAPSHOT.pom
22-Aug-2019 20:23:04 [INFO]
22-Aug-2019 20:23:04 [INFO] --- maven-deploy-plugin:2.8.2:deploy (default-deploy) @ org.codehaus.groovy.eclipse.site ---
22-Aug-2019 20:23:04 [INFO] Skipping artifact deployment
22-Aug-2019 20:23:04 [INFO]
22-Aug-2019 20:23:04 [INFO] --- maven-antrun-plugin:1.8:run (upload-dist) @ org.codehaus.groovy.eclipse.site ---
22-Aug-2019 20:23:04 [INFO] Executing tasks
22-Aug-2019 20:23:04
22-Aug-2019 20:23:04 main:
22-Aug-2019 20:23:04      [echo] Uploading main update site to s3..."
22-Aug-2019 20:23:04      [echo] ==== dist props are set so we can deploy? ===
22-Aug-2019 20:23:04      [echo] bamboo.s3.properties=${bamboo.s3.properties}
22-Aug-2019 20:23:04      [echo] dist_properties=/home/bamboo/tools/s3.properties
22-Aug-2019 20:23:04      [echo] env.bamboo_s3_properties_rel=/home/bamboo/tools/s3.properties
22-Aug-2019 20:23:04      [echo] dist.accessKey=AKIA6I3ZT3GJ2UDU5GRG
22-Aug-2019 20:23:04      [echo] accessKey=AKIA6I3ZT3GJ2UDU5GRG
22-Aug-2019 20:23:04      [echo] site.target.dir=/opt/bamboo-home/xml-data/build-dir/GRECLIPSE-E410-JOB1/Site-org.codehaus.groovy.eclipse/target
22-Aug-2019 20:23:04      [echo] unqualifiedVersion=3.5.0
22-Aug-2019 20:23:04      [echo] buildQualifier=v201908221837-e1812
22-Aug-2019 20:23:04      [echo] dist.full.version=3.5.0.v201908221837-e1812
22-Aug-2019 20:23:04      [echo] dist.file.name=org.codehaus.groovy-3.5.0.v201908221837-e1812-updatesite.zip
22-Aug-2019 20:23:04       [zip] Building zip: /opt/bamboo-home/xml-data/build-dir/GRECLIPSE-E410-JOB1/Site-org.codehaus.groovy.eclipse/target/site/org.codehaus.groovy-3.5.0.v201908221837-e1812-updatesite.zip
22-Aug-2019 20:23:07      [echo] Preparing for upload... This will happen:
22-Aug-2019 20:23:07      [echo] Will Delete:
22-Aug-2019 20:23:07      [echo] dist.bucket=dist.springsource.org
22-Aug-2019 20:23:07      [echo] dist.path=snapshot/GRECLIPSE/e4.10
22-Aug-2019 20:23:07      [echo] Will Upload:
22-Aug-2019 20:23:07      [echo] dist.bucket=dist.springsource.org
22-Aug-2019 20:23:07      [echo] fromDir=/opt/bamboo-home/xml-data/build-dir/GRECLIPSE-E410-JOB1/Site-org.codehaus.groovy.eclipse/target/site
22-Aug-2019 20:23:07      [echo] toDir=snapshot/GRECLIPSE/e4.10
22-Aug-2019 20:23:07      [echo] Will Upload:
22-Aug-2019 20:23:07      [echo] dist.bucket=dist.springsource.org
22-Aug-2019 20:23:07      [echo] fromFile=/opt/bamboo-home/xml-data/build-dir/GRECLIPSE-E410-JOB1/Site-org.codehaus.groovy.eclipse/target/site/org.codehaus.groovy-3.5.0.v201908221837-e1812-updatesite.zip
22-Aug-2019 20:23:07      [echo] toFile=snapshot/GRECLIPSE/e4.10/org.codehaus.groovy-3.5.0.v201908221837-e1812-updatesite.zip
22-Aug-2019 20:23:07      [echo] metadata project.name=Groovy Eclipse
22-Aug-2019 20:23:07      [echo] metadata release.type=snapshot
22-Aug-2019 20:23:07      [echo] metadata bundle.version=3.5.0.v201908221837-e1812
22-Aug-2019 20:23:07      [echo] metadata package.file.name=org.codehaus.groovy-3.5.0.v201908221837-e1812-updatesite.zip
22-Aug-2019 20:23:08 Deleted s3://dist.springsource.org/snapshot/GRECLIPSE/e4.10/artifacts.jar
22-Aug-2019 20:23:08 Deleted s3://dist.springsource.org/snapshot/GRECLIPSE/e4.10/content.jar
22-Aug-2019 20:23:08 Deleted s3://dist.springsource.org/snapshot/GRECLIPSE/e4.10/features/
22-Aug-2019 20:23:08 Deleted s3://dist.springsource.org/snapshot/GRECLIPSE/e4.10/features/org.codehaus.groovy.compilerless.feature_3.5.0.v201908202037-e1812.jar
22-Aug-2019 20:23:08 Deleted s3://dist.springsource.org/snapshot/GRECLIPSE/e4.10/features/org.codehaus.groovy.eclipse.feature_3.5.0.v201908202037-e1812.jar
22-Aug-2019 20:23:08 Deleted s3://dist.springsource.org/snapshot/GRECLIPSE/e4.10/features/org.codehaus.groovy.headless.feature_3.5.0.v201908202037-e1812.jar
22-Aug-2019 20:23:08 Deleted s3://dist.springsource.org/snapshot/GRECLIPSE/e4.10/features/org.codehaus.groovy.jdt.patch_3.5.0.v201908202037-e1812.jar
22-Aug-2019 20:23:09 Deleted s3://dist.springsource.org/snapshot/GRECLIPSE/e4.10/features/org.codehaus.groovy.m2eclipse.feature_3.5.0.v201908202037-e1812.jar
22-Aug-2019 20:23:09 Deleted s3://dist.springsource.org/snapshot/GRECLIPSE/e4.10/features/org.codehaus.groovy24.feature_3.5.0.v201908202037-e1812.jar
22-Aug-2019 20:23:09 Deleted s3://dist.springsource.org/snapshot/GRECLIPSE/e4.10/features/org.codehaus.groovy25.feature_3.5.0.v201908202037-e1812.jar
22-Aug-2019 20:23:09 Deleted s3://dist.springsource.org/snapshot/GRECLIPSE/e4.10/features/org.codehaus.groovy30.feature_3.5.0.v201908202037-e1812.jar
22-Aug-2019 20:23:09 Deleted s3://dist.springsource.org/snapshot/GRECLIPSE/e4.10/plugins/
22-Aug-2019 20:23:09 Deleted s3://dist.springsource.org/snapshot/GRECLIPSE/e4.10/plugins/org.codehaus.groovy.eclipse.ant_3.5.0.v201908202037-e1812.jar
22-Aug-2019 20:23:09 Deleted s3://dist.springsource.org/snapshot/GRECLIPSE/e4.10/plugins/org.codehaus.groovy.eclipse.astviews_3.5.0.v201908202037-e1812.jar
22-Aug-2019 20:23:09 Deleted s3://dist.springsource.org/snapshot/GRECLIPSE/e4.10/plugins/org.codehaus.groovy.eclipse.codeassist_3.5.0.v201908202037-e1812.jar
22-Aug-2019 20:23:09 Deleted s3://dist.springsource.org/snapshot/GRECLIPSE/e4.10/plugins/org.codehaus.groovy.eclipse.codebrowsing_3.5.0.v201908202037-e1812.jar
22-Aug-2019 20:23:10 Deleted s3://dist.springsource.org/snapshot/GRECLIPSE/e4.10/plugins/org.codehaus.groovy.eclipse.compilerResolver_3.5.0.v201908202037-e1812.jar
22-Aug-2019 20:23:10 Deleted s3://dist.springsource.org/snapshot/GRECLIPSE/e4.10/plugins/org.codehaus.groovy.eclipse.core_3.5.0.v201908202037-e1812.jar
22-Aug-2019 20:23:10 Deleted s3://dist.springsource.org/snapshot/GRECLIPSE/e4.10/plugins/org.codehaus.groovy.eclipse.dsl_3.5.0.v201908202037-e1812.jar
22-Aug-2019 20:23:10 Deleted s3://dist.springsource.org/snapshot/GRECLIPSE/e4.10/plugins/org.codehaus.groovy.eclipse.quickfix_3.5.0.v201908202037-e1812.jar
22-Aug-2019 20:23:10 Deleted s3://dist.springsource.org/snapshot/GRECLIPSE/e4.10/plugins/org.codehaus.groovy.eclipse.refactoring_3.5.0.v201908202037-e1812.jar
22-Aug-2019 20:23:10 Deleted s3://dist.springsource.org/snapshot/GRECLIPSE/e4.10/plugins/org.codehaus.groovy.eclipse.ui_3.5.0.v201908202037-e1812.jar
22-Aug-2019 20:23:10 Deleted s3://dist.springsource.org/snapshot/GRECLIPSE/e4.10/plugins/org.codehaus.groovy.eclipse_3.5.0.v201908202037-e1812.jar
22-Aug-2019 20:23:10 Deleted s3://dist.springsource.org/snapshot/GRECLIPSE/e4.10/plugins/org.codehaus.groovy.m2eclipse_3.5.0.v201908202037-e1812.jar
22-Aug-2019 20:23:10 Deleted s3://dist.springsource.org/snapshot/GRECLIPSE/e4.10/plugins/org.codehaus.groovy_2.4.17.v201908202037-e1812.jar
22-Aug-2019 20:23:10 Deleted s3://dist.springsource.org/snapshot/GRECLIPSE/e4.10/plugins/org.codehaus.groovy_2.5.8.v201908202037-e1812.jar
22-Aug-2019 20:23:11 Deleted s3://dist.springsource.org/snapshot/GRECLIPSE/e4.10/plugins/org.codehaus.groovy_3.0.0.v201908202037-e1812.jar
22-Aug-2019 20:23:11 Deleted s3://dist.springsource.org/snapshot/GRECLIPSE/e4.10/plugins/org.eclipse.jdt.core_3.16.0.v201908202037-e1812.jar
22-Aug-2019 20:23:11 Deleted s3://dist.springsource.org/snapshot/GRECLIPSE/e4.10/plugins/org.eclipse.jdt.groovy.core_3.5.0.v201908202037-e1812.jar
22-Aug-2019 20:23:11 Deleted s3://dist.springsource.org/snapshot/GRECLIPSE/e4.10/site.xml
22-Aug-2019 20:23:11 Uploading /opt/bamboo-home/xml-data/build-dir/GRECLIPSE-E410-JOB1/Site-org.codehaus.groovy.eclipse/target/site/artifacts.jar (2.8 KB) to s3://dist.springsource.org/snapshot/GRECLIPSE/e4.10/artifacts.jar
22-Aug-2019 20:23:11 Transfer Time: .2 s - Transfer Rate: 17.1 KB/s
22-Aug-2019 20:23:12 Uploading /opt/bamboo-home/xml-data/build-dir/GRECLIPSE-E410-JOB1/Site-org.codehaus.groovy.eclipse/target/site/content.jar (11.5 KB) to s3://dist.springsource.org/snapshot/GRECLIPSE/e4.10/content.jar
22-Aug-2019 20:23:12 Transfer Time: .2 s - Transfer Rate: 59.6 KB/s
22-Aug-2019 20:23:12 Uploading /opt/bamboo-home/xml-data/build-dir/GRECLIPSE-E410-JOB1/Site-org.codehaus.groovy.eclipse/target/site/features/org.codehaus.groovy.compilerless.feature_3.5.0.v201908221837-e1812.jar (15.0 KB) to s3://dist.springsource.org/snapshot/GRECLIPSE/e4.10/features/org.codehaus.groovy.compilerless.feature_3.5.0.v201908221837-e1812.jar
22-Aug-2019 20:23:12 Transfer Time: .2 s - Transfer Rate: 72.3 KB/s
22-Aug-2019 20:23:13 Uploading /opt/bamboo-home/xml-data/build-dir/GRECLIPSE-E410-JOB1/Site-org.codehaus.groovy.eclipse/target/site/features/org.codehaus.groovy.eclipse.feature_3.5.0.v201908221837-e1812.jar (14.9 KB) to s3://dist.springsource.org/snapshot/GRECLIPSE/e4.10/features/org.codehaus.groovy.eclipse.feature_3.5.0.v201908221837-e1812.jar
22-Aug-2019 20:23:13 Transfer Time: .2 s - Transfer Rate: 88.2 KB/s
22-Aug-2019 20:23:13 Uploading /opt/bamboo-home/xml-data/build-dir/GRECLIPSE-E410-JOB1/Site-org.codehaus.groovy.eclipse/target/site/features/org.codehaus.groovy.headless.feature_3.5.0.v201908221837-e1812.jar (14.9 KB) to s3://dist.springsource.org/snapshot/GRECLIPSE/e4.10/features/org.codehaus.groovy.headless.feature_3.5.0.v201908221837-e1812.jar
22-Aug-2019 20:23:14 Transfer Time: .2 s - Transfer Rate: 70.6 KB/s
22-Aug-2019 20:23:14 Uploading /opt/bamboo-home/xml-data/build-dir/GRECLIPSE-E410-JOB1/Site-org.codehaus.groovy.eclipse/target/site/features/org.codehaus.groovy.jdt.patch_3.5.0.v201908221837-e1812.jar (9.3 KB) to s3://dist.springsource.org/snapshot/GRECLIPSE/e4.10/features/org.codehaus.groovy.jdt.patch_3.5.0.v201908221837-e1812.jar
22-Aug-2019 20:23:14 Transfer Time: .2 s - Transfer Rate: 55.8 KB/s
22-Aug-2019 20:23:15 Uploading /opt/bamboo-home/xml-data/build-dir/GRECLIPSE-E410-JOB1/Site-org.codehaus.groovy.eclipse/target/site/features/org.codehaus.groovy.m2eclipse.feature_3.5.0.v201908221837-e1812.jar (14.9 KB) to s3://dist.springsource.org/snapshot/GRECLIPSE/e4.10/features/org.codehaus.groovy.m2eclipse.feature_3.5.0.v201908221837-e1812.jar
22-Aug-2019 20:23:15 Transfer Time: .2 s - Transfer Rate: 84.2 KB/s
22-Aug-2019 20:23:15 Uploading /opt/bamboo-home/xml-data/build-dir/GRECLIPSE-E410-JOB1/Site-org.codehaus.groovy.eclipse/target/site/features/org.codehaus.groovy24.feature_3.5.0.v201908221837-e1812.jar (14.8 KB) to s3://dist.springsource.org/snapshot/GRECLIPSE/e4.10/features/org.codehaus.groovy24.feature_3.5.0.v201908221837-e1812.jar
22-Aug-2019 20:23:16 Transfer Time: .2 s - Transfer Rate: 89.9 KB/s
22-Aug-2019 20:23:16 Uploading /opt/bamboo-home/xml-data/build-dir/GRECLIPSE-E410-JOB1/Site-org.codehaus.groovy.eclipse/target/site/features/org.codehaus.groovy25.feature_3.5.0.v201908221837-e1812.jar (14.8 KB) to s3://dist.springsource.org/snapshot/GRECLIPSE/e4.10/features/org.codehaus.groovy25.feature_3.5.0.v201908221837-e1812.jar
22-Aug-2019 20:23:16 Transfer Time: .2 s - Transfer Rate: 81.5 KB/s
22-Aug-2019 20:23:17 Uploading /opt/bamboo-home/xml-data/build-dir/GRECLIPSE-E410-JOB1/Site-org.codehaus.groovy.eclipse/target/site/features/org.codehaus.groovy30.feature_3.5.0.v201908221837-e1812.jar (14.8 KB) to s3://dist.springsource.org/snapshot/GRECLIPSE/e4.10/features/org.codehaus.groovy30.feature_3.5.0.v201908221837-e1812.jar
22-Aug-2019 20:23:17 Transfer Time: .2 s - Transfer Rate: 88.9 KB/s
22-Aug-2019 20:23:17 Uploading /opt/bamboo-home/xml-data/build-dir/GRECLIPSE-E410-JOB1/Site-org.codehaus.groovy.eclipse/target/site/org.codehaus.groovy-3.5.0.v201908221837-e1812-updatesite.zip.md5 (.0 KB) to s3://dist.springsource.org/snapshot/GRECLIPSE/e4.10/org.codehaus.groovy-3.5.0.v201908221837-e1812-updatesite.zip.md5
22-Aug-2019 20:23:17 Transfer Time: .2 s - Transfer Rate: .2 KB/s
22-Aug-2019 20:23:18 Uploading /opt/bamboo-home/xml-data/build-dir/GRECLIPSE-E410-JOB1/Site-org.codehaus.groovy.eclipse/target/site/org.codehaus.groovy-3.5.0.v201908221837-e1812-updatesite.zip.sha1 (.0 KB) to s3://dist.springsource.org/snapshot/GRECLIPSE/e4.10/org.codehaus.groovy-3.5.0.v201908221837-e1812-updatesite.zip.sha1
22-Aug-2019 20:23:18 Transfer Time: .2 s - Transfer Rate: .3 KB/s
22-Aug-2019 20:23:18 Uploading /opt/bamboo-home/xml-data/build-dir/GRECLIPSE-E410-JOB1/Site-org.codehaus.groovy.eclipse/target/site/plugins/org.codehaus.groovy.eclipse.ant_3.5.0.v201908221837-e1812.jar (11.5 KB) to s3://dist.springsource.org/snapshot/GRECLIPSE/e4.10/plugins/org.codehaus.groovy.eclipse.ant_3.5.0.v201908221837-e1812.jar
22-Aug-2019 20:23:18 Transfer Time: .2 s - Transfer Rate: 53.3 KB/s
22-Aug-2019 20:23:19 Uploading /opt/bamboo-home/xml-data/build-dir/GRECLIPSE-E410-JOB1/Site-org.codehaus.groovy.eclipse/target/site/plugins/org.codehaus.groovy.eclipse.astviews_3.5.0.v201908221837-e1812.jar (79.2 KB) to s3://dist.springsource.org/snapshot/GRECLIPSE/e4.10/plugins/org.codehaus.groovy.eclipse.astviews_3.5.0.v201908221837-e1812.jar
22-Aug-2019 20:23:19 Transfer Time: .3 s - Transfer Rate: 309.2 KB/s
22-Aug-2019 20:23:20 Uploading /opt/bamboo-home/xml-data/build-dir/GRECLIPSE-E410-JOB1/Site-org.codehaus.groovy.eclipse/target/site/plugins/org.codehaus.groovy.eclipse.codeassist_3.5.0.v201908221837-e1812.jar (272.8 KB) to s3://dist.springsource.org/snapshot/GRECLIPSE/e4.10/plugins/org.codehaus.groovy.eclipse.codeassist_3.5.0.v201908221837-e1812.jar
22-Aug-2019 20:23:20 Transfer Time: .5 s - Transfer Rate: 571.9 KB/s
22-Aug-2019 20:23:20 Uploading /opt/bamboo-home/xml-data/build-dir/GRECLIPSE-E410-JOB1/Site-org.codehaus.groovy.eclipse/target/site/plugins/org.codehaus.groovy.eclipse.codebrowsing_3.5.0.v201908221837-e1812.jar (86.8 KB) to s3://dist.springsource.org/snapshot/GRECLIPSE/e4.10/plugins/org.codehaus.groovy.eclipse.codebrowsing_3.5.0.v201908221837-e1812.jar
22-Aug-2019 20:23:21 Transfer Time: .3 s - Transfer Rate: 345.7 KB/s
22-Aug-2019 20:23:21 Uploading /opt/bamboo-home/xml-data/build-dir/GRECLIPSE-E410-JOB1/Site-org.codehaus.groovy.eclipse/target/site/plugins/org.codehaus.groovy.eclipse.compilerResolver_3.5.0.v201908221837-e1812.jar (20.4 KB) to s3://dist.springsource.org/snapshot/GRECLIPSE/e4.10/plugins/org.codehaus.groovy.eclipse.compilerResolver_3.5.0.v201908221837-e1812.jar
22-Aug-2019 20:23:21 Transfer Time: .2 s - Transfer Rate: 112.8 KB/s
22-Aug-2019 20:23:22 Uploading /opt/bamboo-home/xml-data/build-dir/GRECLIPSE-E410-JOB1/Site-org.codehaus.groovy.eclipse/target/site/plugins/org.codehaus.groovy.eclipse.core_3.5.0.v201908221837-e1812.jar (83.3 KB) to s3://dist.springsource.org/snapshot/GRECLIPSE/e4.10/plugins/org.codehaus.groovy.eclipse.core_3.5.0.v201908221837-e1812.jar
22-Aug-2019 20:23:22 Transfer Time: .2 s - Transfer Rate: 489.8 KB/s
22-Aug-2019 20:23:22 Uploading /opt/bamboo-home/xml-data/build-dir/GRECLIPSE-E410-JOB1/Site-org.codehaus.groovy.eclipse/target/site/plugins/org.codehaus.groovy.eclipse.dsl_3.5.0.v201908221837-e1812.jar (395.7 KB) to s3://dist.springsource.org/snapshot/GRECLIPSE/e4.10/plugins/org.codehaus.groovy.eclipse.dsl_3.5.0.v201908221837-e1812.jar
22-Aug-2019 20:23:22 Transfer Time: .3 s - Transfer Rate: 1.5 MB/s
22-Aug-2019 20:23:23 Uploading /opt/bamboo-home/xml-data/build-dir/GRECLIPSE-E410-JOB1/Site-org.codehaus.groovy.eclipse/target/site/plugins/org.codehaus.groovy.eclipse.quickfix_3.5.0.v201908221837-e1812.jar (110.1 KB) to s3://dist.springsource.org/snapshot/GRECLIPSE/e4.10/plugins/org.codehaus.groovy.eclipse.quickfix_3.5.0.v201908221837-e1812.jar
22-Aug-2019 20:23:23 Transfer Time: .2 s - Transfer Rate: 556.3 KB/s
22-Aug-2019 20:23:23 Uploading /opt/bamboo-home/xml-data/build-dir/GRECLIPSE-E410-JOB1/Site-org.codehaus.groovy.eclipse/target/site/plugins/org.codehaus.groovy.eclipse.refactoring_3.5.0.v201908221837-e1812.jar (271.7 KB) to s3://dist.springsource.org/snapshot/GRECLIPSE/e4.10/plugins/org.codehaus.groovy.eclipse.refactoring_3.5.0.v201908221837-e1812.jar
22-Aug-2019 20:23:24 Transfer Time: .3 s - Transfer Rate: 927.4 KB/s
22-Aug-2019 20:23:24 Uploading /opt/bamboo-home/xml-data/build-dir/GRECLIPSE-E410-JOB1/Site-org.codehaus.groovy.eclipse/target/site/plugins/org.codehaus.groovy.eclipse.ui_3.5.0.v201908221837-e1812.jar (552.0 KB) to s3://dist.springsource.org/snapshot/GRECLIPSE/e4.10/plugins/org.codehaus.groovy.eclipse.ui_3.5.0.v201908221837-e1812.jar
22-Aug-2019 20:23:24 Transfer Time: .2 s - Transfer Rate: 2.5 MB/s
22-Aug-2019 20:23:25 Uploading /opt/bamboo-home/xml-data/build-dir/GRECLIPSE-E410-JOB1/Site-org.codehaus.groovy.eclipse/target/site/plugins/org.codehaus.groovy.eclipse_3.5.0.v201908221837-e1812.jar (16.7 KB) to s3://dist.springsource.org/snapshot/GRECLIPSE/e4.10/plugins/org.codehaus.groovy.eclipse_3.5.0.v201908221837-e1812.jar
22-Aug-2019 20:23:25 Transfer Time: .2 s - Transfer Rate: 100.5 KB/s
22-Aug-2019 20:23:25 Uploading /opt/bamboo-home/xml-data/build-dir/GRECLIPSE-E410-JOB1/Site-org.codehaus.groovy.eclipse/target/site/plugins/org.codehaus.groovy.m2eclipse_3.5.0.v201908221837-e1812.jar (17.9 KB) to s3://dist.springsource.org/snapshot/GRECLIPSE/e4.10/plugins/org.codehaus.groovy.m2eclipse_3.5.0.v201908221837-e1812.jar
22-Aug-2019 20:23:26 Transfer Time: .2 s - Transfer Rate: 96.2 KB/s
22-Aug-2019 20:23:26 Uploading /opt/bamboo-home/xml-data/build-dir/GRECLIPSE-E410-JOB1/Site-org.codehaus.groovy.eclipse/target/site/plugins/org.codehaus.groovy_2.4.17.v201908221837-e1812.jar (18.8 MB) to s3://dist.springsource.org/snapshot/GRECLIPSE/e4.10/plugins/org.codehaus.groovy_2.4.17.v201908221837-e1812.jar
22-Aug-2019 20:23:27 Transfer Time: 1.0 s - Transfer Rate: 18.9 MB/s
22-Aug-2019 20:23:27 Uploading /opt/bamboo-home/xml-data/build-dir/GRECLIPSE-E410-JOB1/Site-org.codehaus.groovy.eclipse/target/site/plugins/org.codehaus.groovy_2.5.8.v201908221837-e1812.jar (17.7 MB) to s3://dist.springsource.org/snapshot/GRECLIPSE/e4.10/plugins/org.codehaus.groovy_2.5.8.v201908221837-e1812.jar
22-Aug-2019 20:23:28 Transfer Time: 1.0 s - Transfer Rate: 17.3 MB/s
22-Aug-2019 20:23:29 Uploading /opt/bamboo-home/xml-data/build-dir/GRECLIPSE-E410-JOB1/Site-org.codehaus.groovy.eclipse/target/site/plugins/org.codehaus.groovy_3.0.0.v201908221837-e1812.jar (21.6 MB) to s3://dist.springsource.org/snapshot/GRECLIPSE/e4.10/plugins/org.codehaus.groovy_3.0.0.v201908221837-e1812.jar
22-Aug-2019 20:23:30 Transfer Time: 1.2 s - Transfer Rate: 18.1 MB/s
22-Aug-2019 20:23:30 Uploading /opt/bamboo-home/xml-data/build-dir/GRECLIPSE-E410-JOB1/Site-org.codehaus.groovy.eclipse/target/site/plugins/org.eclipse.jdt.core_3.16.0.v201908221837-e1812.jar (6.6 MB) to s3://dist.springsource.org/snapshot/GRECLIPSE/e4.10/plugins/org.eclipse.jdt.core_3.16.0.v201908221837-e1812.jar
22-Aug-2019 20:23:31 Transfer Time: .5 s - Transfer Rate: 13.4 MB/s
22-Aug-2019 20:23:31 Uploading /opt/bamboo-home/xml-data/build-dir/GRECLIPSE-E410-JOB1/Site-org.codehaus.groovy.eclipse/target/site/plugins/org.eclipse.jdt.groovy.core_3.5.0.v201908221837-e1812.jar (456.1 KB) to s3://dist.springsource.org/snapshot/GRECLIPSE/e4.10/plugins/org.eclipse.jdt.groovy.core_3.5.0.v201908221837-e1812.jar
22-Aug-2019 20:23:32 Transfer Time: .2 s - Transfer Rate: 2.4 MB/s
22-Aug-2019 20:23:32 Uploading /opt/bamboo-home/xml-data/build-dir/GRECLIPSE-E410-JOB1/Site-org.codehaus.groovy.eclipse/target/site/site.xml (2.8 KB) to s3://dist.springsource.org/snapshot/GRECLIPSE/e4.10/site.xml
22-Aug-2019 20:23:32 Transfer Time: .2 s - Transfer Rate: 17.8 KB/s
22-Aug-2019 20:23:32 Uploading /opt/bamboo-home/xml-data/build-dir/GRECLIPSE-E410-JOB1/Site-org.codehaus.groovy.eclipse/target/site/org.codehaus.groovy-3.5.0.v201908221837-e1812-updatesite.zip (66.6 MB) to s3://dist.springsource.org/snapshot/GRECLIPSE/e4.10/org.codehaus.groovy-3.5.0.v201908221837-e1812-updatesite.zip
22-Aug-2019 20:23:35 Transfer Time: 3.1 s - Transfer Rate: 21.4 MB/s
22-Aug-2019 20:23:35 [INFO] Executed tasks
22-Aug-2019 20:23:35 [INFO] ------------------------------------------------------------------------
22-Aug-2019 20:23:35 [INFO] Reactor Summary:
22-Aug-2019 20:23:35 [INFO]
22-Aug-2019 20:23:35 [INFO] org.codehaus.groovy.eclipse.parent ................. SUCCESS [  0.154 s]
22-Aug-2019 20:23:35 [INFO] org.codehaus.groovy ................................ SUCCESS [  5.724 s]
22-Aug-2019 20:23:35 [INFO] org.codehaus.groovy ................................ SUCCESS [  3.613 s]
22-Aug-2019 20:23:35 [INFO] org.codehaus.groovy ................................ SUCCESS [  4.416 s]
22-Aug-2019 20:23:35 [INFO] org.codehaus.groovy.eclipse.compilerResolver ....... SUCCESS [  0.918 s]
22-Aug-2019 20:23:35 [INFO] org.eclipse.jdt.core ............................... SUCCESS [  9.855 s]
22-Aug-2019 20:23:35 [INFO] org.eclipse.jdt.groovy.core ........................ SUCCESS [  1.737 s]
22-Aug-2019 20:23:35 [INFO] org.codehaus.groovy.eclipse ........................ SUCCESS [  0.380 s]
22-Aug-2019 20:23:35 [INFO] org.codehaus.groovy.eclipse.core ................... SUCCESS [  0.971 s]
22-Aug-2019 20:23:35 [INFO] org.codehaus.groovy.eclipse.ant .................... SUCCESS [  0.780 s]
22-Aug-2019 20:23:35 [INFO] org.codehaus.groovy.eclipse.codebrowsing ........... SUCCESS [  1.129 s]
22-Aug-2019 20:23:35 [INFO] org.codehaus.groovy.eclipse.refactoring ............ SUCCESS [  1.443 s]
22-Aug-2019 20:23:35 [INFO] org.codehaus.groovy.eclipse.ui ..................... SUCCESS [  1.902 s]
22-Aug-2019 20:23:35 [INFO] org.codehaus.groovy.eclipse.astviews ............... SUCCESS [  2.534 s]
22-Aug-2019 20:23:35 [INFO] org.codehaus.groovy.eclipse.codeassist ............. SUCCESS [  1.553 s]
22-Aug-2019 20:23:35 [INFO] org.codehaus.groovy.eclipse.dsl .................... SUCCESS [  1.554 s]
22-Aug-2019 20:23:35 [INFO] org.codehaus.groovy.eclipse.quickfix ............... SUCCESS [  1.236 s]
22-Aug-2019 20:23:35 [INFO] org.codehaus.groovy24.feature ...................... SUCCESS [  0.486 s]
22-Aug-2019 20:23:35 [INFO] org.codehaus.groovy25.feature ...................... SUCCESS [  0.425 s]
22-Aug-2019 20:23:35 [INFO] org.codehaus.groovy30.feature ...................... SUCCESS [  0.461 s]
22-Aug-2019 20:23:35 [INFO] org.codehaus.groovy.jdt.patch ...................... SUCCESS [  0.553 s]
22-Aug-2019 20:23:35 [INFO] org.codehaus.groovy.headless.feature ............... SUCCESS [  0.564 s]
22-Aug-2019 20:23:35 [INFO] org.codehaus.groovy.compilerless.feature ........... SUCCESS [  0.691 s]
22-Aug-2019 20:23:35 [INFO] org.codehaus.groovy.eclipse.feature ................ SUCCESS [  0.506 s]
22-Aug-2019 20:23:35 [INFO] org.eclipse.jdt.core.tests.compiler ................ SUCCESS [  4.737 s]
22-Aug-2019 20:23:35 [INFO] org.eclipse.jdt.core.tests.builder ................. SUCCESS [  1.079 s]
22-Aug-2019 20:23:35 [INFO] org.eclipse.jdt.groovy.core.tests.compiler ......... SUCCESS [  1.258 s]
22-Aug-2019 20:23:35 [INFO] org.eclipse.jdt.groovy.core.tests.builder .......... SUCCESS [  1.262 s]
22-Aug-2019 20:23:35 [INFO] org.codehaus.groovy.eclipse.tests .................. SUCCESS [  2.901 s]
22-Aug-2019 20:23:35 [INFO] org.codehaus.groovy.eclipse.codeassist.test ........ SUCCESS [  1.897 s]
22-Aug-2019 20:23:35 [INFO] org.codehaus.groovy.eclipse.codebrowsing.test ...... SUCCESS [  1.531 s]
22-Aug-2019 20:23:35 [INFO] org.codehaus.groovy.eclipse.core.test .............. SUCCESS [  1.159 s]
22-Aug-2019 20:23:35 [INFO] org.codehaus.groovy.eclipse.dsl.tests .............. SUCCESS [  1.692 s]
22-Aug-2019 20:23:35 [INFO] org.codehaus.groovy.eclipse.junit.test ............. SUCCESS [  1.039 s]
22-Aug-2019 20:23:35 [INFO] org.codehaus.groovy.eclipse.refactoring.test ....... SUCCESS [  2.159 s]
22-Aug-2019 20:23:35 [INFO] org.codehaus.groovy.eclipse.quickfix.test .......... SUCCESS [  1.445 s]
22-Aug-2019 20:23:35 [INFO] org.codehaus.groovy.alltests ....................... SUCCESS [  01:43 h]
22-Aug-2019 20:23:35 [INFO] org.codehaus.groovy.m2eclipse ...................... SUCCESS [  0.850 s]
22-Aug-2019 20:23:35 [INFO] org.codehaus.groovy.m2eclipse.feature .............. SUCCESS [  0.419 s]
22-Aug-2019 20:23:35 [INFO] org.codehaus.groovy.eclipse.site ................... SUCCESS [ 35.278 s]
22-Aug-2019 20:23:35 [INFO] ------------------------------------------------------------------------
22-Aug-2019 20:23:35 [INFO] BUILD SUCCESS
22-Aug-2019 20:23:35 [INFO] ------------------------------------------------------------------------
22-Aug-2019 20:23:35 [INFO] Total time: 01:46 h
22-Aug-2019 20:23:35 [INFO] Finished at: 2019-08-22T20:23:35+00:00
22-Aug-2019 20:23:36 [INFO] Final Memory: 190M/1504M
22-Aug-2019 20:23:36 [INFO] ------------------------------------------------------------------------
22-Aug-2019 20:23:36 [WARNING] The requested profile "snapshot" could not be activated because it does not exist.
22-Aug-2019 20:23:37 Parsing test results under /opt/bamboo-home/xml-data/build-dir/GRECLIPSE-E410-JOB1...
22-Aug-2019 20:23:37 Failing task since 10 failing test cases were found.
22-Aug-2019 20:23:37 Finished task 'Maven 3.x' with result: Failed
22-Aug-2019 20:23:37 Running post build plugin 'Docker Container Cleanup'
22-Aug-2019 20:23:37 Running post build plugin 'NCover Results Collector'
22-Aug-2019 20:23:37 Running post build plugin 'Artifactory Release Management Staging'
22-Aug-2019 20:23:37 Running post build plugin 'Artifactory Build Info Copier'
22-Aug-2019 20:23:37 Running post build plugin 'Artifactory Gradle Properties Info Copier'
22-Aug-2019 20:23:37 Running post build plugin 'Clover Results Collector'
22-Aug-2019 20:23:37 Running post build plugin 'npm Cache Cleanup'
22-Aug-2019 20:23:37 Running post build plugin 'Artifact Copier'
22-Aug-2019 20:23:37 Publishing an artifact: surefire-reports
22-Aug-2019 20:23:38 Finished publishing of artifact Non required job artifact: [surefire-reports], pattern: [**/target/TEST-*.xml] in 623.3 ms
22-Aug-2019 20:23:38 Publishing an artifact: Zipped Update Site
22-Aug-2019 20:23:41 Finished publishing of artifact Non required job artifact: [Zipped Update Site], pattern: [**/*updatesite.zip] anchored at: [Site-org.codehaus.groovy.eclipse/target/site] in 3.568 s
22-Aug-2019 20:23:42 Successfully removed working directory at '/opt/bamboo-home/xml-data/build-dir/GRECLIPSE-E410-JOB1'
22-Aug-2019 20:23:42 Finalising the build...
22-Aug-2019 20:23:42 Stopping timer.
22-Aug-2019 20:23:42 Build GRECLIPSE-E410-JOB1-334 completed.
22-Aug-2019 20:23:42 Running on server: post build plugin 'NCover Results Collector'
22-Aug-2019 20:23:42 Running on server: post build plugin 'Build Hanging Detection Configuration'
22-Aug-2019 20:23:42 Running on server: post build plugin 'Bamboo project link creator'
22-Aug-2019 20:23:42 Running on server: post build plugin 'Clover Delta Calculator'
22-Aug-2019 20:23:42 Running on server: post build plugin 'Maven Dependencies Postprocessor'
22-Aug-2019 20:23:42 All post build plugins have finished
22-Aug-2019 20:23:42 Generating build results summary...
22-Aug-2019 20:23:43 Saving build results to disk...
22-Aug-2019 20:23:43 Logging substituted variables...
22-Aug-2019 20:23:43 Indexing build results...
22-Aug-2019 20:23:43 Finished building GRECLIPSE-E410-JOB1-334.