Build: #374 failed

Job: Default Job failed

Stages & jobs

  1. Default Stage

Job result summary

Completed
Duration
92 minutes
Agent
bamboo-15.af.pivotal.io
Revision
a8e2b6945b3bb8cc0a491f13bd131e255a6fa6d0 a8e2b6945b3bb8cc0a491f13bd131e255a6fa6d0
Total tests
6030
Failing since
#369 (Code changes detected – )

Tests

  • 6,030 tests in total
  • 10 tests failed
  • 9 failures are new
  • 7 tests were fixed
  • 111 tests were quarantined / skipped
  • 87 minutes taken in total.
New test failures 9
Status Test Duration
Collapse Failed BinarySearchTests testClassDecl2 History
1 sec
java.lang.AssertionError: Expecting 4 matches, but found 0

java.lang.AssertionError: 
Expecting 4 matches, but found 0

	at org.eclipse.jdt.core.groovy.tests.search.BinarySearchTests.assertMatches(BinarySearchTests.java:139)
	at org.eclipse.jdt.core.groovy.tests.search.BinarySearchTests.testClassDecl2(BinarySearchTests.java:172)
Collapse Failed BinarySearchTests testFieldRefInInitializer History
1 sec
java.lang.AssertionError: Expecting 1 matches, but found 0

java.lang.AssertionError: 
Expecting 1 matches, but found 0

	at org.eclipse.jdt.core.groovy.tests.search.BinarySearchTests.assertMatches(BinarySearchTests.java:139)
	at org.eclipse.jdt.core.groovy.tests.search.BinarySearchTests.testFieldRefInInitializer(BinarySearchTests.java:208)
Collapse Failed ConstructorReferenceSearchTests testConstructorReferences10 History
< 1 sec
java.lang.AssertionError: expected:<1> but was:<0>
	at org.eclipse.jdt.core.groovy.tests.search.ConstructorReferenceSearchTests.testConstructorReferences10(ConstructorReferenceSearchTests.java:258)
Collapse Failed ConstructorReferenceSearchTests testConstructorReferences3 History
< 1 sec
java.lang.AssertionError: expected:<3> but was:<0>
	at org.eclipse.jdt.core.groovy.tests.search.ConstructorReferenceSearchTests.testConstructorReferences3(ConstructorReferenceSearchTests.java:126)
Collapse Failed ConstructorReferenceSearchTests testConstructorReferences6 History
< 1 sec
java.lang.AssertionError: expected:<2> but was:<0>
	at org.eclipse.jdt.core.groovy.tests.search.ConstructorReferenceSearchTests.testConstructorReferences6(ConstructorReferenceSearchTests.java:180)
Collapse Failed ConstructorReferenceSearchTests testNewifyConstructorReferences2 History
< 1 sec
java.lang.AssertionError: expected:<2> but was:<0>
	at org.eclipse.jdt.core.groovy.tests.search.ConstructorReferenceSearchTests.testNewifyConstructorReferences2(ConstructorReferenceSearchTests.java:408)
Collapse Failed DGMInferencingTests testDGMClosure3 History
< 1 sec
java.lang.AssertionError: Expected type not found.
Expected: java.lang.String
Found: java.lang.Object
Declaring type: groovy.lang.Closure<V extends java.lang.Object>
ASTNode: org.codehaus.groovy.ast.expr.VariableExpression@ebcdb[variable: it]
Confidence: INFERRED

java.lang.AssertionError: 
(9 more lines...)
Collapse Failed MethodReferenceSearchTests testExplicitPropertySetterSearch2 History
< 1 sec
java.lang.AssertionError: expected:<5> but was:<0>
	at org.eclipse.jdt.core.groovy.tests.search.MethodReferenceSearchTests.testExplicitPropertySetterSearch2(MethodReferenceSearchTests.java:594)
Collapse Failed MethodReferenceSearchTests testMethodWithDefaultParameters3 History
< 1 sec
java.lang.AssertionError: expected:<2> but was:<0>
	at org.eclipse.jdt.core.groovy.tests.search.MethodReferenceSearchTests.testMethodWithDefaultParameters3(MethodReferenceSearchTests.java:369)
Existing test failures 1
Status Test Failing since Duration
junit.framework.ComparisonFailure: 
----------- Expected ------------

------------ but was ------------
Problem : The import util.MyException is never used [ resource : </Project/src/p/Test.java> range : <18,34> category : <120> severity : <1>]

--------- Difference is ----------
 expected:<[]> but was:<[Problem : The import util.MyException is never used [ resource : </Project/src/p/Test.java> range : <18,34> category : <120> severity : <1>]
(12 more lines...)
Fixed tests 7
Status Test Failing since Duration
Successful BasicGroovyBuildTests testBuildGroovy2 History
Failing since build #373 (Code changes detected) < 1 sec
Successful ArrayInferencingTests testArrayProperty7 History
Failing since build #373 (Code changes detected) < 1 sec
Successful ClosureInferencingTests testClosureReturnType3 History
Failing since build #373 (Code changes detected) < 1 sec
Successful DGMInferencingTests testDGMClosure18 History
Failing since build #373 (Code changes detected) < 1 sec
Successful DGMInferencingTests testDGMClosure21 History
Failing since build #373 (Code changes detected) < 1 sec
Successful DGMInferencingTests testDGMDeclaring2 History
Failing since build #373 (Code changes detected) < 1 sec
Successful InferencingTests testSpread15 History
Failing since build #372 (Code changes detected) < 1 sec

Error summary

The build generated some errors. See the full build log for more details.

Waiting for: Java indexing... 22 files to index (/opt/jdk8u212-b03/jre/lib/rt.jar)
Waiting for: Updating index names
Waiting for: Java indexing... 17 files to index (/opt/jdk8u212-b03/jre/lib/rt.jar)
Waiting for: Updating index names
Waiting for: Java indexing... 17 files to index (/opt/jdk8u212-b03/jre/lib/rt.jar)
Waiting for: Java indexing... 18 files to index (/opt/jdk8u212-b03/jre/lib/rt.jar)
Waiting for: Updating index names
Waiting for: Java indexing... 18 files to index (/opt/jdk8u212-b03/jre/lib/rt.jar)
Waiting for: Java indexing... 16 files to index (/opt/jdk8u212-b03/jre/lib/rt.jar)
Waiting for: Java indexing... 18 files to index (/opt/jdk8u212-b03/jre/lib/rt.jar)
Waiting for: Java indexing... 16 files to index (/opt/jdk8u212-b03/jre/lib/rt.jar)
Waiting for: Java indexing... 16 files to index (/opt/jdk8u212-b03/jre/lib/rt.jar)
Waiting for: Updating index names
Waiting for: Java indexing... 16 files to index (/opt/jdk8u212-b03/jre/lib/rt.jar)
Waiting for: Updating index names
Waiting for: Java indexing... 18 files to index (/opt/jdk8u212-b03/jre/lib/rt.jar)
Waiting for: Java indexing... 15 files to index (/opt/jdk8u212-b03/jre/lib/rt.jar)
Waiting for: Java indexing... 19 files to index (/opt/jdk8u212-b03/jre/lib/rt.jar)
Waiting for: Java indexing... 21 files to index (/Project)
Waiting for: Updating index names
Waiting for: Java indexing... 17 files to index (/opt/jdk8u212-b03/jre/lib/rt.jar)
Waiting for: Java indexing... 16 files to index (/opt/jdk8u212-b03/jre/lib/rt.jar)
Waiting for: Java indexing... 21 files to index (/Project)
Waiting for: Java indexing... 18 files to index (/opt/jdk8u212-b03/jre/lib/rt.jar)
Waiting for: Java indexing... 15 files to index (/opt/jdk8u212-b03/jre/lib/rt.jar)
Waiting for: Java indexing... 18 files to index (/opt/jdk8u212-b03/jre/lib/rt.jar)
Waiting for: Java indexing... 21 files to index (/Project)
Waiting for: Java indexing... 17 files to index (/opt/jdk8u212-b03/jre/lib/rt.jar)
Waiting for: Java indexing... 18 files to index (/opt/jdk8u212-b03/jre/lib/rt.jar)
Waiting for: Java indexing... 18 files to index (/opt/jdk8u212-b03/jre/lib/rt.jar)
Waiting for: Java indexing... 21 files to index (/Project)
Waiting for: Java indexing... 18 files to index (/opt/jdk8u212-b03/jre/lib/rt.jar)
Waiting for: Java indexing... 21 files to index (/Project)
Waiting for: Java indexing... 18 files to index (/opt/jdk8u212-b03/jre/lib/rt.jar)
Waiting for: Java indexing... 15 files to index (/opt/jdk8u212-b03/jre/lib/rt.jar)
Waiting for: Java indexing... 18 files to index (/opt/jdk8u212-b03/jre/lib/rt.jar)
Waiting for: Java indexing... 18 files to index (/opt/jdk8u212-b03/jre/lib/rt.jar)
Waiting for: Java indexing... 18 files to index (/opt/jdk8u212-b03/jre/lib/rt.jar)
Waiting for: Java indexing... 15 files to index (/opt/jdk8u212-b03/jre/lib/rt.jar)
Waiting for: Java indexing... 11 files to index (/opt/jdk8u212-b03/jre/lib/ext/nashorn.jar)
Waiting for: Java indexing... 17 files to index (/opt/jdk8u212-b03/jre/lib/rt.jar)
Waiting for: Java indexing... 18 files to index (/opt/jdk8u212-b03/jre/lib/rt.jar)
Waiting for: Java indexing... 21 files to index (/Project)
Waiting for: Java indexing... 17 files to index (/opt/jdk8u212-b03/jre/lib/rt.jar)
Waiting for: Java indexing... 18 files to index (/opt/jdk8u212-b03/jre/lib/rt.jar)
Waiting for: Java indexing... 19 files to index (/opt/jdk8u212-b03/jre/lib/rt.jar)
Waiting for: Updating index names
Waiting for: Java indexing... 17 files to index (/opt/jdk8u212-b03/jre/lib/resources.jar)
Waiting for: Updating index names
Waiting for: Java indexing... 19 files to index (/opt/jdk8u212-b03/jre/lib/rt.jar)
Waiting for: Java indexing... 16 files to index (/Project)
Waiting for: Java indexing... 18 files to index (/opt/jdk8u212-b03/jre/lib/rt.jar)
Waiting for: Java indexing... 15 files to index (/opt/jdk8u212-b03/jre/lib/ext/sunjce_provider.jar)
Waiting for: Java indexing... 18 files to index (/opt/jdk8u212-b03/jre/lib/rt.jar)
Waiting for: Java indexing... 21 files to index (/Project)
Waiting for: Java indexing... 18 files to index (/opt/jdk8u212-b03/jre/lib/rt.jar)
Waiting for: Java indexing... 9 files to index (/opt/jdk8u212-b03/jre/lib/ext/cldrdata.jar)
Waiting for: Java indexing... 18 files to index (/opt/jdk8u212-b03/jre/lib/rt.jar)
Waiting for: Java indexing... 7 files to index (/opt/jdk8u212-b03/jre/lib/ext/dnsns.jar)
Waiting for: Java indexing... 21 files to index (/Project)
Waiting for: Java indexing... 21 files to index (/Project)
Waiting for: Java indexing... 16 files to index (/opt/jdk8u212-b03/jre/lib/resources.jar)
Waiting for: Java indexing... 20 files to index (/opt/jdk8u212-b03/jre/lib/rt.jar)
Waiting for: Updating index names
Waiting for: Java indexing... 15 files to index (/opt/jdk8u212-b03/jre/lib/rt.jar)
Waiting for: Updating index names
Waiting for: Java indexing... 30 files to index (/Project)
Waiting for: Updating index names
Waiting for: Java indexing... 16 files to index (/opt/jdk8u212-b03/jre/lib/rt.jar)
Waiting for: Updating index names
Waiting for: Java indexing... 19 files to index (/opt/jdk8u212-b03/jre/lib/rt.jar)
Waiting for: Java indexing... 15 files to index (/opt/jdk8u212-b03/jre/lib/rt.jar)
Waiting for: Updating index names
Waiting for: Java indexing... 16 files to index (/opt/jdk8u212-b03/jre/lib/rt.jar)
Waiting for: Java indexing... 19 files to index (/opt/jdk8u212-b03/jre/lib/resources.jar)
Waiting for: Updating index names
Waiting for: Java indexing... 17 files to index (/opt/jdk8u212-b03/jre/lib/rt.jar)
Waiting for: Java indexing... 18 files to index (/opt/jdk8u212-b03/jre/lib/resources.jar)
Waiting for: Java indexing... 18 files to index (/opt/jdk8u212-b03/jre/lib/rt.jar)
Waiting for: Java indexing...
Waiting for: Updating index names
Waiting for: Java indexing... 18 files to index (/opt/jdk8u212-b03/jre/lib/rt.jar)
Waiting for: Java indexing... 16 files to index (/opt/jdk8u212-b03/jre/lib/rt.jar)
Waiting for: Java indexing... 19 files to index (/opt/jdk8u212-b03/jre/lib/rt.jar)
Waiting for: Updating index names
Waiting for: Java indexing... 16 files to index (/opt/jdk8u212-b03/jre/lib/rt.jar)
Waiting for: Java indexing... 15 files to index (/opt/jdk8u212-b03/jre/lib/rt.jar)
Waiting for: Updating index names
Waiting for: Java indexing... 16 files to index (/opt/jdk8u212-b03/jre/lib/rt.jar)
Waiting for: Updating index names
Waiting for: Java indexing... 17 files to index (/opt/jdk8u212-b03/jre/lib/rt.jar)
Waiting for: Updating index names
Waiting for: Java indexing... 16 files to index (/opt/jdk8u212-b03/jre/lib/rt.jar)
Waiting for: Updating index names
Waiting for: Java indexing... 18 files to index (/opt/jdk8u212-b03/jre/lib/rt.jar)
Waiting for: Java indexing... 21 files to index (/Project)
Waiting for: Java indexing... 21 files to index (/Project)
Waiting for: Java indexing... 21 files to index (/Project)
Waiting for: Flushing content description cache.
Waiting for: Java indexing... 21 files to index (/Project)