Build: #374 failed

Job: Default Job failed

Stages & jobs

  1. Default Stage

Build log

The build generated 46,382 lines of output.The output is too long and has been truncated to the last 1,000 lines. Download or view full build log

02-Oct-2019 17:08:42 testMap8(org.eclipse.jdt.core.groovy.tests.search.GenericInferencingTests)  Time elapsed: 0.16 s
02-Oct-2019 17:08:42 testMap9(org.eclipse.jdt.core.groovy.tests.search.GenericInferencingTests)  Time elapsed: 0.674 s
02-Oct-2019 17:08:42 testSet1(org.eclipse.jdt.core.groovy.tests.search.GenericInferencingTests)  Time elapsed: 0.163 s
02-Oct-2019 17:08:42 testSet2(org.eclipse.jdt.core.groovy.tests.search.GenericInferencingTests)  Time elapsed: 0.102 s
02-Oct-2019 17:08:42 testSet3(org.eclipse.jdt.core.groovy.tests.search.GenericInferencingTests)  Time elapsed: 0.139 s
02-Oct-2019 17:08:42 testSet4(org.eclipse.jdt.core.groovy.tests.search.GenericInferencingTests)  Time elapsed: 0.176 s
02-Oct-2019 17:08:42 testSet5(org.eclipse.jdt.core.groovy.tests.search.GenericInferencingTests)  Time elapsed: 0.518 s
02-Oct-2019 17:08:42 testSet6(org.eclipse.jdt.core.groovy.tests.search.GenericInferencingTests)  Time elapsed: 0.61 s
02-Oct-2019 17:08:42 testSet7(org.eclipse.jdt.core.groovy.tests.search.GenericInferencingTests)  Time elapsed: 0.179 s
02-Oct-2019 17:08:42 testSet8(org.eclipse.jdt.core.groovy.tests.search.GenericInferencingTests)  Time elapsed: 0.196 s
02-Oct-2019 17:08:42 testStaticMethod1(org.eclipse.jdt.core.groovy.tests.search.GenericInferencingTests)  Time elapsed: 0.186 s
02-Oct-2019 17:08:42 testStaticMethod2(org.eclipse.jdt.core.groovy.tests.search.GenericInferencingTests)  Time elapsed: 0.547 s
02-Oct-2019 17:08:42 testStaticMethod3(org.eclipse.jdt.core.groovy.tests.search.GenericInferencingTests)  Time elapsed: 0.18 s
02-Oct-2019 17:08:42 testStaticMethod4(org.eclipse.jdt.core.groovy.tests.search.GenericInferencingTests)  Time elapsed: 0.184 s
02-Oct-2019 17:08:42 testStaticMethod5(org.eclipse.jdt.core.groovy.tests.search.GenericInferencingTests)  Time elapsed: 0.175 s
02-Oct-2019 17:08:42 testStaticMethod6(org.eclipse.jdt.core.groovy.tests.search.GenericInferencingTests)  Time elapsed: 0.558 s
02-Oct-2019 17:08:42 testStaticMethod7(org.eclipse.jdt.core.groovy.tests.search.GenericInferencingTests)  Time elapsed: 1.114 s
02-Oct-2019 17:08:42 testStaticMethod8(org.eclipse.jdt.core.groovy.tests.search.GenericInferencingTests) skipped
02-Oct-2019 17:08:42 testStaticMethod9(org.eclipse.jdt.core.groovy.tests.search.GenericInferencingTests)  Time elapsed: 0.159 s
02-Oct-2019 17:08:42 testArrayDGM(org.eclipse.jdt.core.groovy.tests.search.GenericInferencingTests)  Time elapsed: 0.198 s
02-Oct-2019 17:08:42 testListOfMap1(org.eclipse.jdt.core.groovy.tests.search.GenericInferencingTests)  Time elapsed: 0.154 s
02-Oct-2019 17:08:42 testListOfMap3(org.eclipse.jdt.core.groovy.tests.search.GenericInferencingTests)  Time elapsed: 0.614 s
02-Oct-2019 17:08:42 testStaticMethodOverloads10(org.eclipse.jdt.core.groovy.tests.search.GenericInferencingTests)  Time elapsed: 0.181 s
02-Oct-2019 17:08:42 testStaticMethodOverloads11(org.eclipse.jdt.core.groovy.tests.search.GenericInferencingTests)  Time elapsed: 0.198 s
02-Oct-2019 17:08:42 testStaticMethodOverloads1(org.eclipse.jdt.core.groovy.tests.search.GenericInferencingTests)  Time elapsed: 0.186 s
02-Oct-2019 17:08:42 testStaticMethodOverloads2(org.eclipse.jdt.core.groovy.tests.search.GenericInferencingTests)  Time elapsed: 0.546 s
02-Oct-2019 17:08:42 testStaticMethodOverloads3(org.eclipse.jdt.core.groovy.tests.search.GenericInferencingTests)  Time elapsed: 0.167 s
02-Oct-2019 17:08:42 testStaticMethodOverloads4(org.eclipse.jdt.core.groovy.tests.search.GenericInferencingTests)  Time elapsed: 0.225 s
02-Oct-2019 17:08:42 testStaticMethodOverloads5(org.eclipse.jdt.core.groovy.tests.search.GenericInferencingTests)  Time elapsed: 0.147 s
02-Oct-2019 17:08:42 testStaticMethodOverloads6(org.eclipse.jdt.core.groovy.tests.search.GenericInferencingTests)  Time elapsed: 0.574 s
02-Oct-2019 17:08:42 testStaticMethodOverloads7(org.eclipse.jdt.core.groovy.tests.search.GenericInferencingTests)  Time elapsed: 0.176 s
02-Oct-2019 17:08:42 testStaticMethodOverloads8(org.eclipse.jdt.core.groovy.tests.search.GenericInferencingTests)  Time elapsed: 0.16 s
02-Oct-2019 17:08:42 testStaticMethodOverloads9(org.eclipse.jdt.core.groovy.tests.search.GenericInferencingTests)  Time elapsed: 0.169 s
02-Oct-2019 17:08:42 testNestedGenerics1(org.eclipse.jdt.core.groovy.tests.search.GenericInferencingTests)  Time elapsed: 0.611 s
02-Oct-2019 17:08:42 testNestedGenerics2(org.eclipse.jdt.core.groovy.tests.search.GenericInferencingTests)  Time elapsed: 0.164 s
02-Oct-2019 17:08:42 testNestedGenerics3(org.eclipse.jdt.core.groovy.tests.search.GenericInferencingTests)  Time elapsed: 0.186 s
02-Oct-2019 17:08:42 testNestedGenerics4(org.eclipse.jdt.core.groovy.tests.search.GenericInferencingTests)  Time elapsed: 0.164 s
02-Oct-2019 17:08:42 testNestedGenerics5(org.eclipse.jdt.core.groovy.tests.search.GenericInferencingTests)  Time elapsed: 0.609 s
02-Oct-2019 17:08:42 testNestedGenerics6(org.eclipse.jdt.core.groovy.tests.search.GenericInferencingTests)  Time elapsed: 0.185 s
02-Oct-2019 17:08:42 testNestedGenerics7(org.eclipse.jdt.core.groovy.tests.search.GenericInferencingTests)  Time elapsed: 0.171 s
02-Oct-2019 17:08:42 testNestedGenerics8(org.eclipse.jdt.core.groovy.tests.search.GenericInferencingTests)  Time elapsed: 0.172 s
02-Oct-2019 17:08:42 testStaticMethod10(org.eclipse.jdt.core.groovy.tests.search.GenericInferencingTests)  Time elapsed: 0.61 s
02-Oct-2019 17:08:42 testStaticMethod11(org.eclipse.jdt.core.groovy.tests.search.GenericInferencingTests)  Time elapsed: 0.203 s
02-Oct-2019 17:08:42 testMethod1(org.eclipse.jdt.core.groovy.tests.search.GenericInferencingTests)  Time elapsed: 0.182 s
02-Oct-2019 17:08:42 testMethod2(org.eclipse.jdt.core.groovy.tests.search.GenericInferencingTests)  Time elapsed: 0.225 s
02-Oct-2019 17:08:42 testMethod3(org.eclipse.jdt.core.groovy.tests.search.GenericInferencingTests)  Time elapsed: 0.469 s
02-Oct-2019 17:08:42 testMethod4(org.eclipse.jdt.core.groovy.tests.search.GenericInferencingTests)  Time elapsed: 0.632 s
02-Oct-2019 17:08:42 testGetClass1(org.eclipse.jdt.core.groovy.tests.search.GenericInferencingTests)  Time elapsed: 0.086 s
02-Oct-2019 17:08:42 testGetClass2(org.eclipse.jdt.core.groovy.tests.search.GenericInferencingTests)  Time elapsed: 0.168 s
02-Oct-2019 17:08:42 testGetClass3(org.eclipse.jdt.core.groovy.tests.search.GenericInferencingTests)  Time elapsed: 0.15 s
02-Oct-2019 17:08:42 testCircularReference(org.eclipse.jdt.core.groovy.tests.search.GenericInferencingTests)  Time elapsed: 0.637 s
02-Oct-2019 17:08:42 testForLoop1(org.eclipse.jdt.core.groovy.tests.search.GenericInferencingTests)  Time elapsed: 0.154 s
02-Oct-2019 17:08:42 testForLoop2(org.eclipse.jdt.core.groovy.tests.search.GenericInferencingTests)  Time elapsed: 0.159 s
02-Oct-2019 17:08:42 testForLoop3(org.eclipse.jdt.core.groovy.tests.search.GenericInferencingTests)  Time elapsed: 0.168 s
02-Oct-2019 17:08:42 testForLoop4(org.eclipse.jdt.core.groovy.tests.search.GenericInferencingTests)  Time elapsed: 0.619 s
02-Oct-2019 17:08:42 testForLoop5(org.eclipse.jdt.core.groovy.tests.search.GenericInferencingTests)  Time elapsed: 0.199 s
02-Oct-2019 17:08:42 testForLoop6(org.eclipse.jdt.core.groovy.tests.search.GenericInferencingTests)  Time elapsed: 0.168 s
02-Oct-2019 17:08:42 testForLoop7(org.eclipse.jdt.core.groovy.tests.search.GenericInferencingTests)  Time elapsed: 0.16 s
02-Oct-2019 17:08:42 testForLoop8(org.eclipse.jdt.core.groovy.tests.search.GenericInferencingTests)  Time elapsed: 0.577 s
02-Oct-2019 17:08:42 testForLoop9(org.eclipse.jdt.core.groovy.tests.search.GenericInferencingTests)  Time elapsed: 0.179 s
02-Oct-2019 17:08:42 testMapOfMaps(org.eclipse.jdt.core.groovy.tests.search.GenericInferencingTests)  Time elapsed: 0.156 s
02-Oct-2019 17:08:42 testList10(org.eclipse.jdt.core.groovy.tests.search.GenericInferencingTests)  Time elapsed: 0.214 s
02-Oct-2019 17:08:42 testList11(org.eclipse.jdt.core.groovy.tests.search.GenericInferencingTests)  Time elapsed: 0.576 s
02-Oct-2019 17:08:42 testList12(org.eclipse.jdt.core.groovy.tests.search.GenericInferencingTests)  Time elapsed: 0.163 s
02-Oct-2019 17:08:42 testList13(org.eclipse.jdt.core.groovy.tests.search.GenericInferencingTests)  Time elapsed: 0.176 s
02-Oct-2019 17:08:42 testForLoop11(org.eclipse.jdt.core.groovy.tests.search.GenericInferencingTests)  Time elapsed: 0.179 s
02-Oct-2019 17:08:42 testForLoop2a(org.eclipse.jdt.core.groovy.tests.search.GenericInferencingTests)  Time elapsed: 0.586 s
02-Oct-2019 17:08:42 testRange1(org.eclipse.jdt.core.groovy.tests.search.GenericInferencingTests)  Time elapsed: 0.19 s
02-Oct-2019 17:08:42 testRange2(org.eclipse.jdt.core.groovy.tests.search.GenericInferencingTests)  Time elapsed: 0.168 s
02-Oct-2019 17:08:42 testClosure1(org.eclipse.jdt.core.groovy.tests.search.GenericInferencingTests)  Time elapsed: 0.202 s
02-Oct-2019 17:08:42 testClosure2(org.eclipse.jdt.core.groovy.tests.search.GenericInferencingTests)  Time elapsed: 0.565 s
02-Oct-2019 17:08:42 testClosure3(org.eclipse.jdt.core.groovy.tests.search.GenericInferencingTests)  Time elapsed: 0.581 s
02-Oct-2019 17:08:42 testClosure4(org.eclipse.jdt.core.groovy.tests.search.GenericInferencingTests)  Time elapsed: 0.165 s
02-Oct-2019 17:08:42 testMapOfList1(org.eclipse.jdt.core.groovy.tests.search.GenericInferencingTests)  Time elapsed: 0.203 s
02-Oct-2019 17:08:42 testMapOfList2(org.eclipse.jdt.core.groovy.tests.search.GenericInferencingTests)  Time elapsed: 0.192 s
02-Oct-2019 17:08:42 testMapOfList3(org.eclipse.jdt.core.groovy.tests.search.GenericInferencingTests)  Time elapsed: 0.546 s
02-Oct-2019 17:08:42 testMapOfList4(org.eclipse.jdt.core.groovy.tests.search.GenericInferencingTests)  Time elapsed: 0.591 s
02-Oct-2019 17:08:42 testMapOfList5(org.eclipse.jdt.core.groovy.tests.search.GenericInferencingTests)  Time elapsed: 0.183 s
02-Oct-2019 17:08:42 testMapOfList6(org.eclipse.jdt.core.groovy.tests.search.GenericInferencingTests)  Time elapsed: 0.173 s
02-Oct-2019 17:08:42 testMapOfList7(org.eclipse.jdt.core.groovy.tests.search.GenericInferencingTests)  Time elapsed: 0.204 s
02-Oct-2019 17:08:42 testGenericsMapper(org.eclipse.jdt.core.groovy.tests.search.GenericsMappingTests)  Time elapsed: 0.072 s
02-Oct-2019 17:08:42 testCompileStatic10(org.eclipse.jdt.core.groovy.tests.search.Groovy20InferencingTests)  Time elapsed: 0.491 s
02-Oct-2019 17:08:42 testCompileStatic11(org.eclipse.jdt.core.groovy.tests.search.Groovy20InferencingTests)  Time elapsed: 0.63 s
02-Oct-2019 17:08:42 testCompileStatic12(org.eclipse.jdt.core.groovy.tests.search.Groovy20InferencingTests)  Time elapsed: 0.213 s
02-Oct-2019 17:08:42 testCompileStatic13(org.eclipse.jdt.core.groovy.tests.search.Groovy20InferencingTests)  Time elapsed: 0.27 s
02-Oct-2019 17:08:42 testCompileStatic14(org.eclipse.jdt.core.groovy.tests.search.Groovy20InferencingTests)  Time elapsed: 0.659 s
02-Oct-2019 17:08:42 testCompileStatic15(org.eclipse.jdt.core.groovy.tests.search.Groovy20InferencingTests)  Time elapsed: 0.191 s
02-Oct-2019 17:08:42 testCompileStatic16(org.eclipse.jdt.core.groovy.tests.search.Groovy20InferencingTests)  Time elapsed: 0.244 s
02-Oct-2019 17:08:42 testCompileStatic1(org.eclipse.jdt.core.groovy.tests.search.Groovy20InferencingTests)  Time elapsed: 0.63 s
02-Oct-2019 17:08:42 testCompileStatic2(org.eclipse.jdt.core.groovy.tests.search.Groovy20InferencingTests)  Time elapsed: 0.22 s
02-Oct-2019 17:08:42 testCompileStatic3(org.eclipse.jdt.core.groovy.tests.search.Groovy20InferencingTests)  Time elapsed: 0.162 s
02-Oct-2019 17:08:42 testCompileStatic4(org.eclipse.jdt.core.groovy.tests.search.Groovy20InferencingTests)  Time elapsed: 0.159 s
02-Oct-2019 17:08:42 testCompileStatic5(org.eclipse.jdt.core.groovy.tests.search.Groovy20InferencingTests)  Time elapsed: 0.573 s
02-Oct-2019 17:08:42 testCompileStatic6(org.eclipse.jdt.core.groovy.tests.search.Groovy20InferencingTests)  Time elapsed: 0.164 s
02-Oct-2019 17:08:42 testCompileStatic7(org.eclipse.jdt.core.groovy.tests.search.Groovy20InferencingTests)  Time elapsed: 0.181 s
02-Oct-2019 17:08:42 testCompileStatic8(org.eclipse.jdt.core.groovy.tests.search.Groovy20InferencingTests)  Time elapsed: 0.193 s
02-Oct-2019 17:08:42 testCompileStatic9(org.eclipse.jdt.core.groovy.tests.search.Groovy20InferencingTests)  Time elapsed: 0.572 s
02-Oct-2019 17:08:42 testTypeChecked1(org.eclipse.jdt.core.groovy.tests.search.Groovy20InferencingTests)  Time elapsed: 0.158 s
02-Oct-2019 17:08:42 testTypeChecked2(org.eclipse.jdt.core.groovy.tests.search.Groovy20InferencingTests)  Time elapsed: 0.158 s
02-Oct-2019 17:08:42 testTypeChecked3(org.eclipse.jdt.core.groovy.tests.search.Groovy20InferencingTests)  Time elapsed: 0.17 s
02-Oct-2019 17:08:42 testTypeChecked4(org.eclipse.jdt.core.groovy.tests.search.Groovy20InferencingTests)  Time elapsed: 0.618 s
02-Oct-2019 17:08:42 testTypeChecked5(org.eclipse.jdt.core.groovy.tests.search.Groovy20InferencingTests)  Time elapsed: 0.195 s
02-Oct-2019 17:08:42 testTypeChecked6(org.eclipse.jdt.core.groovy.tests.search.Groovy20InferencingTests)  Time elapsed: 0.153 s
02-Oct-2019 17:08:42 testTypeChecked7(org.eclipse.jdt.core.groovy.tests.search.Groovy20InferencingTests)  Time elapsed: 0.183 s
02-Oct-2019 17:08:42 testTypeChecked8(org.eclipse.jdt.core.groovy.tests.search.Groovy20InferencingTests)  Time elapsed: 0.615 s
02-Oct-2019 17:08:42 testDelegatesToResolveStrategy2(org.eclipse.jdt.core.groovy.tests.search.Groovy21InferencingTests)  Time elapsed: 0.163 s
02-Oct-2019 17:08:42 testDelegatesToResolveStrategy3(org.eclipse.jdt.core.groovy.tests.search.Groovy21InferencingTests)  Time elapsed: 0.225 s
02-Oct-2019 17:08:42 testDelegatesToResolveStrategy4(org.eclipse.jdt.core.groovy.tests.search.Groovy21InferencingTests)  Time elapsed: 0.664 s
02-Oct-2019 17:08:42 testDelegatesToTarget2a(org.eclipse.jdt.core.groovy.tests.search.Groovy21InferencingTests)  Time elapsed: 0.242 s
02-Oct-2019 17:08:42 testTypeCheckingExtension(org.eclipse.jdt.core.groovy.tests.search.Groovy21InferencingTests)  Time elapsed: 0.976 s
02-Oct-2019 17:08:42 testDelegatesToTarget1(org.eclipse.jdt.core.groovy.tests.search.Groovy21InferencingTests)  Time elapsed: 0.236 s
02-Oct-2019 17:08:42 testDelegatesToTarget2(org.eclipse.jdt.core.groovy.tests.search.Groovy21InferencingTests)  Time elapsed: 0.221 s
02-Oct-2019 17:08:42 testDelegatesToTarget3(org.eclipse.jdt.core.groovy.tests.search.Groovy21InferencingTests)  Time elapsed: 0.246 s
02-Oct-2019 17:08:42 testDelegatesToTarget4(org.eclipse.jdt.core.groovy.tests.search.Groovy21InferencingTests)  Time elapsed: 0.284 s
02-Oct-2019 17:08:42 testDelegatesToTarget5(org.eclipse.jdt.core.groovy.tests.search.Groovy21InferencingTests)  Time elapsed: 0.72 s
02-Oct-2019 17:08:42 testDelegatesToTarget6(org.eclipse.jdt.core.groovy.tests.search.Groovy21InferencingTests)  Time elapsed: 0.265 s
02-Oct-2019 17:08:42 testDelegatesToValue2(org.eclipse.jdt.core.groovy.tests.search.Groovy21InferencingTests)  Time elapsed: 0.184 s
02-Oct-2019 17:08:42 testDelegatesToValue3(org.eclipse.jdt.core.groovy.tests.search.Groovy21InferencingTests)  Time elapsed: 0.667 s
02-Oct-2019 17:08:42 testDelegatesToValue4(org.eclipse.jdt.core.groovy.tests.search.Groovy21InferencingTests)  Time elapsed: 0.179 s
02-Oct-2019 17:08:42 testDelegatesToValue5(org.eclipse.jdt.core.groovy.tests.search.Groovy21InferencingTests)  Time elapsed: 0.215 s
02-Oct-2019 17:08:42 testDelegatesToValue6(org.eclipse.jdt.core.groovy.tests.search.Groovy21InferencingTests)  Time elapsed: 0.158 s
02-Oct-2019 17:08:42 testDelegatesToTypeName1(org.eclipse.jdt.core.groovy.tests.search.Groovy21InferencingTests)  Time elapsed: 0.565 s
02-Oct-2019 17:08:42 testDelegatesToTypeName2(org.eclipse.jdt.core.groovy.tests.search.Groovy21InferencingTests)  Time elapsed: 0.588 s
02-Oct-2019 17:08:42 testDelegatesToValue(org.eclipse.jdt.core.groovy.tests.search.Groovy21InferencingTests)  Time elapsed: 0.207 s
02-Oct-2019 17:08:42 testEnumOverrides(org.eclipse.jdt.core.groovy.tests.search.Groovy21InferencingTests)  Time elapsed: 0.206 s
02-Oct-2019 17:08:42 testEnumOverrides2(org.eclipse.jdt.core.groovy.tests.search.Groovy21InferencingTests)  Time elapsed: 0.207 s
02-Oct-2019 17:08:42 org.eclipse.jdt.core.groovy.tests.search.Groovy25InferencingTests skipped
02-Oct-2019 17:08:42 testFieldAndPropertyWithSameName(org.eclipse.jdt.core.groovy.tests.search.InferencingTests)  Time elapsed: 0.504 s
02-Oct-2019 17:08:42 testObjectMethodOnInterface(org.eclipse.jdt.core.groovy.tests.search.InferencingTests)  Time elapsed: 0.619 s
02-Oct-2019 17:08:42 testLocalWithInitializer1(org.eclipse.jdt.core.groovy.tests.search.InferencingTests)  Time elapsed: 0.199 s
02-Oct-2019 17:08:42 testLocalWithInitializer2(org.eclipse.jdt.core.groovy.tests.search.InferencingTests)  Time elapsed: 0.161 s
02-Oct-2019 17:08:42 testLocalWithInitializer3(org.eclipse.jdt.core.groovy.tests.search.InferencingTests)  Time elapsed: 0.175 s
02-Oct-2019 17:08:42 testLocalWithInitializer4(org.eclipse.jdt.core.groovy.tests.search.InferencingTests)  Time elapsed: 0.577 s
02-Oct-2019 17:08:42 testLocalWithInitializer5(org.eclipse.jdt.core.groovy.tests.search.InferencingTests)  Time elapsed: 0.168 s
02-Oct-2019 17:08:42 testNothingIsUnknown(org.eclipse.jdt.core.groovy.tests.search.InferencingTests)  Time elapsed: 0.173 s
02-Oct-2019 17:08:42 testInnerClass1(org.eclipse.jdt.core.groovy.tests.search.InferencingTests)  Time elapsed: 0.17 s
02-Oct-2019 17:08:42 testInnerClass2(org.eclipse.jdt.core.groovy.tests.search.InferencingTests)  Time elapsed: 0.589 s
02-Oct-2019 17:08:42 testInnerClass3(org.eclipse.jdt.core.groovy.tests.search.InferencingTests)  Time elapsed: 0.164 s
02-Oct-2019 17:08:42 testInnerClass4(org.eclipse.jdt.core.groovy.tests.search.InferencingTests)  Time elapsed: 0.184 s
02-Oct-2019 17:08:42 testInnerClass5(org.eclipse.jdt.core.groovy.tests.search.InferencingTests)  Time elapsed: 0.062 s
02-Oct-2019 17:08:42 testInnerClass6(org.eclipse.jdt.core.groovy.tests.search.InferencingTests)  Time elapsed: 0.096 s
02-Oct-2019 17:08:42 testInnerClass7(org.eclipse.jdt.core.groovy.tests.search.InferencingTests)  Time elapsed: 0.723 s
02-Oct-2019 17:08:42 testInnerClass8(org.eclipse.jdt.core.groovy.tests.search.InferencingTests)  Time elapsed: 0.242 s
02-Oct-2019 17:08:42 testInnerClass9(org.eclipse.jdt.core.groovy.tests.search.InferencingTests)  Time elapsed: 0.685 s
02-Oct-2019 17:08:42 testMethodOverloadsArgumentMatching1(org.eclipse.jdt.core.groovy.tests.search.InferencingTests)  Time elapsed: 0.16 s
02-Oct-2019 17:08:42 testMethodOverloadsArgumentMatching2(org.eclipse.jdt.core.groovy.tests.search.InferencingTests)  Time elapsed: 0.174 s
02-Oct-2019 17:08:42 testMethodOverloadsArgumentMatching3(org.eclipse.jdt.core.groovy.tests.search.InferencingTests)  Time elapsed: 0.155 s
02-Oct-2019 17:08:42 testMethodOverloadsArgumentMatching4(org.eclipse.jdt.core.groovy.tests.search.InferencingTests)  Time elapsed: 0.61 s
02-Oct-2019 17:08:42 testMethodOverloadsArgumentMatching5(org.eclipse.jdt.core.groovy.tests.search.InferencingTests)  Time elapsed: 0.17 s
02-Oct-2019 17:08:42 testMethodOverloadsArgumentMatching6(org.eclipse.jdt.core.groovy.tests.search.InferencingTests)  Time elapsed: 0.158 s
02-Oct-2019 17:08:42 testMethodOverloadsArgumentMatching7(org.eclipse.jdt.core.groovy.tests.search.InferencingTests)  Time elapsed: 0.193 s
02-Oct-2019 17:08:42 testBoolean1(org.eclipse.jdt.core.groovy.tests.search.InferencingTests)  Time elapsed: 0.579 s
02-Oct-2019 17:08:42 testBoolean2(org.eclipse.jdt.core.groovy.tests.search.InferencingTests)  Time elapsed: 0.153 s
02-Oct-2019 17:08:42 testBoolean3(org.eclipse.jdt.core.groovy.tests.search.InferencingTests)  Time elapsed: 0.169 s
02-Oct-2019 17:08:42 testBoolean4(org.eclipse.jdt.core.groovy.tests.search.InferencingTests)  Time elapsed: 0.183 s
02-Oct-2019 17:08:42 testBoolean5(org.eclipse.jdt.core.groovy.tests.search.InferencingTests)  Time elapsed: 0.599 s
02-Oct-2019 17:08:42 testBoolean6(org.eclipse.jdt.core.groovy.tests.search.InferencingTests)  Time elapsed: 0.184 s
02-Oct-2019 17:08:42 testBoolean7(org.eclipse.jdt.core.groovy.tests.search.InferencingTests)  Time elapsed: 0.173 s
02-Oct-2019 17:08:42 testDeclarationAtBeginningOfMethod(org.eclipse.jdt.core.groovy.tests.search.InferencingTests)  Time elapsed: 0.159 s
02-Oct-2019 17:08:42 testLocalTypeAndDefaultImportCollision(org.eclipse.jdt.core.groovy.tests.search.InferencingTests)  Time elapsed: 0.643 s
02-Oct-2019 17:08:42 testTernaryInitializer(org.eclipse.jdt.core.groovy.tests.search.InferencingTests)  Time elapsed: 0.211 s
02-Oct-2019 17:08:42 testSuperFieldReference3a(org.eclipse.jdt.core.groovy.tests.search.InferencingTests)  Time elapsed: 0.159 s
02-Oct-2019 17:08:42 testSuperFieldReference3b(org.eclipse.jdt.core.groovy.tests.search.InferencingTests)  Time elapsed: 0.155 s
02-Oct-2019 17:08:42 testSuperFieldReference3c(org.eclipse.jdt.core.groovy.tests.search.InferencingTests)  Time elapsed: 0.546 s
02-Oct-2019 17:08:42 testSuperFieldReference5a(org.eclipse.jdt.core.groovy.tests.search.InferencingTests)  Time elapsed: 0.602 s
02-Oct-2019 17:08:42 testSuperFieldReference5b(org.eclipse.jdt.core.groovy.tests.search.InferencingTests)  Time elapsed: 0.162 s
02-Oct-2019 17:08:42 testSpecialConstructor1(org.eclipse.jdt.core.groovy.tests.search.InferencingTests)  Time elapsed: 0.127 s
02-Oct-2019 17:08:42 testSpecialConstructor2(org.eclipse.jdt.core.groovy.tests.search.InferencingTests)  Time elapsed: 0.105 s
02-Oct-2019 17:08:42 testInnerClass10(org.eclipse.jdt.core.groovy.tests.search.InferencingTests)  Time elapsed: 0.654 s
02-Oct-2019 17:08:42 testInnerClass11(org.eclipse.jdt.core.groovy.tests.search.InferencingTests)  Time elapsed: 0.193 s
02-Oct-2019 17:08:42 testMultiDecl10(org.eclipse.jdt.core.groovy.tests.search.InferencingTests)  Time elapsed: 0.189 s
02-Oct-2019 17:08:42 testMultiDecl11(org.eclipse.jdt.core.groovy.tests.search.InferencingTests)  Time elapsed: 0.693 s
02-Oct-2019 17:08:42 testMultiDecl12(org.eclipse.jdt.core.groovy.tests.search.InferencingTests)  Time elapsed: 0.207 s
02-Oct-2019 17:08:42 testMultiDecl13(org.eclipse.jdt.core.groovy.tests.search.InferencingTests)  Time elapsed: 0.179 s
02-Oct-2019 17:08:42 testAsExpression1(org.eclipse.jdt.core.groovy.tests.search.InferencingTests)  Time elapsed: 0.174 s
02-Oct-2019 17:08:42 testAsExpression2(org.eclipse.jdt.core.groovy.tests.search.InferencingTests)  Time elapsed: 0.545 s
02-Oct-2019 17:08:42 testSuperClassMethod1(org.eclipse.jdt.core.groovy.tests.search.InferencingTests)  Time elapsed: 0.617 s
02-Oct-2019 17:08:42 testSuperClassMethod2(org.eclipse.jdt.core.groovy.tests.search.InferencingTests)  Time elapsed: 0.173 s
02-Oct-2019 17:08:42 testSuperClassMethod3(org.eclipse.jdt.core.groovy.tests.search.InferencingTests)  Time elapsed: 0.179 s
02-Oct-2019 17:08:42 testSuperClassMethod4(org.eclipse.jdt.core.groovy.tests.search.InferencingTests)  Time elapsed: 0.165 s
02-Oct-2019 17:08:42 testSuperClassMethod5(org.eclipse.jdt.core.groovy.tests.search.InferencingTests)  Time elapsed: 0.619 s
02-Oct-2019 17:08:42 testElvisInitializer(org.eclipse.jdt.core.groovy.tests.search.InferencingTests)  Time elapsed: 0.15 s
02-Oct-2019 17:08:42 testRangeExpression1(org.eclipse.jdt.core.groovy.tests.search.InferencingTests)  Time elapsed: 0.203 s
02-Oct-2019 17:08:42 testRangeExpression2(org.eclipse.jdt.core.groovy.tests.search.InferencingTests)  Time elapsed: 0.158 s
02-Oct-2019 17:08:42 testRangeExpression3(org.eclipse.jdt.core.groovy.tests.search.InferencingTests)  Time elapsed: 0.564 s
02-Oct-2019 17:08:42 testRangeExpression4(org.eclipse.jdt.core.groovy.tests.search.InferencingTests)  Time elapsed: 0.164 s
02-Oct-2019 17:08:42 testRangeExpression5(org.eclipse.jdt.core.groovy.tests.search.InferencingTests)  Time elapsed: 0.161 s
02-Oct-2019 17:08:42 testRangeExpression6(org.eclipse.jdt.core.groovy.tests.search.InferencingTests)  Time elapsed: 0.089 s
02-Oct-2019 17:08:42 testSpread10(org.eclipse.jdt.core.groovy.tests.search.InferencingTests)  Time elapsed: 0.189 s
02-Oct-2019 17:08:42 testSpread11(org.eclipse.jdt.core.groovy.tests.search.InferencingTests)  Time elapsed: 0.512 s
02-Oct-2019 17:08:42 testSpread12(org.eclipse.jdt.core.groovy.tests.search.InferencingTests)  Time elapsed: 0.622 s
02-Oct-2019 17:08:42 testSpread13(org.eclipse.jdt.core.groovy.tests.search.InferencingTests)  Time elapsed: 0.198 s
02-Oct-2019 17:08:42 testSpread14(org.eclipse.jdt.core.groovy.tests.search.InferencingTests)  Time elapsed: 0.148 s
02-Oct-2019 17:08:42 testSpread15(org.eclipse.jdt.core.groovy.tests.search.InferencingTests)  Time elapsed: 0.182 s
02-Oct-2019 17:08:42 testSpread16(org.eclipse.jdt.core.groovy.tests.search.InferencingTests)  Time elapsed: 0.595 s
02-Oct-2019 17:08:42 testSpread17(org.eclipse.jdt.core.groovy.tests.search.InferencingTests)  Time elapsed: 0.175 s
02-Oct-2019 17:08:42 testStaticThisAndSuper1(org.eclipse.jdt.core.groovy.tests.search.InferencingTests)  Time elapsed: 0.189 s
02-Oct-2019 17:08:42 testStaticThisAndSuper2(org.eclipse.jdt.core.groovy.tests.search.InferencingTests)  Time elapsed: 0.677 s
02-Oct-2019 17:08:42 testMethodOverloadsArgumentMatching4a(org.eclipse.jdt.core.groovy.tests.search.InferencingTests)  Time elapsed: 0.176 s
02-Oct-2019 17:08:42 testMethodOverloadsArgumentMatching4b(org.eclipse.jdt.core.groovy.tests.search.InferencingTests)  Time elapsed: 0.557 s
02-Oct-2019 17:08:42 testMethodOverloadsArgumentMatching5a(org.eclipse.jdt.core.groovy.tests.search.InferencingTests)  Time elapsed: 0.602 s
02-Oct-2019 17:08:42 testMethodOverloadsArgumentMatching5b(org.eclipse.jdt.core.groovy.tests.search.InferencingTests)  Time elapsed: 0.15 s
02-Oct-2019 17:08:42 testMethodOverloadsArgumentMatching6a(org.eclipse.jdt.core.groovy.tests.search.InferencingTests)  Time elapsed: 0.166 s
02-Oct-2019 17:08:42 testMethodOverloadsArgumentMatching6b(org.eclipse.jdt.core.groovy.tests.search.InferencingTests)  Time elapsed: 0.187 s
02-Oct-2019 17:08:42 testConstructor1(org.eclipse.jdt.core.groovy.tests.search.InferencingTests)  Time elapsed: 0.749 s
02-Oct-2019 17:08:42 testConstructor2(org.eclipse.jdt.core.groovy.tests.search.InferencingTests)  Time elapsed: 0.296 s
02-Oct-2019 17:08:42 testConstructor3(org.eclipse.jdt.core.groovy.tests.search.InferencingTests)  Time elapsed: 0.617 s
02-Oct-2019 17:08:42 testConstructor4(org.eclipse.jdt.core.groovy.tests.search.InferencingTests)  Time elapsed: 0.296 s
02-Oct-2019 17:08:42 testConstructor5(org.eclipse.jdt.core.groovy.tests.search.InferencingTests)  Time elapsed: 0.787 s
02-Oct-2019 17:08:42 testConstructor6(org.eclipse.jdt.core.groovy.tests.search.InferencingTests)  Time elapsed: 0.28 s
02-Oct-2019 17:08:42 testInterfaceMethodsAsProperty(org.eclipse.jdt.core.groovy.tests.search.InferencingTests)  Time elapsed: 0.197 s
02-Oct-2019 17:08:42 testStaticMethod1(org.eclipse.jdt.core.groovy.tests.search.InferencingTests)  Time elapsed: 0.597 s
02-Oct-2019 17:08:42 testStaticMethod2(org.eclipse.jdt.core.groovy.tests.search.InferencingTests)  Time elapsed: 0.175 s
02-Oct-2019 17:08:42 testStaticMethod3(org.eclipse.jdt.core.groovy.tests.search.InferencingTests)  Time elapsed: 0.14 s
02-Oct-2019 17:08:42 testStaticMethod4(org.eclipse.jdt.core.groovy.tests.search.InferencingTests)  Time elapsed: 0.164 s
02-Oct-2019 17:08:42 testStaticMethod5(org.eclipse.jdt.core.groovy.tests.search.InferencingTests)  Time elapsed: 0.568 s
02-Oct-2019 17:08:42 testStaticMethod6(org.eclipse.jdt.core.groovy.tests.search.InferencingTests)  Time elapsed: 0.116 s
02-Oct-2019 17:08:42 testStaticMethod7(org.eclipse.jdt.core.groovy.tests.search.InferencingTests)  Time elapsed: 0.175 s
02-Oct-2019 17:08:42 testStaticMethod8(org.eclipse.jdt.core.groovy.tests.search.InferencingTests)  Time elapsed: 0.175 s
02-Oct-2019 17:08:42 testStaticMethod9(org.eclipse.jdt.core.groovy.tests.search.InferencingTests)  Time elapsed: 0.673 s
02-Oct-2019 17:08:42 testClassWithInitializer1(org.eclipse.jdt.core.groovy.tests.search.InferencingTests)  Time elapsed: 0.196 s
02-Oct-2019 17:08:42 testClassWithInitializer2(org.eclipse.jdt.core.groovy.tests.search.InferencingTests)  Time elapsed: 0.18 s
02-Oct-2019 17:08:42 testClassWithInitializer3(org.eclipse.jdt.core.groovy.tests.search.InferencingTests)  Time elapsed: 0.181 s
02-Oct-2019 17:08:42 testPostfix(org.eclipse.jdt.core.groovy.tests.search.InferencingTests)  Time elapsed: 0.561 s
02-Oct-2019 17:08:42 testSuperClassMethod4a(org.eclipse.jdt.core.groovy.tests.search.InferencingTests)  Time elapsed: 0.18 s
02-Oct-2019 17:08:42 testSuperClassMethod4b(org.eclipse.jdt.core.groovy.tests.search.InferencingTests)  Time elapsed: 0.187 s
02-Oct-2019 17:08:42 testSuperClassMethod4c(org.eclipse.jdt.core.groovy.tests.search.InferencingTests)  Time elapsed: 0.166 s
02-Oct-2019 17:08:42 testSuperClassMethod5a(org.eclipse.jdt.core.groovy.tests.search.InferencingTests)  Time elapsed: 0.662 s
02-Oct-2019 17:08:42 testSuperClassMethod5b(org.eclipse.jdt.core.groovy.tests.search.InferencingTests)  Time elapsed: 0.194 s
02-Oct-2019 17:08:42 testListSort1(org.eclipse.jdt.core.groovy.tests.search.InferencingTests)  Time elapsed: 0.217 s
02-Oct-2019 17:08:42 testListSort2(org.eclipse.jdt.core.groovy.tests.search.InferencingTests)  Time elapsed: 0.682 s
02-Oct-2019 17:08:42 testListSort3(org.eclipse.jdt.core.groovy.tests.search.InferencingTests)  Time elapsed: 0.213 s
02-Oct-2019 17:08:42 testLocalVar1(org.eclipse.jdt.core.groovy.tests.search.InferencingTests)  Time elapsed: 0.139 s
02-Oct-2019 17:08:42 testLocalVar2(org.eclipse.jdt.core.groovy.tests.search.InferencingTests)  Time elapsed: 0.156 s
02-Oct-2019 17:08:42 testLocalVar3(org.eclipse.jdt.core.groovy.tests.search.InferencingTests)  Time elapsed: 0.561 s
02-Oct-2019 17:08:42 testLocalVar4(org.eclipse.jdt.core.groovy.tests.search.InferencingTests)  Time elapsed: 0.189 s
02-Oct-2019 17:08:42 testLocalVar5(org.eclipse.jdt.core.groovy.tests.search.InferencingTests)  Time elapsed: 0.164 s
02-Oct-2019 17:08:42 testLocalVar6(org.eclipse.jdt.core.groovy.tests.search.InferencingTests)  Time elapsed: 0.159 s
02-Oct-2019 17:08:42 testLocalVar7(org.eclipse.jdt.core.groovy.tests.search.InferencingTests)  Time elapsed: 0.614 s
02-Oct-2019 17:08:42 testLocalVar8(org.eclipse.jdt.core.groovy.tests.search.InferencingTests)  Time elapsed: 0.154 s
02-Oct-2019 17:08:42 testLocalVar9(org.eclipse.jdt.core.groovy.tests.search.InferencingTests)  Time elapsed: 0.175 s
02-Oct-2019 17:08:42 testIndirectInterfaceMethod(org.eclipse.jdt.core.groovy.tests.search.InferencingTests)  Time elapsed: 0.722 s
02-Oct-2019 17:08:42 testMapLiteral(org.eclipse.jdt.core.groovy.tests.search.InferencingTests)  Time elapsed: 0.149 s
02-Oct-2019 17:08:42 testListRemove(org.eclipse.jdt.core.groovy.tests.search.InferencingTests)  Time elapsed: 0.16 s
02-Oct-2019 17:08:42 testCategoryMethodAsProperty(org.eclipse.jdt.core.groovy.tests.search.InferencingTests)  Time elapsed: 0.145 s
02-Oct-2019 17:08:42 testNothingIsUnknownWithCategories(org.eclipse.jdt.core.groovy.tests.search.InferencingTests)  Time elapsed: 0.219 s
02-Oct-2019 17:08:42 testImplicitVar1(org.eclipse.jdt.core.groovy.tests.search.InferencingTests)  Time elapsed: 0.423 s
02-Oct-2019 17:08:42 testImplicitVar2(org.eclipse.jdt.core.groovy.tests.search.InferencingTests)  Time elapsed: 0.194 s
02-Oct-2019 17:08:42 testImplicitVar3(org.eclipse.jdt.core.groovy.tests.search.InferencingTests)  Time elapsed: 0.512 s
02-Oct-2019 17:08:42 testImplicitVar4(org.eclipse.jdt.core.groovy.tests.search.InferencingTests)  Time elapsed: 0.617 s
02-Oct-2019 17:08:42 testImplicitVar5(org.eclipse.jdt.core.groovy.tests.search.InferencingTests)  Time elapsed: 0.164 s
02-Oct-2019 17:08:42 testImplicitVar6(org.eclipse.jdt.core.groovy.tests.search.InferencingTests)  Time elapsed: 0.157 s
02-Oct-2019 17:08:42 testImplicitVar7(org.eclipse.jdt.core.groovy.tests.search.InferencingTests)  Time elapsed: 0.075 s
02-Oct-2019 17:08:42 testClassLiteral1(org.eclipse.jdt.core.groovy.tests.search.InferencingTests)  Time elapsed: 0.214 s
02-Oct-2019 17:08:42 testClassLiteral2(org.eclipse.jdt.core.groovy.tests.search.InferencingTests)  Time elapsed: 0.507 s
02-Oct-2019 17:08:42 testClassLiteral3(org.eclipse.jdt.core.groovy.tests.search.InferencingTests)  Time elapsed: 0.641 s
02-Oct-2019 17:08:42 testClassLiteral4(org.eclipse.jdt.core.groovy.tests.search.InferencingTests)  Time elapsed: 0.169 s
02-Oct-2019 17:08:42 testClassLiteral5(org.eclipse.jdt.core.groovy.tests.search.InferencingTests)  Time elapsed: 0.189 s
02-Oct-2019 17:08:42 testInstanceOf10(org.eclipse.jdt.core.groovy.tests.search.InferencingTests)  Time elapsed: 0.814 s
02-Oct-2019 17:08:42 testInstanceOf11(org.eclipse.jdt.core.groovy.tests.search.InferencingTests)  Time elapsed: 0.366 s
02-Oct-2019 17:08:42 testInstanceOf1a(org.eclipse.jdt.core.groovy.tests.search.InferencingTests)  Time elapsed: 0.741 s
02-Oct-2019 17:08:42 testInstanceOf1b(org.eclipse.jdt.core.groovy.tests.search.InferencingTests)  Time elapsed: 0.327 s
02-Oct-2019 17:08:42 testThisInInnerClass(org.eclipse.jdt.core.groovy.tests.search.InferencingTests)  Time elapsed: 0.7 s
02-Oct-2019 17:08:42 testStaticImports1(org.eclipse.jdt.core.groovy.tests.search.InferencingTests)  Time elapsed: 0.17 s
02-Oct-2019 17:08:42 testStaticImports2(org.eclipse.jdt.core.groovy.tests.search.InferencingTests)  Time elapsed: 0.176 s
02-Oct-2019 17:08:42 testStaticImports3(org.eclipse.jdt.core.groovy.tests.search.InferencingTests)  Time elapsed: 0.162 s
02-Oct-2019 17:08:42 testStaticImports4(org.eclipse.jdt.core.groovy.tests.search.InferencingTests)  Time elapsed: 0.573 s
02-Oct-2019 17:08:42 testMultiDecl1(org.eclipse.jdt.core.groovy.tests.search.InferencingTests)  Time elapsed: 0.245 s
02-Oct-2019 17:08:42 testMultiDecl2(org.eclipse.jdt.core.groovy.tests.search.InferencingTests)  Time elapsed: 0.202 s
02-Oct-2019 17:08:42 testMultiDecl3(org.eclipse.jdt.core.groovy.tests.search.InferencingTests)  Time elapsed: 0.751 s
02-Oct-2019 17:08:42 testMultiDecl4(org.eclipse.jdt.core.groovy.tests.search.InferencingTests)  Time elapsed: 0.206 s
02-Oct-2019 17:08:42 testMultiDecl6(org.eclipse.jdt.core.groovy.tests.search.InferencingTests)  Time elapsed: 0.214 s
02-Oct-2019 17:08:42 testMultiDecl7(org.eclipse.jdt.core.groovy.tests.search.InferencingTests)  Time elapsed: 0.673 s
02-Oct-2019 17:08:42 testMultiDecl8(org.eclipse.jdt.core.groovy.tests.search.InferencingTests)  Time elapsed: 0.199 s
02-Oct-2019 17:08:42 testMultiDecl9(org.eclipse.jdt.core.groovy.tests.search.InferencingTests)  Time elapsed: 0.216 s
02-Oct-2019 17:08:42 testLocalMethod1(org.eclipse.jdt.core.groovy.tests.search.InferencingTests)  Time elapsed: 0.654 s
02-Oct-2019 17:08:42 testLocalMethod2(org.eclipse.jdt.core.groovy.tests.search.InferencingTests)  Time elapsed: 0.206 s
02-Oct-2019 17:08:42 testLocalMethod3(org.eclipse.jdt.core.groovy.tests.search.InferencingTests)  Time elapsed: 0.164 s
02-Oct-2019 17:08:42 testLocalMethod4(org.eclipse.jdt.core.groovy.tests.search.InferencingTests)  Time elapsed: 0.168 s
02-Oct-2019 17:08:42 testLocalMethod5(org.eclipse.jdt.core.groovy.tests.search.InferencingTests)  Time elapsed: 0.575 s
02-Oct-2019 17:08:42 testLocalVar10(org.eclipse.jdt.core.groovy.tests.search.InferencingTests)  Time elapsed: 0.186 s
02-Oct-2019 17:08:42 testLocalVar11(org.eclipse.jdt.core.groovy.tests.search.InferencingTests)  Time elapsed: 0.168 s
02-Oct-2019 17:08:42 testLocalVar12(org.eclipse.jdt.core.groovy.tests.search.InferencingTests)  Time elapsed: 0.192 s
02-Oct-2019 17:08:42 testLocalVar13(org.eclipse.jdt.core.groovy.tests.search.InferencingTests)  Time elapsed: 0.575 s
02-Oct-2019 17:08:42 testLocalVar14(org.eclipse.jdt.core.groovy.tests.search.InferencingTests)  Time elapsed: 0.172 s
02-Oct-2019 17:08:42 testLocalVar15(org.eclipse.jdt.core.groovy.tests.search.InferencingTests)  Time elapsed: 0.311 s
02-Oct-2019 17:08:42 testLocalVar16(org.eclipse.jdt.core.groovy.tests.search.InferencingTests)  Time elapsed: 0.716 s
02-Oct-2019 17:08:42 testLocalVar17(org.eclipse.jdt.core.groovy.tests.search.InferencingTests)  Time elapsed: 0.299 s
02-Oct-2019 17:08:42 testLocalVar18(org.eclipse.jdt.core.groovy.tests.search.InferencingTests)  Time elapsed: 0.718 s
02-Oct-2019 17:08:42 testLocalVar19(org.eclipse.jdt.core.groovy.tests.search.InferencingTests)  Time elapsed: 0.305 s
02-Oct-2019 17:08:42 testLocalVar20(org.eclipse.jdt.core.groovy.tests.search.InferencingTests)  Time elapsed: 0.761 s
02-Oct-2019 17:08:42 testLocalVar21(org.eclipse.jdt.core.groovy.tests.search.InferencingTests)  Time elapsed: 0.279 s
02-Oct-2019 17:08:42 testLocalVar22(org.eclipse.jdt.core.groovy.tests.search.InferencingTests)  Time elapsed: 0.817 s
02-Oct-2019 17:08:42 testLocalVar23(org.eclipse.jdt.core.groovy.tests.search.InferencingTests)  Time elapsed: 0.354 s
02-Oct-2019 17:08:42 testLocalVar24(org.eclipse.jdt.core.groovy.tests.search.InferencingTests)  Time elapsed: 0.792 s
02-Oct-2019 17:08:42 testLocalVar25(org.eclipse.jdt.core.groovy.tests.search.InferencingTests)  Time elapsed: 0.373 s
02-Oct-2019 17:08:42 testLocalVar26(org.eclipse.jdt.core.groovy.tests.search.InferencingTests)  Time elapsed: 0.598 s
02-Oct-2019 17:08:42 testLocalVar27(org.eclipse.jdt.core.groovy.tests.search.InferencingTests)  Time elapsed: 0.181 s
02-Oct-2019 17:08:42 testLocalVar28(org.eclipse.jdt.core.groovy.tests.search.InferencingTests)  Time elapsed: 0.192 s
02-Oct-2019 17:08:42 testNoGString(org.eclipse.jdt.core.groovy.tests.search.InferencingTests)  Time elapsed: 0.183 s
02-Oct-2019 17:08:42 testObjectMethodOnInterfaceAsProperty(org.eclipse.jdt.core.groovy.tests.search.InferencingTests)  Time elapsed: 0.62 s
02-Oct-2019 17:08:42 testMatcher1(org.eclipse.jdt.core.groovy.tests.search.InferencingTests)  Time elapsed: 0.539 s
02-Oct-2019 17:08:42 testMatcher2(org.eclipse.jdt.core.groovy.tests.search.InferencingTests)  Time elapsed: 0.632 s
02-Oct-2019 17:08:42 testCatchBlock1(org.eclipse.jdt.core.groovy.tests.search.InferencingTests)  Time elapsed: 0.162 s
02-Oct-2019 17:08:42 testCatchBlock2(org.eclipse.jdt.core.groovy.tests.search.InferencingTests)  Time elapsed: 0.2 s
02-Oct-2019 17:08:42 testCatchBlock3(org.eclipse.jdt.core.groovy.tests.search.InferencingTests)  Time elapsed: 0.171 s
02-Oct-2019 17:08:42 testCatchBlock4(org.eclipse.jdt.core.groovy.tests.search.InferencingTests)  Time elapsed: 0.579 s
02-Oct-2019 17:08:42 testCatchBlock5(org.eclipse.jdt.core.groovy.tests.search.InferencingTests)  Time elapsed: 0.184 s
02-Oct-2019 17:08:42 testInterfaceMethodAsProperty2(org.eclipse.jdt.core.groovy.tests.search.InferencingTests)  Time elapsed: 1.989 s
02-Oct-2019 17:08:42 testInterfaceMethodAsProperty3(org.eclipse.jdt.core.groovy.tests.search.InferencingTests)  Time elapsed: 0.21 s
02-Oct-2019 17:08:42 testGetAt1(org.eclipse.jdt.core.groovy.tests.search.InferencingTests)  Time elapsed: 0.192 s
02-Oct-2019 17:08:42 testGetAt2(org.eclipse.jdt.core.groovy.tests.search.InferencingTests)  Time elapsed: 0.247 s
02-Oct-2019 17:08:42 testGetAt3(org.eclipse.jdt.core.groovy.tests.search.InferencingTests)  Time elapsed: 0.473 s
02-Oct-2019 17:08:42 testGetAt4(org.eclipse.jdt.core.groovy.tests.search.InferencingTests)  Time elapsed: 0.659 s
02-Oct-2019 17:08:42 testGetAt5(org.eclipse.jdt.core.groovy.tests.search.InferencingTests)  Time elapsed: 0.211 s
02-Oct-2019 17:08:42 testGetAt6(org.eclipse.jdt.core.groovy.tests.search.InferencingTests)  Time elapsed: 0.219 s
02-Oct-2019 17:08:42 testGetAt7(org.eclipse.jdt.core.groovy.tests.search.InferencingTests)  Time elapsed: 0.614 s
02-Oct-2019 17:08:42 testGetAt8(org.eclipse.jdt.core.groovy.tests.search.InferencingTests) skipped
02-Oct-2019 17:08:42 testGetAt9(org.eclipse.jdt.core.groovy.tests.search.InferencingTests) skipped
02-Oct-2019 17:08:42 testFieldWithInitializer1(org.eclipse.jdt.core.groovy.tests.search.InferencingTests)  Time elapsed: 0.567 s
02-Oct-2019 17:08:42 testFieldWithInitializer2(org.eclipse.jdt.core.groovy.tests.search.InferencingTests)  Time elapsed: 0.208 s
02-Oct-2019 17:08:42 testNested1(org.eclipse.jdt.core.groovy.tests.search.InferencingTests)  Time elapsed: 0.167 s
02-Oct-2019 17:08:42 testNested2(org.eclipse.jdt.core.groovy.tests.search.InferencingTests)  Time elapsed: 0.17 s
02-Oct-2019 17:08:42 testNested3(org.eclipse.jdt.core.groovy.tests.search.InferencingTests)  Time elapsed: 0.568 s
02-Oct-2019 17:08:42 testNested4(org.eclipse.jdt.core.groovy.tests.search.InferencingTests)  Time elapsed: 0.196 s
02-Oct-2019 17:08:42 testIndirectInterfaceConstant(org.eclipse.jdt.core.groovy.tests.search.InferencingTests)  Time elapsed: 0.249 s
02-Oct-2019 17:08:42 testInstanceOf1(org.eclipse.jdt.core.groovy.tests.search.InferencingTests)  Time elapsed: 0.779 s
02-Oct-2019 17:08:42 testInstanceOf2(org.eclipse.jdt.core.groovy.tests.search.InferencingTests)  Time elapsed: 0.271 s
02-Oct-2019 17:08:42 testInstanceOf3(org.eclipse.jdt.core.groovy.tests.search.InferencingTests)  Time elapsed: 0.77 s
02-Oct-2019 17:08:42 testInstanceOf4(org.eclipse.jdt.core.groovy.tests.search.InferencingTests)  Time elapsed: 0.417 s
02-Oct-2019 17:08:42 testInstanceOf5(org.eclipse.jdt.core.groovy.tests.search.InferencingTests)  Time elapsed: 0.773 s
02-Oct-2019 17:08:42 testInstanceOf6(org.eclipse.jdt.core.groovy.tests.search.InferencingTests)  Time elapsed: 0.349 s
02-Oct-2019 17:08:42 testInstanceOf7(org.eclipse.jdt.core.groovy.tests.search.InferencingTests)  Time elapsed: 0.743 s
02-Oct-2019 17:08:42 testInstanceOf8(org.eclipse.jdt.core.groovy.tests.search.InferencingTests)  Time elapsed: 0.318 s
02-Oct-2019 17:08:42 testInstanceOf9(org.eclipse.jdt.core.groovy.tests.search.InferencingTests)  Time elapsed: 0.786 s
02-Oct-2019 17:08:42 testAnonInner1(org.eclipse.jdt.core.groovy.tests.search.InferencingTests)  Time elapsed: 0.165 s
02-Oct-2019 17:08:42 testAnonInner2(org.eclipse.jdt.core.groovy.tests.search.InferencingTests)  Time elapsed: 0.167 s
02-Oct-2019 17:08:42 testAnonInner3(org.eclipse.jdt.core.groovy.tests.search.InferencingTests)  Time elapsed: 0.636 s
02-Oct-2019 17:08:42 testAnonInner4(org.eclipse.jdt.core.groovy.tests.search.InferencingTests)  Time elapsed: 0.174 s
02-Oct-2019 17:08:42 testAnonInner5(org.eclipse.jdt.core.groovy.tests.search.InferencingTests)  Time elapsed: 0.175 s
02-Oct-2019 17:08:42 testAnonInner6(org.eclipse.jdt.core.groovy.tests.search.InferencingTests)  Time elapsed: 0.19 s
02-Oct-2019 17:08:42 testAnonInner7(org.eclipse.jdt.core.groovy.tests.search.InferencingTests)  Time elapsed: 0.603 s
02-Oct-2019 17:08:42 testAnonInner8(org.eclipse.jdt.core.groovy.tests.search.InferencingTests)  Time elapsed: 0.292 s
02-Oct-2019 17:08:42 testNumber1(org.eclipse.jdt.core.groovy.tests.search.InferencingTests)  Time elapsed: 0.188 s
02-Oct-2019 17:08:42 testNumber2(org.eclipse.jdt.core.groovy.tests.search.InferencingTests)  Time elapsed: 0.594 s
02-Oct-2019 17:08:42 testNumber3(org.eclipse.jdt.core.groovy.tests.search.InferencingTests)  Time elapsed: 0.168 s
02-Oct-2019 17:08:42 testNumber4(org.eclipse.jdt.core.groovy.tests.search.InferencingTests)  Time elapsed: 0.171 s
02-Oct-2019 17:08:42 testNumber5(org.eclipse.jdt.core.groovy.tests.search.InferencingTests)  Time elapsed: 0.155 s
02-Oct-2019 17:08:42 testNumber6(org.eclipse.jdt.core.groovy.tests.search.InferencingTests)  Time elapsed: 0.615 s
02-Oct-2019 17:08:42 testSpread1(org.eclipse.jdt.core.groovy.tests.search.InferencingTests)  Time elapsed: 0.163 s
02-Oct-2019 17:08:42 testSpread2(org.eclipse.jdt.core.groovy.tests.search.InferencingTests)  Time elapsed: 0.197 s
02-Oct-2019 17:08:42 testSpread3(org.eclipse.jdt.core.groovy.tests.search.InferencingTests)  Time elapsed: 0.182 s
02-Oct-2019 17:08:42 testSpread4(org.eclipse.jdt.core.groovy.tests.search.InferencingTests)  Time elapsed: 0.572 s
02-Oct-2019 17:08:42 testSpread5(org.eclipse.jdt.core.groovy.tests.search.InferencingTests)  Time elapsed: 0.147 s
02-Oct-2019 17:08:42 testSpread6(org.eclipse.jdt.core.groovy.tests.search.InferencingTests)  Time elapsed: 0.183 s
02-Oct-2019 17:08:42 testSpread7(org.eclipse.jdt.core.groovy.tests.search.InferencingTests)  Time elapsed: 0.16 s
02-Oct-2019 17:08:42 testSpread8(org.eclipse.jdt.core.groovy.tests.search.InferencingTests)  Time elapsed: 0.603 s
02-Oct-2019 17:08:42 testSpread9(org.eclipse.jdt.core.groovy.tests.search.InferencingTests)  Time elapsed: 0.176 s
02-Oct-2019 17:08:42 testPattern1(org.eclipse.jdt.core.groovy.tests.search.InferencingTests)  Time elapsed: 0.158 s
02-Oct-2019 17:08:42 testPattern2(org.eclipse.jdt.core.groovy.tests.search.InferencingTests)  Time elapsed: 0.151 s
02-Oct-2019 17:08:42 testClassReference2a(org.eclipse.jdt.core.groovy.tests.search.InferencingTests)  Time elapsed: 0.683 s
02-Oct-2019 17:08:42 testClassReference3a(org.eclipse.jdt.core.groovy.tests.search.InferencingTests)  Time elapsed: 0.223 s
02-Oct-2019 17:08:42 testClassReference4a(org.eclipse.jdt.core.groovy.tests.search.InferencingTests)  Time elapsed: 0.2 s
02-Oct-2019 17:08:42 testClassReference4b(org.eclipse.jdt.core.groovy.tests.search.InferencingTests)  Time elapsed: 0.687 s
02-Oct-2019 17:08:42 testString1(org.eclipse.jdt.core.groovy.tests.search.InferencingTests)  Time elapsed: 0.188 s
02-Oct-2019 17:08:42 testString2(org.eclipse.jdt.core.groovy.tests.search.InferencingTests)  Time elapsed: 0.152 s
02-Oct-2019 17:08:42 testString3(org.eclipse.jdt.core.groovy.tests.search.InferencingTests)  Time elapsed: 0.187 s
02-Oct-2019 17:08:42 testSuperFieldReference1(org.eclipse.jdt.core.groovy.tests.search.InferencingTests)  Time elapsed: 0.541 s
02-Oct-2019 17:08:42 testSuperFieldReference2(org.eclipse.jdt.core.groovy.tests.search.InferencingTests)  Time elapsed: 0.614 s
02-Oct-2019 17:08:42 testSuperFieldReference3(org.eclipse.jdt.core.groovy.tests.search.InferencingTests)  Time elapsed: 0.182 s
02-Oct-2019 17:08:42 testSuperFieldReference4(org.eclipse.jdt.core.groovy.tests.search.InferencingTests)  Time elapsed: 0.195 s
02-Oct-2019 17:08:42 testSuperFieldReference5(org.eclipse.jdt.core.groovy.tests.search.InferencingTests)  Time elapsed: 0.187 s
02-Oct-2019 17:08:42 testClassReference1(org.eclipse.jdt.core.groovy.tests.search.InferencingTests)  Time elapsed: 0.554 s
02-Oct-2019 17:08:42 testClassReference2(org.eclipse.jdt.core.groovy.tests.search.InferencingTests)  Time elapsed: 0.622 s
02-Oct-2019 17:08:42 testClassReference3(org.eclipse.jdt.core.groovy.tests.search.InferencingTests)  Time elapsed: 0.22 s
02-Oct-2019 17:08:42 testClassReference4(org.eclipse.jdt.core.groovy.tests.search.InferencingTests)  Time elapsed: 0.182 s
02-Oct-2019 17:08:42 testPropertyNodeFromJava1(org.eclipse.jdt.core.groovy.tests.search.JDTPropertyNodeInferencingTests)  Time elapsed: 0.69 s
02-Oct-2019 17:08:42 testPropertyNodeFromJava2(org.eclipse.jdt.core.groovy.tests.search.JDTPropertyNodeInferencingTests)  Time elapsed: 0.199 s
02-Oct-2019 17:08:42 testPropertyNodeFromJava3(org.eclipse.jdt.core.groovy.tests.search.JDTPropertyNodeInferencingTests)  Time elapsed: 0.098 s
02-Oct-2019 17:08:42 testPropertyNodeFromJava4(org.eclipse.jdt.core.groovy.tests.search.JDTPropertyNodeInferencingTests)  Time elapsed: 0.189 s
02-Oct-2019 17:08:42 testNodeFromJava1(org.eclipse.jdt.core.groovy.tests.search.JDTPropertyNodeInferencingTests)  Time elapsed: 0.639 s
02-Oct-2019 17:08:42 testPropertyNodeReferenceInBinary1(org.eclipse.jdt.core.groovy.tests.search.JDTPropertyNodeInferencingTests)  Time elapsed: 0.175 s
02-Oct-2019 17:08:42 testVarReferenceInGString1(org.eclipse.jdt.core.groovy.tests.search.LocalVariableReferenceSearchTests)  Time elapsed: 0.2 s
02-Oct-2019 17:08:42 testVarReferenceInGString2(org.eclipse.jdt.core.groovy.tests.search.LocalVariableReferenceSearchTests)  Time elapsed: 0.204 s
02-Oct-2019 17:08:42 testVarReferenceInGString3(org.eclipse.jdt.core.groovy.tests.search.LocalVariableReferenceSearchTests)  Time elapsed: 0.18 s
02-Oct-2019 17:08:42 testVarReferenceInGString4(org.eclipse.jdt.core.groovy.tests.search.LocalVariableReferenceSearchTests)  Time elapsed: 0.177 s
02-Oct-2019 17:08:42 testVarReferenceInGString5(org.eclipse.jdt.core.groovy.tests.search.LocalVariableReferenceSearchTests)  Time elapsed: 0.191 s
02-Oct-2019 17:08:42 testVarReference10(org.eclipse.jdt.core.groovy.tests.search.LocalVariableReferenceSearchTests)  Time elapsed: 0.161 s
02-Oct-2019 17:08:42 testVarReference1(org.eclipse.jdt.core.groovy.tests.search.LocalVariableReferenceSearchTests)  Time elapsed: 0.175 s
02-Oct-2019 17:08:42 testVarReference2(org.eclipse.jdt.core.groovy.tests.search.LocalVariableReferenceSearchTests)  Time elapsed: 0.18 s
02-Oct-2019 17:08:42 testVarReference3(org.eclipse.jdt.core.groovy.tests.search.LocalVariableReferenceSearchTests)  Time elapsed: 0.175 s
02-Oct-2019 17:08:42 testVarReference4(org.eclipse.jdt.core.groovy.tests.search.LocalVariableReferenceSearchTests)  Time elapsed: 0.171 s
02-Oct-2019 17:08:42 testVarReference5(org.eclipse.jdt.core.groovy.tests.search.LocalVariableReferenceSearchTests)  Time elapsed: 0.174 s
02-Oct-2019 17:08:42 testVarReference6(org.eclipse.jdt.core.groovy.tests.search.LocalVariableReferenceSearchTests)  Time elapsed: 0.166 s
02-Oct-2019 17:08:42 testVarReference7(org.eclipse.jdt.core.groovy.tests.search.LocalVariableReferenceSearchTests)  Time elapsed: 0.173 s
02-Oct-2019 17:08:42 testVarReference8(org.eclipse.jdt.core.groovy.tests.search.LocalVariableReferenceSearchTests)  Time elapsed: 0.158 s
02-Oct-2019 17:08:42 testVarReference9(org.eclipse.jdt.core.groovy.tests.search.LocalVariableReferenceSearchTests)  Time elapsed: 1.011 s
02-Oct-2019 17:08:42 testExplicitPropertySetterSearch1(org.eclipse.jdt.core.groovy.tests.search.MethodReferenceSearchTests)  Time elapsed: 0.739 s
02-Oct-2019 17:08:42 testExplicitPropertySetterSearch2(org.eclipse.jdt.core.groovy.tests.search.MethodReferenceSearchTests)  Time elapsed: 0.561 s  <<< FAILURE!
02-Oct-2019 17:08:42 java.lang.AssertionError: expected:<5> but was:<0>
02-Oct-2019 17:08:42         at org.eclipse.jdt.core.groovy.tests.search.MethodReferenceSearchTests.testExplicitPropertySetterSearch2(MethodReferenceSearchTests.java:594)
02-Oct-2019 17:08:42
02-Oct-2019 17:08:42 testOverloadedMethodReferences1(org.eclipse.jdt.core.groovy.tests.search.MethodReferenceSearchTests)  Time elapsed: 0.218 s
02-Oct-2019 17:08:42 testOverloadedMethodReferences2(org.eclipse.jdt.core.groovy.tests.search.MethodReferenceSearchTests)  Time elapsed: 0.242 s
02-Oct-2019 17:08:42 testOverloadedMethodReferences3(org.eclipse.jdt.core.groovy.tests.search.MethodReferenceSearchTests)  Time elapsed: 0.229 s
02-Oct-2019 17:08:42 testOverloadedMethodReferences4(org.eclipse.jdt.core.groovy.tests.search.MethodReferenceSearchTests)  Time elapsed: 0.239 s
02-Oct-2019 17:08:42 testOverloadedMethodReferences5(org.eclipse.jdt.core.groovy.tests.search.MethodReferenceSearchTests)  Time elapsed: 0.197 s
02-Oct-2019 17:08:42 testOverloadedMethodReferences6(org.eclipse.jdt.core.groovy.tests.search.MethodReferenceSearchTests)  Time elapsed: 0.347 s
02-Oct-2019 17:08:42 testStaticMethodReferenceSearch(org.eclipse.jdt.core.groovy.tests.search.MethodReferenceSearchTests)  Time elapsed: 0.128 s
02-Oct-2019 17:08:42 testMethodReferencesInClass1(org.eclipse.jdt.core.groovy.tests.search.MethodReferenceSearchTests)  Time elapsed: 0.24 s
02-Oct-2019 17:08:42 testMethodReferencesInClass2(org.eclipse.jdt.core.groovy.tests.search.MethodReferenceSearchTests)  Time elapsed: 0.218 s
02-Oct-2019 17:08:42 testMethodReferencesInClass3(org.eclipse.jdt.core.groovy.tests.search.MethodReferenceSearchTests)  Time elapsed: 0.253 s
02-Oct-2019 17:08:42 testGenericsMethodReferenceSearch(org.eclipse.jdt.core.groovy.tests.search.MethodReferenceSearchTests)  Time elapsed: 0.33 s
02-Oct-2019 17:08:42 testMethodReferencesInScript1(org.eclipse.jdt.core.groovy.tests.search.MethodReferenceSearchTests)  Time elapsed: 0.25 s
02-Oct-2019 17:08:42 testMethodReferencesInScript2(org.eclipse.jdt.core.groovy.tests.search.MethodReferenceSearchTests)  Time elapsed: 0.192 s
02-Oct-2019 17:08:42 testMethodReferencesInScript3(org.eclipse.jdt.core.groovy.tests.search.MethodReferenceSearchTests)  Time elapsed: 0.246 s
02-Oct-2019 17:08:42 testMethodReferencesInScript4(org.eclipse.jdt.core.groovy.tests.search.MethodReferenceSearchTests)  Time elapsed: 0.239 s
02-Oct-2019 17:08:42 testMethodReferencesInScript5(org.eclipse.jdt.core.groovy.tests.search.MethodReferenceSearchTests)  Time elapsed: 0.213 s
02-Oct-2019 17:08:42 testMethodReferencesInScript6(org.eclipse.jdt.core.groovy.tests.search.MethodReferenceSearchTests)  Time elapsed: 0.257 s
02-Oct-2019 17:08:42 testMethodReferencesInScript7(org.eclipse.jdt.core.groovy.tests.search.MethodReferenceSearchTests)  Time elapsed: 0.244 s
02-Oct-2019 17:08:42 testMethodReferencesInScript8(org.eclipse.jdt.core.groovy.tests.search.MethodReferenceSearchTests)  Time elapsed: 0.235 s
02-Oct-2019 17:08:42 testMethodReferencesInScript9(org.eclipse.jdt.core.groovy.tests.search.MethodReferenceSearchTests)  Time elapsed: 0.194 s
02-Oct-2019 17:08:42 testMethodWithDefaultParameters1(org.eclipse.jdt.core.groovy.tests.search.MethodReferenceSearchTests)  Time elapsed: 0.208 s
02-Oct-2019 17:08:42 testMethodWithDefaultParameters2(org.eclipse.jdt.core.groovy.tests.search.MethodReferenceSearchTests)  Time elapsed: 0.215 s
02-Oct-2019 17:08:42 testMethodWithDefaultParameters3(org.eclipse.jdt.core.groovy.tests.search.MethodReferenceSearchTests)  Time elapsed: 0.152 s  <<< FAILURE!
02-Oct-2019 17:08:42 java.lang.AssertionError: expected:<2> but was:<0>
02-Oct-2019 17:08:42         at org.eclipse.jdt.core.groovy.tests.search.MethodReferenceSearchTests.testMethodWithDefaultParameters3(MethodReferenceSearchTests.java:369)
02-Oct-2019 17:08:42
02-Oct-2019 17:08:42 testMethodWithDefaultParameters4(org.eclipse.jdt.core.groovy.tests.search.MethodReferenceSearchTests) skipped
02-Oct-2019 17:08:42 testExplicitPropertyGetterSearch1(org.eclipse.jdt.core.groovy.tests.search.MethodReferenceSearchTests)  Time elapsed: 1.95 s
02-Oct-2019 17:08:42 testExplicitPropertyGetterSearch2(org.eclipse.jdt.core.groovy.tests.search.MethodReferenceSearchTests)  Time elapsed: 0.716 s
02-Oct-2019 17:08:42 testRightShift(org.eclipse.jdt.core.groovy.tests.search.OperatorOverloadingInferencingTests)  Time elapsed: 0.397 s
02-Oct-2019 17:08:42 testLeftShift(org.eclipse.jdt.core.groovy.tests.search.OperatorOverloadingInferencingTests)  Time elapsed: 0.185 s
02-Oct-2019 17:08:42 testAnd(org.eclipse.jdt.core.groovy.tests.search.OperatorOverloadingInferencingTests)  Time elapsed: 0.532 s
02-Oct-2019 17:08:42 testMod(org.eclipse.jdt.core.groovy.tests.search.OperatorOverloadingInferencingTests)  Time elapsed: 0.619 s
02-Oct-2019 17:08:42 testXor(org.eclipse.jdt.core.groovy.tests.search.OperatorOverloadingInferencingTests)  Time elapsed: 0.188 s
02-Oct-2019 17:08:42 testPlus1(org.eclipse.jdt.core.groovy.tests.search.OperatorOverloadingInferencingTests)  Time elapsed: 0.181 s
02-Oct-2019 17:08:42 testPlus2(org.eclipse.jdt.core.groovy.tests.search.OperatorOverloadingInferencingTests)  Time elapsed: 0.191 s
02-Oct-2019 17:08:42 testPlus3(org.eclipse.jdt.core.groovy.tests.search.OperatorOverloadingInferencingTests)  Time elapsed: 0.571 s
02-Oct-2019 17:08:42 testOr(org.eclipse.jdt.core.groovy.tests.search.OperatorOverloadingInferencingTests)  Time elapsed: 0.58 s
02-Oct-2019 17:08:42 testPrefix1(org.eclipse.jdt.core.groovy.tests.search.OperatorOverloadingInferencingTests)  Time elapsed: 0.219 s
02-Oct-2019 17:08:42 testPrefix2(org.eclipse.jdt.core.groovy.tests.search.OperatorOverloadingInferencingTests)  Time elapsed: 0.179 s
02-Oct-2019 17:08:42 testPrefix3(org.eclipse.jdt.core.groovy.tests.search.OperatorOverloadingInferencingTests)  Time elapsed: 0.722 s
02-Oct-2019 17:08:42 testPrefix4(org.eclipse.jdt.core.groovy.tests.search.OperatorOverloadingInferencingTests)  Time elapsed: 0.18 s
02-Oct-2019 17:08:42 testPrefix5(org.eclipse.jdt.core.groovy.tests.search.OperatorOverloadingInferencingTests)  Time elapsed: 0.169 s
02-Oct-2019 17:08:42 testPrefix6(org.eclipse.jdt.core.groovy.tests.search.OperatorOverloadingInferencingTests)  Time elapsed: 0.19 s
02-Oct-2019 17:08:42 testLongExpr1(org.eclipse.jdt.core.groovy.tests.search.OperatorOverloadingInferencingTests)  Time elapsed: 0.58 s
02-Oct-2019 17:08:42 testLongExpr2(org.eclipse.jdt.core.groovy.tests.search.OperatorOverloadingInferencingTests)  Time elapsed: 0.216 s
02-Oct-2019 17:08:42 testLongExpr3(org.eclipse.jdt.core.groovy.tests.search.OperatorOverloadingInferencingTests)  Time elapsed: 0.194 s
02-Oct-2019 17:08:42 testAttributeExpr1(org.eclipse.jdt.core.groovy.tests.search.OperatorOverloadingInferencingTests)  Time elapsed: 0.165 s
02-Oct-2019 17:08:42 testAttributeExpr2(org.eclipse.jdt.core.groovy.tests.search.OperatorOverloadingInferencingTests)  Time elapsed: 0.539 s
02-Oct-2019 17:08:42 testDivide(org.eclipse.jdt.core.groovy.tests.search.OperatorOverloadingInferencingTests)  Time elapsed: 0.612 s
02-Oct-2019 17:08:42 testMultiply(org.eclipse.jdt.core.groovy.tests.search.OperatorOverloadingInferencingTests)  Time elapsed: 0.173 s
02-Oct-2019 17:08:42 testGetAt1(org.eclipse.jdt.core.groovy.tests.search.OperatorOverloadingInferencingTests)  Time elapsed: 1.106 s
02-Oct-2019 17:08:42 testGetAt2(org.eclipse.jdt.core.groovy.tests.search.OperatorOverloadingInferencingTests)  Time elapsed: 0.498 s
02-Oct-2019 17:08:42 testGetAt3(org.eclipse.jdt.core.groovy.tests.search.OperatorOverloadingInferencingTests)  Time elapsed: 0.605 s
02-Oct-2019 17:08:42 testGetAt4(org.eclipse.jdt.core.groovy.tests.search.OperatorOverloadingInferencingTests)  Time elapsed: 0.179 s
02-Oct-2019 17:08:42 testGetAt5(org.eclipse.jdt.core.groovy.tests.search.OperatorOverloadingInferencingTests)  Time elapsed: 0.178 s
02-Oct-2019 17:08:42 testGetAt6(org.eclipse.jdt.core.groovy.tests.search.OperatorOverloadingInferencingTests)  Time elapsed: 0.191 s
02-Oct-2019 17:08:42 testGetAt7(org.eclipse.jdt.core.groovy.tests.search.OperatorOverloadingInferencingTests)  Time elapsed: 0.572 s
02-Oct-2019 17:08:42 testGetAt8(org.eclipse.jdt.core.groovy.tests.search.OperatorOverloadingInferencingTests)  Time elapsed: 0.617 s
02-Oct-2019 17:08:42 testGetAt9(org.eclipse.jdt.core.groovy.tests.search.OperatorOverloadingInferencingTests)  Time elapsed: 0.173 s
02-Oct-2019 17:08:42 testPostfix1(org.eclipse.jdt.core.groovy.tests.search.OperatorOverloadingInferencingTests)  Time elapsed: 0.186 s
02-Oct-2019 17:08:42 testPostfix2(org.eclipse.jdt.core.groovy.tests.search.OperatorOverloadingInferencingTests)  Time elapsed: 0.178 s
02-Oct-2019 17:08:42 testMinus1(org.eclipse.jdt.core.groovy.tests.search.OperatorOverloadingInferencingTests)  Time elapsed: 0.626 s
02-Oct-2019 17:08:42 testMinus2(org.eclipse.jdt.core.groovy.tests.search.OperatorOverloadingInferencingTests)  Time elapsed: 0.19 s
02-Oct-2019 17:08:42 testNumberPlusString1(org.eclipse.jdt.core.groovy.tests.search.OperatorOverloadingInferencingTests)  Time elapsed: 0.169 s
02-Oct-2019 17:08:42 testNumberPlusString2(org.eclipse.jdt.core.groovy.tests.search.OperatorOverloadingInferencingTests)  Time elapsed: 0.184 s
02-Oct-2019 17:08:42 testCompleteExpr1(org.eclipse.jdt.core.groovy.tests.search.OperatorOverloadingInferencingTests)  Time elapsed: 0.585 s
02-Oct-2019 17:08:42 testCompleteExpr2(org.eclipse.jdt.core.groovy.tests.search.OperatorOverloadingInferencingTests)  Time elapsed: 0.18 s
02-Oct-2019 17:08:42 testCompleteExpr3(org.eclipse.jdt.core.groovy.tests.search.OperatorOverloadingInferencingTests)  Time elapsed: 0.951 s
02-Oct-2019 17:08:42 testCompleteExpr4(org.eclipse.jdt.core.groovy.tests.search.OperatorOverloadingInferencingTests)  Time elapsed: 0.487 s
02-Oct-2019 17:08:42 testCompleteExpr5(org.eclipse.jdt.core.groovy.tests.search.OperatorOverloadingInferencingTests)  Time elapsed: 0.638 s
02-Oct-2019 17:08:42 testCompleteExpr6(org.eclipse.jdt.core.groovy.tests.search.OperatorOverloadingInferencingTests)  Time elapsed: 0.172 s
02-Oct-2019 17:08:42 testCompleteExpr7(org.eclipse.jdt.core.groovy.tests.search.OperatorOverloadingInferencingTests)  Time elapsed: 0.167 s
02-Oct-2019 17:08:42 testCompleteExpr8(org.eclipse.jdt.core.groovy.tests.search.OperatorOverloadingInferencingTests)  Time elapsed: 0.189 s
02-Oct-2019 17:08:42 testEqualsCheck(org.eclipse.jdt.core.groovy.tests.search.SpockInferencingTests) skipped
02-Oct-2019 17:08:42 testDataTableChecks(org.eclipse.jdt.core.groovy.tests.search.SpockInferencingTests) skipped
02-Oct-2019 17:08:42 testGetterCheck(org.eclipse.jdt.core.groovy.tests.search.SpockInferencingTests) skipped
02-Oct-2019 17:08:42 testPropertyCheck(org.eclipse.jdt.core.groovy.tests.search.SpockInferencingTests) skipped
02-Oct-2019 17:08:42 testBasics(org.eclipse.jdt.core.groovy.tests.search.SpockInferencingTests) skipped
02-Oct-2019 17:08:42 testNonStaticReference1(org.eclipse.jdt.core.groovy.tests.search.StaticInferencingTests)  Time elapsed: 0.347 s
02-Oct-2019 17:08:42 testNonStaticReference2(org.eclipse.jdt.core.groovy.tests.search.StaticInferencingTests)  Time elapsed: 0.186 s
02-Oct-2019 17:08:42 testNonStaticReference3(org.eclipse.jdt.core.groovy.tests.search.StaticInferencingTests)  Time elapsed: 0.166 s
02-Oct-2019 17:08:42 testNonStaticReference4(org.eclipse.jdt.core.groovy.tests.search.StaticInferencingTests)  Time elapsed: 1.962 s
02-Oct-2019 17:08:42 testNonStaticReference5(org.eclipse.jdt.core.groovy.tests.search.StaticInferencingTests)  Time elapsed: 0.194 s
02-Oct-2019 17:08:42 testNonStaticReference6(org.eclipse.jdt.core.groovy.tests.search.StaticInferencingTests)  Time elapsed: 0.188 s
02-Oct-2019 17:08:42 testNonStaticReference7(org.eclipse.jdt.core.groovy.tests.search.StaticInferencingTests)  Time elapsed: 0.187 s
02-Oct-2019 17:08:42 testNonStaticReference8(org.eclipse.jdt.core.groovy.tests.search.StaticInferencingTests)  Time elapsed: 0.547 s
02-Oct-2019 17:08:42 testStaticReference1(org.eclipse.jdt.core.groovy.tests.search.StaticInferencingTests)  Time elapsed: 0.602 s
02-Oct-2019 17:08:42 testStaticReference2(org.eclipse.jdt.core.groovy.tests.search.StaticInferencingTests)  Time elapsed: 1.484 s
02-Oct-2019 17:08:42 testStaticReference3(org.eclipse.jdt.core.groovy.tests.search.StaticInferencingTests)  Time elapsed: 0.202 s
02-Oct-2019 17:08:42 testStaticReference4(org.eclipse.jdt.core.groovy.tests.search.StaticInferencingTests)  Time elapsed: 0.173 s
02-Oct-2019 17:08:42 testStaticReference5(org.eclipse.jdt.core.groovy.tests.search.StaticInferencingTests)  Time elapsed: 0.647 s
02-Oct-2019 17:08:42 testStaticReference6(org.eclipse.jdt.core.groovy.tests.search.StaticInferencingTests)  Time elapsed: 0.211 s
02-Oct-2019 17:08:42 testStaticReference7(org.eclipse.jdt.core.groovy.tests.search.StaticInferencingTests)  Time elapsed: 1.144 s
02-Oct-2019 17:08:42 testStaticReference8(org.eclipse.jdt.core.groovy.tests.search.StaticInferencingTests)  Time elapsed: 0.6 s
02-Oct-2019 17:08:42 testStaticReference9(org.eclipse.jdt.core.groovy.tests.search.StaticInferencingTests)  Time elapsed: 0.207 s
02-Oct-2019 17:08:42 testStaticImport1(org.eclipse.jdt.core.groovy.tests.search.StaticInferencingTests)  Time elapsed: 0.212 s
02-Oct-2019 17:08:42 testStaticImport2(org.eclipse.jdt.core.groovy.tests.search.StaticInferencingTests)  Time elapsed: 0.188 s
02-Oct-2019 17:08:42 testStaticImport3(org.eclipse.jdt.core.groovy.tests.search.StaticInferencingTests)  Time elapsed: 0.528 s
02-Oct-2019 17:08:42 testStaticImport4(org.eclipse.jdt.core.groovy.tests.search.StaticInferencingTests)  Time elapsed: 4.42 s
02-Oct-2019 17:08:42 testStaticImport5(org.eclipse.jdt.core.groovy.tests.search.StaticInferencingTests)  Time elapsed: 0.18 s
02-Oct-2019 17:08:42 testStaticImport6(org.eclipse.jdt.core.groovy.tests.search.StaticInferencingTests)  Time elapsed: 1.861 s
02-Oct-2019 17:08:42 testStaticImport7(org.eclipse.jdt.core.groovy.tests.search.StaticInferencingTests)  Time elapsed: 0.172 s
02-Oct-2019 17:08:42 testStaticImport8(org.eclipse.jdt.core.groovy.tests.search.StaticInferencingTests)  Time elapsed: 0.189 s
02-Oct-2019 17:08:42 testStaticImport9(org.eclipse.jdt.core.groovy.tests.search.StaticInferencingTests)  Time elapsed: 0.208 s
02-Oct-2019 17:08:42 testStaticImport10(org.eclipse.jdt.core.groovy.tests.search.StaticInferencingTests)  Time elapsed: 0.523 s
02-Oct-2019 17:08:42 testStaticImport11(org.eclipse.jdt.core.groovy.tests.search.StaticInferencingTests)  Time elapsed: 1.475 s
02-Oct-2019 17:08:42 testStaticImport12(org.eclipse.jdt.core.groovy.tests.search.StaticInferencingTests)  Time elapsed: 0.194 s
02-Oct-2019 17:08:42 testStaticImport13(org.eclipse.jdt.core.groovy.tests.search.StaticInferencingTests) skipped
02-Oct-2019 17:08:42 testStaticImport14(org.eclipse.jdt.core.groovy.tests.search.StaticInferencingTests) skipped
02-Oct-2019 17:08:42 testStaticImport15(org.eclipse.jdt.core.groovy.tests.search.StaticInferencingTests) skipped
02-Oct-2019 17:08:42 testClassReference16a(org.eclipse.jdt.core.groovy.tests.search.StaticInferencingTests)  Time elapsed: 0.185 s
02-Oct-2019 17:08:42 testClassReference17a(org.eclipse.jdt.core.groovy.tests.search.StaticInferencingTests)  Time elapsed: 0.193 s
02-Oct-2019 17:08:42 testStaticReference10a(org.eclipse.jdt.core.groovy.tests.search.StaticInferencingTests)  Time elapsed: 0.54 s
02-Oct-2019 17:08:42 testClassReference10(org.eclipse.jdt.core.groovy.tests.search.StaticInferencingTests)  Time elapsed: 1.925 s
02-Oct-2019 17:08:42 testClassReference11(org.eclipse.jdt.core.groovy.tests.search.StaticInferencingTests)  Time elapsed: 0.174 s
02-Oct-2019 17:08:42 testClassReference12(org.eclipse.jdt.core.groovy.tests.search.StaticInferencingTests)  Time elapsed: 0.164 s
02-Oct-2019 17:08:42 testClassReference13(org.eclipse.jdt.core.groovy.tests.search.StaticInferencingTests)  Time elapsed: 0.195 s
02-Oct-2019 17:08:42 testClassReference14(org.eclipse.jdt.core.groovy.tests.search.StaticInferencingTests)  Time elapsed: 0.582 s
02-Oct-2019 17:08:42 testClassReference15(org.eclipse.jdt.core.groovy.tests.search.StaticInferencingTests)  Time elapsed: 1.592 s
02-Oct-2019 17:08:42 testClassReference16(org.eclipse.jdt.core.groovy.tests.search.StaticInferencingTests)  Time elapsed: 0.608 s
02-Oct-2019 17:08:42 testClassReference17(org.eclipse.jdt.core.groovy.tests.search.StaticInferencingTests)  Time elapsed: 0.196 s
02-Oct-2019 17:08:42 testClassReference4a(org.eclipse.jdt.core.groovy.tests.search.StaticInferencingTests)  Time elapsed: 0.183 s
02-Oct-2019 17:08:42 testStaticReference10(org.eclipse.jdt.core.groovy.tests.search.StaticInferencingTests)  Time elapsed: 0.182 s
02-Oct-2019 17:08:42 testStaticReference1a(org.eclipse.jdt.core.groovy.tests.search.StaticInferencingTests)  Time elapsed: 0.564 s
02-Oct-2019 17:08:42 testStaticReference1b(org.eclipse.jdt.core.groovy.tests.search.StaticInferencingTests)  Time elapsed: 1.765 s
02-Oct-2019 17:08:42 testStaticReference9a(org.eclipse.jdt.core.groovy.tests.search.StaticInferencingTests)  Time elapsed: 0.197 s
02-Oct-2019 17:08:42 testClassReference1(org.eclipse.jdt.core.groovy.tests.search.StaticInferencingTests)  Time elapsed: 0.18 s
02-Oct-2019 17:08:42 testClassReference2(org.eclipse.jdt.core.groovy.tests.search.StaticInferencingTests)  Time elapsed: 0.195 s
02-Oct-2019 17:08:42 testClassReference3(org.eclipse.jdt.core.groovy.tests.search.StaticInferencingTests)  Time elapsed: 0.55 s
02-Oct-2019 17:08:42 testClassReference4(org.eclipse.jdt.core.groovy.tests.search.StaticInferencingTests)  Time elapsed: 1.905 s
02-Oct-2019 17:08:42 testClassReference5(org.eclipse.jdt.core.groovy.tests.search.StaticInferencingTests)  Time elapsed: 0.55 s
02-Oct-2019 17:08:42 testClassReference6(org.eclipse.jdt.core.groovy.tests.search.StaticInferencingTests)  Time elapsed: 0.607 s
02-Oct-2019 17:08:42 testClassReference7(org.eclipse.jdt.core.groovy.tests.search.StaticInferencingTests)  Time elapsed: 0.207 s
02-Oct-2019 17:08:42 testClassReference8(org.eclipse.jdt.core.groovy.tests.search.StaticInferencingTests)  Time elapsed: 0.175 s
02-Oct-2019 17:08:42 testClassReference9(org.eclipse.jdt.core.groovy.tests.search.StaticInferencingTests)  Time elapsed: 2.305 s
02-Oct-2019 17:08:42 testSyntheticAccessors1(org.eclipse.jdt.core.groovy.tests.search.SyntheticAccessorInferencingTests)  Time elapsed: 0.263 s
02-Oct-2019 17:08:42 testSyntheticAccessors2(org.eclipse.jdt.core.groovy.tests.search.SyntheticAccessorInferencingTests)  Time elapsed: 0.245 s
02-Oct-2019 17:08:42 testSyntheticAccessors3(org.eclipse.jdt.core.groovy.tests.search.SyntheticAccessorInferencingTests)  Time elapsed: 0.667 s
02-Oct-2019 17:08:42 testSyntheticAccessors4(org.eclipse.jdt.core.groovy.tests.search.SyntheticAccessorInferencingTests)  Time elapsed: 4.932 s
02-Oct-2019 17:08:42 testPublicStaticSuperMethod1(org.eclipse.jdt.core.groovy.tests.search.TraitInferencingTests)  Time elapsed: 0.221 s
02-Oct-2019 17:08:42 testPublicStaticSuperMethod2(org.eclipse.jdt.core.groovy.tests.search.TraitInferencingTests)  Time elapsed: 0.634 s
02-Oct-2019 17:08:42 testProperty10(org.eclipse.jdt.core.groovy.tests.search.TraitInferencingTests)  Time elapsed: 1.684 s
02-Oct-2019 17:08:42 testProperty11(org.eclipse.jdt.core.groovy.tests.search.TraitInferencingTests)  Time elapsed: 0.224 s
02-Oct-2019 17:08:42 testProperty12(org.eclipse.jdt.core.groovy.tests.search.TraitInferencingTests)  Time elapsed: 0.225 s
02-Oct-2019 17:08:42 testProperty13(org.eclipse.jdt.core.groovy.tests.search.TraitInferencingTests)  Time elapsed: 0.632 s
02-Oct-2019 17:08:42 testProperty14(org.eclipse.jdt.core.groovy.tests.search.TraitInferencingTests)  Time elapsed: 1.598 s
02-Oct-2019 17:08:42 testPrivateStaticField(org.eclipse.jdt.core.groovy.tests.search.TraitInferencingTests)  Time elapsed: 0.208 s
02-Oct-2019 17:08:42 testPrivateMethod1(org.eclipse.jdt.core.groovy.tests.search.TraitInferencingTests)  Time elapsed: 0.208 s
02-Oct-2019 17:08:42 testPrivateMethod2(org.eclipse.jdt.core.groovy.tests.search.TraitInferencingTests)  Time elapsed: 0.701 s
02-Oct-2019 17:08:42 testPrivateMethod3(org.eclipse.jdt.core.groovy.tests.search.TraitInferencingTests)  Time elapsed: 1.645 s
02-Oct-2019 17:08:42 testPrivateMethod4(org.eclipse.jdt.core.groovy.tests.search.TraitInferencingTests)  Time elapsed: 0.627 s
02-Oct-2019 17:08:42 testPublicStaticField(org.eclipse.jdt.core.groovy.tests.search.TraitInferencingTests)  Time elapsed: 0.707 s
02-Oct-2019 17:08:42 testPublicMethod1(org.eclipse.jdt.core.groovy.tests.search.TraitInferencingTests)  Time elapsed: 0.229 s
02-Oct-2019 17:08:42 testPublicMethod2(org.eclipse.jdt.core.groovy.tests.search.TraitInferencingTests)  Time elapsed: 1.507 s
02-Oct-2019 17:08:42 testPublicMethod3(org.eclipse.jdt.core.groovy.tests.search.TraitInferencingTests)  Time elapsed: 0.237 s
02-Oct-2019 17:08:42 testPublicMethod4(org.eclipse.jdt.core.groovy.tests.search.TraitInferencingTests)  Time elapsed: 0.253 s
02-Oct-2019 17:08:42 testPrivateStaticMethod(org.eclipse.jdt.core.groovy.tests.search.TraitInferencingTests)  Time elapsed: 0.652 s
02-Oct-2019 17:08:42 testProperty1(org.eclipse.jdt.core.groovy.tests.search.TraitInferencingTests)  Time elapsed: 0.956 s
02-Oct-2019 17:08:42 testProperty2(org.eclipse.jdt.core.groovy.tests.search.TraitInferencingTests)  Time elapsed: 0.613 s
02-Oct-2019 17:08:42 testProperty3(org.eclipse.jdt.core.groovy.tests.search.TraitInferencingTests)  Time elapsed: 0.23 s
02-Oct-2019 17:08:42 testProperty4(org.eclipse.jdt.core.groovy.tests.search.TraitInferencingTests)  Time elapsed: 0.215 s
02-Oct-2019 17:08:42 testProperty5(org.eclipse.jdt.core.groovy.tests.search.TraitInferencingTests)  Time elapsed: 0.674 s
02-Oct-2019 17:08:42 testProperty6(org.eclipse.jdt.core.groovy.tests.search.TraitInferencingTests)  Time elapsed: 1.727 s
02-Oct-2019 17:08:42 testProperty7(org.eclipse.jdt.core.groovy.tests.search.TraitInferencingTests)  Time elapsed: 0.195 s
02-Oct-2019 17:08:42 testProperty8(org.eclipse.jdt.core.groovy.tests.search.TraitInferencingTests)  Time elapsed: 0.223 s
02-Oct-2019 17:08:42 testProperty9(org.eclipse.jdt.core.groovy.tests.search.TraitInferencingTests)  Time elapsed: 0.681 s
02-Oct-2019 17:08:42 testPublicStaticFinalField(org.eclipse.jdt.core.groovy.tests.search.TraitInferencingTests)  Time elapsed: 1.521 s
02-Oct-2019 17:08:42 testPublicField1(org.eclipse.jdt.core.groovy.tests.search.TraitInferencingTests)  Time elapsed: 0.211 s
02-Oct-2019 17:08:42 testPublicField2(org.eclipse.jdt.core.groovy.tests.search.TraitInferencingTests)  Time elapsed: 0.212 s
02-Oct-2019 17:08:42 testPrivateStaticFinalField(org.eclipse.jdt.core.groovy.tests.search.TraitInferencingTests)  Time elapsed: 0.713 s
02-Oct-2019 17:08:42 testPrivateField1(org.eclipse.jdt.core.groovy.tests.search.TraitInferencingTests)  Time elapsed: 1.559 s
02-Oct-2019 17:08:42 testPrivateField2(org.eclipse.jdt.core.groovy.tests.search.TraitInferencingTests)  Time elapsed: 0.237 s
02-Oct-2019 17:08:42 testFindClassDeclarationWithPattern(org.eclipse.jdt.core.groovy.tests.search.TypeReferenceSearchTests)  Time elapsed: 0.365 s
02-Oct-2019 17:08:42 testInnerTypes1(org.eclipse.jdt.core.groovy.tests.search.TypeReferenceSearchTests)  Time elapsed: 1.162 s
02-Oct-2019 17:08:42 testInnerTypes2(org.eclipse.jdt.core.groovy.tests.search.TypeReferenceSearchTests)  Time elapsed: 1.625 s
02-Oct-2019 17:08:42 testInnerTypes3(org.eclipse.jdt.core.groovy.tests.search.TypeReferenceSearchTests)  Time elapsed: 1.119 s
02-Oct-2019 17:08:42 testSearchForTypesScript1(org.eclipse.jdt.core.groovy.tests.search.TypeReferenceSearchTests)  Time elapsed: 0.179 s
02-Oct-2019 17:08:42 testSearchForTypesScript2(org.eclipse.jdt.core.groovy.tests.search.TypeReferenceSearchTests)  Time elapsed: 0.149 s
02-Oct-2019 17:08:42 testSearchForTypesScript3(org.eclipse.jdt.core.groovy.tests.search.TypeReferenceSearchTests)  Time elapsed: 0.162 s
02-Oct-2019 17:08:42 testSearchForTypesScript4(org.eclipse.jdt.core.groovy.tests.search.TypeReferenceSearchTests)  Time elapsed: 1.178 s
02-Oct-2019 17:08:42 testSearchForTypesScript5(org.eclipse.jdt.core.groovy.tests.search.TypeReferenceSearchTests)  Time elapsed: 0.186 s
02-Oct-2019 17:08:42 testSearchForTypesScript6(org.eclipse.jdt.core.groovy.tests.search.TypeReferenceSearchTests)  Time elapsed: 0.172 s
02-Oct-2019 17:08:42 testShouldntFindClassDeclarationInScript(org.eclipse.jdt.core.groovy.tests.search.TypeReferenceSearchTests)  Time elapsed: 0.211 s
02-Oct-2019 17:08:42 testSearchForTypesArray1(org.eclipse.jdt.core.groovy.tests.search.TypeReferenceSearchTests)  Time elapsed: 0.201 s
02-Oct-2019 17:08:42 testSearchForTypesClass1(org.eclipse.jdt.core.groovy.tests.search.TypeReferenceSearchTests)  Time elapsed: 0.904 s
02-Oct-2019 17:08:42 testSearchForTypesClass2(org.eclipse.jdt.core.groovy.tests.search.TypeReferenceSearchTests)  Time elapsed: 0.125 s
02-Oct-2019 17:08:42 testSearchForTypesClass3(org.eclipse.jdt.core.groovy.tests.search.TypeReferenceSearchTests)  Time elapsed: 0.134 s
02-Oct-2019 17:08:42 testSearchForTypesClass4(org.eclipse.jdt.core.groovy.tests.search.TypeReferenceSearchTests)  Time elapsed: 0.158 s
02-Oct-2019 17:08:42 testSearchForTypesClass5(org.eclipse.jdt.core.groovy.tests.search.TypeReferenceSearchTests)  Time elapsed: 0.186 s
02-Oct-2019 17:08:42 testSearchForTypesClass6(org.eclipse.jdt.core.groovy.tests.search.TypeReferenceSearchTests)  Time elapsed: 0.114 s
02-Oct-2019 17:08:42 testSearchForTypesClass7(org.eclipse.jdt.core.groovy.tests.search.TypeReferenceSearchTests)  Time elapsed: 1.274 s
02-Oct-2019 17:08:42 testSearchForTypesClosure1(org.eclipse.jdt.core.groovy.tests.search.TypeReferenceSearchTests)  Time elapsed: 0.175 s
02-Oct-2019 17:08:42 testSearchForTypesClosure2(org.eclipse.jdt.core.groovy.tests.search.TypeReferenceSearchTests)  Time elapsed: 0.179 s
02-Oct-2019 17:08:42 testSearchForTypesClosure3(org.eclipse.jdt.core.groovy.tests.search.TypeReferenceSearchTests)  Time elapsed: 0.177 s
02-Oct-2019 17:08:42 testCoercion1(org.eclipse.jdt.core.groovy.tests.search.TypeReferenceSearchTests)  Time elapsed: 0.136 s
02-Oct-2019 17:08:42 testGenerics1(org.eclipse.jdt.core.groovy.tests.search.TypeReferenceSearchTests)  Time elapsed: 1.093 s
02-Oct-2019 17:08:42 testFindClassDeclaration(org.eclipse.jdt.core.groovy.tests.search.TypeReferenceSearchTests)  Time elapsed: 0.095 s
02-Oct-2019 17:08:42 testConstructorWithDefaultArgsInCompileStatic(org.eclipse.jdt.core.groovy.tests.search.TypeReferenceSearchTests)  Time elapsed: 1.182 s
02-Oct-2019 17:08:42
02-Oct-2019 17:08:42 Results:
02-Oct-2019 17:08:42
02-Oct-2019 17:08:42 Failures:
02-Oct-2019 17:08:42   BasicGroovyBuildTests.testUpdateProjectPreferences:3328->BuilderTestSuite.expectingNoProblems:244->BuilderTestSuite.expectingNoProblemsFor:249
02-Oct-2019 17:08:42 ----------- Expected ------------
02-Oct-2019 17:08:42
02-Oct-2019 17:08:42 ------------ but was ------------
02-Oct-2019 17:08:42 Problem : The import util.MyException is never used [ resource : </Project/src/p/Test.java> range : <18,34> category : <120> severity : <1>]
02-Oct-2019 17:08:42
02-Oct-2019 17:08:42 --------- Difference is ----------
02-Oct-2019 17:08:42 expected:<[]> but was:<[Problem : The import util.MyException is never used [ resource : </Project/src/p/Test.java> range : <18,34> category : <120> severity : <1>]
02-Oct-2019 17:08:42 ]>
02-Oct-2019 17:08:42   BinarySearchTests.testClassDecl2:172->assertMatches:139 Expecting 4 matches, but found 0
02-Oct-2019 17:08:42
02-Oct-2019 17:08:42   BinarySearchTests.testFieldRefInInitializer:208->assertMatches:139 Expecting 1 matches, but found 0
02-Oct-2019 17:08:42
02-Oct-2019 17:08:42   ConstructorReferenceSearchTests.testConstructorReferences10:258 expected:<1> but was:<0>
02-Oct-2019 17:08:42   ConstructorReferenceSearchTests.testConstructorReferences3:126 expected:<3> but was:<0>
02-Oct-2019 17:08:42   ConstructorReferenceSearchTests.testConstructorReferences6:180 expected:<2> but was:<0>
02-Oct-2019 17:08:42   ConstructorReferenceSearchTests.testNewifyConstructorReferences2:408 expected:<2> but was:<0>
02-Oct-2019 17:08:42   DGMInferencingTests.testDGMClosure3:718->assertExprType:34->InferencingTestSuite.assertType:59->InferencingTestSuite.assertType:64->InferencingTestSuite.assertType:83 Expected type not found.
02-Oct-2019 17:08:42 Expected: java.lang.String
02-Oct-2019 17:08:42 Found: java.lang.Object
02-Oct-2019 17:08:42 Declaring type: groovy.lang.Closure<V extends java.lang.Object>
02-Oct-2019 17:08:42 ASTNode: org.codehaus.groovy.ast.expr.VariableExpression@ebcdb[variable: it]
02-Oct-2019 17:08:42 Confidence: INFERRED
02-Oct-2019 17:08:42
02-Oct-2019 17:08:42   MethodReferenceSearchTests.testExplicitPropertySetterSearch2:594 expected:<5> but was:<0>
02-Oct-2019 17:08:42   MethodReferenceSearchTests.testMethodWithDefaultParameters3:369 expected:<2> but was:<0>
02-Oct-2019 17:08:42
02-Oct-2019 17:08:42 Tests run: 6031, Failures: 10, Errors: 0, Skipped: 111
02-Oct-2019 17:08:42
02-Oct-2019 17:08:45
02-Oct-2019 17:08:45 !ENTRY org.eclipse.core.resources 2 10035 2019-10-02 17:08:45.263
02-Oct-2019 17:08:45 !MESSAGE The workspace will exit with unsaved changes in this session.
02-Oct-2019 17:08:45 [ERROR] There are test failures.
02-Oct-2019 17:08:45
02-Oct-2019 17:08:45 Please refer to /opt/bamboo-home/xml-data/build-dir/GRECLIPSE-E410-JOB1/ide-test/org.codehaus.groovy.alltests/target/surefire-reports for the individual test results.
02-Oct-2019 17:08:45 [INFO]
02-Oct-2019 17:08:45 [INFO] --- maven-install-plugin:2.3.1:install (default-install) @ org.codehaus.groovy.alltests ---
02-Oct-2019 17:08:45 [INFO] Installing /opt/bamboo-home/xml-data/build-dir/GRECLIPSE-E410-JOB1/ide-test/org.codehaus.groovy.alltests/target/org.codehaus.groovy.alltests-3.6.0-SNAPSHOT.jar to /home/bamboo/.m2/repository/org/codehaus/groovy/eclipse/org.codehaus.groovy.alltests/3.6.0-SNAPSHOT/org.codehaus.groovy.alltests-3.6.0-SNAPSHOT.jar
02-Oct-2019 17:08:45 [INFO] Installing /opt/bamboo-home/xml-data/build-dir/GRECLIPSE-E410-JOB1/ide-test/org.codehaus.groovy.alltests/pom.xml to /home/bamboo/.m2/repository/org/codehaus/groovy/eclipse/org.codehaus.groovy.alltests/3.6.0-SNAPSHOT/org.codehaus.groovy.alltests-3.6.0-SNAPSHOT.pom
02-Oct-2019 17:08:45 [INFO] Installing /opt/bamboo-home/xml-data/build-dir/GRECLIPSE-E410-JOB1/ide-test/org.codehaus.groovy.alltests/target/org.codehaus.groovy.alltests-3.6.0-SNAPSHOT-sources.jar to /home/bamboo/.m2/repository/org/codehaus/groovy/eclipse/org.codehaus.groovy.alltests/3.6.0-SNAPSHOT/org.codehaus.groovy.alltests-3.6.0-SNAPSHOT-sources.jar
02-Oct-2019 17:08:45 [INFO] Installing /opt/bamboo-home/xml-data/build-dir/GRECLIPSE-E410-JOB1/ide-test/org.codehaus.groovy.alltests/target/p2content.xml to /home/bamboo/.m2/repository/org/codehaus/groovy/eclipse/org.codehaus.groovy.alltests/3.6.0-SNAPSHOT/org.codehaus.groovy.alltests-3.6.0-SNAPSHOT-p2metadata.xml
02-Oct-2019 17:08:45 [INFO] Installing /opt/bamboo-home/xml-data/build-dir/GRECLIPSE-E410-JOB1/ide-test/org.codehaus.groovy.alltests/target/p2artifacts.xml to /home/bamboo/.m2/repository/org/codehaus/groovy/eclipse/org.codehaus.groovy.alltests/3.6.0-SNAPSHOT/org.codehaus.groovy.alltests-3.6.0-SNAPSHOT-p2artifacts.xml
02-Oct-2019 17:08:45 [INFO] Installing /opt/bamboo-home/xml-data/build-dir/GRECLIPSE-E410-JOB1/ide-test/org.codehaus.groovy.alltests/target/p2content.xml to /home/bamboo/.m2/repository/org/codehaus/groovy/eclipse/org.codehaus.groovy.alltests/3.6.0-SNAPSHOT/org.codehaus.groovy.alltests-3.6.0-SNAPSHOT-p2metadata.xml
02-Oct-2019 17:08:45 [INFO] Installing /opt/bamboo-home/xml-data/build-dir/GRECLIPSE-E410-JOB1/ide-test/org.codehaus.groovy.alltests/target/p2artifacts.xml to /home/bamboo/.m2/repository/org/codehaus/groovy/eclipse/org.codehaus.groovy.alltests/3.6.0-SNAPSHOT/org.codehaus.groovy.alltests-3.6.0-SNAPSHOT-p2artifacts.xml
02-Oct-2019 17:08:45 [INFO]
02-Oct-2019 17:08:45 [INFO] --- tycho-p2-plugin:1.4.0:update-local-index (default-update-local-index) @ org.codehaus.groovy.alltests ---
02-Oct-2019 17:08:45 [INFO]
02-Oct-2019 17:08:45 [INFO] --- maven-deploy-plugin:2.8.2:deploy (default-deploy) @ org.codehaus.groovy.alltests ---
02-Oct-2019 17:08:45 [INFO] Skipping artifact deployment
02-Oct-2019 17:08:45 [INFO]                                                                         
02-Oct-2019 17:08:45 [INFO] ------------------------------------------------------------------------
02-Oct-2019 17:08:45 [INFO] Building org.codehaus.groovy.m2eclipse 3.6.0-SNAPSHOT
02-Oct-2019 17:08:45 [INFO] ------------------------------------------------------------------------
02-Oct-2019 17:08:45 [INFO]
02-Oct-2019 17:08:45 [INFO] --- maven-clean-plugin:2.5:clean (default-clean) @ org.codehaus.groovy.m2eclipse ---
02-Oct-2019 17:08:45 [INFO]
02-Oct-2019 17:08:45 [INFO] --- tycho-packaging-plugin:1.4.0:build-qualifier (default-build-qualifier) @ org.codehaus.groovy.m2eclipse ---
02-Oct-2019 17:08:45 [INFO] The project's OSGi version is 3.6.0.v201910021537-e1812
02-Oct-2019 17:08:45 [INFO]
02-Oct-2019 17:08:45 [INFO] --- tycho-packaging-plugin:1.4.0:validate-id (default-validate-id) @ org.codehaus.groovy.m2eclipse ---
02-Oct-2019 17:08:45 [INFO]
02-Oct-2019 17:08:45 [INFO] --- tycho-packaging-plugin:1.4.0:validate-version (default-validate-version) @ org.codehaus.groovy.m2eclipse ---
02-Oct-2019 17:08:45 [INFO]
02-Oct-2019 17:08:45 [INFO] --- properties-maven-plugin:1.0.0:read-project-properties (default) @ org.codehaus.groovy.m2eclipse ---
02-Oct-2019 17:08:45 [INFO]
02-Oct-2019 17:08:45 [INFO] --- maven-resources-plugin:2.4.3:resources (default-resources) @ org.codehaus.groovy.m2eclipse ---
02-Oct-2019 17:08:45 [INFO] Using 'UTF-8' encoding to copy filtered resources.
02-Oct-2019 17:08:45 [INFO] skip non existing resourceDirectory /opt/bamboo-home/xml-data/build-dir/GRECLIPSE-E410-JOB1/extras/org.codehaus.groovy.m2eclipse/src/main/resources
02-Oct-2019 17:08:45 [INFO]
02-Oct-2019 17:08:45 [INFO] --- tycho-compiler-plugin:1.4.0:compile (default-compile) @ org.codehaus.groovy.m2eclipse ---
02-Oct-2019 17:08:45 [INFO] Compiling 2 source files to /opt/bamboo-home/xml-data/build-dir/GRECLIPSE-E410-JOB1/extras/org.codehaus.groovy.m2eclipse/target/classes
02-Oct-2019 17:08:45 [INFO]
02-Oct-2019 17:08:45 [INFO] --- maven-resources-plugin:2.4.3:testResources (default-testResources) @ org.codehaus.groovy.m2eclipse ---
02-Oct-2019 17:08:45 [INFO] Using 'UTF-8' encoding to copy filtered resources.
02-Oct-2019 17:08:45 [INFO] skip non existing resourceDirectory /opt/bamboo-home/xml-data/build-dir/GRECLIPSE-E410-JOB1/extras/org.codehaus.groovy.m2eclipse/src/test/resources
02-Oct-2019 17:08:45 [INFO]
02-Oct-2019 17:08:45 [INFO] --- tycho-source-plugin:1.4.0:plugin-source (plugin-source) @ org.codehaus.groovy.m2eclipse ---
02-Oct-2019 17:08:45 [INFO] Building jar: /opt/bamboo-home/xml-data/build-dir/GRECLIPSE-E410-JOB1/extras/org.codehaus.groovy.m2eclipse/target/org.codehaus.groovy.m2eclipse-3.6.0-SNAPSHOT-sources.jar
02-Oct-2019 17:08:45 [INFO]
02-Oct-2019 17:08:45 [INFO] --- target-platform-configuration:1.4.0:target-platform (default-target-platform) @ org.codehaus.groovy.m2eclipse ---
02-Oct-2019 17:08:45 [INFO]
02-Oct-2019 17:08:45 [INFO] --- tycho-packaging-plugin:1.4.0:package-plugin (default-package-plugin) @ org.codehaus.groovy.m2eclipse ---
02-Oct-2019 17:08:45 [INFO] Building jar: /opt/bamboo-home/xml-data/build-dir/GRECLIPSE-E410-JOB1/extras/org.codehaus.groovy.m2eclipse/target/org.codehaus.groovy.m2eclipse-3.6.0-SNAPSHOT.jar
02-Oct-2019 17:08:45 [INFO]
02-Oct-2019 17:08:45 [INFO] --- tycho-p2-plugin:1.4.0:p2-metadata-default (default-p2-metadata-default) @ org.codehaus.groovy.m2eclipse ---
02-Oct-2019 17:08:45 [INFO]
02-Oct-2019 17:08:45 [INFO] --- maven-jarsigner-plugin:1.4:sign (sign) @ org.codehaus.groovy.m2eclipse ---
02-Oct-2019 17:08:46 [INFO] 2 archive(s) processed
02-Oct-2019 17:08:46 [INFO]
02-Oct-2019 17:08:46 [INFO] --- tycho-source-feature-plugin:1.4.0:source-feature (source-feature) @ org.codehaus.groovy.m2eclipse ---
02-Oct-2019 17:08:46 [INFO]
02-Oct-2019 17:08:46 [INFO] --- tycho-p2-plugin:1.4.0:p2-metadata (attach-p2-metadata) @ org.codehaus.groovy.m2eclipse ---
02-Oct-2019 17:08:46 [INFO]
02-Oct-2019 17:08:46 [INFO] --- maven-install-plugin:2.3.1:install (default-install) @ org.codehaus.groovy.m2eclipse ---
02-Oct-2019 17:08:46 [INFO] Installing /opt/bamboo-home/xml-data/build-dir/GRECLIPSE-E410-JOB1/extras/org.codehaus.groovy.m2eclipse/target/org.codehaus.groovy.m2eclipse-3.6.0-SNAPSHOT.jar to /home/bamboo/.m2/repository/org/codehaus/groovy/eclipse/org.codehaus.groovy.m2eclipse/3.6.0-SNAPSHOT/org.codehaus.groovy.m2eclipse-3.6.0-SNAPSHOT.jar
02-Oct-2019 17:08:46 [INFO] Installing /opt/bamboo-home/xml-data/build-dir/GRECLIPSE-E410-JOB1/extras/org.codehaus.groovy.m2eclipse/pom.xml to /home/bamboo/.m2/repository/org/codehaus/groovy/eclipse/org.codehaus.groovy.m2eclipse/3.6.0-SNAPSHOT/org.codehaus.groovy.m2eclipse-3.6.0-SNAPSHOT.pom
02-Oct-2019 17:08:46 [INFO] Installing /opt/bamboo-home/xml-data/build-dir/GRECLIPSE-E410-JOB1/extras/org.codehaus.groovy.m2eclipse/target/org.codehaus.groovy.m2eclipse-3.6.0-SNAPSHOT-sources.jar to /home/bamboo/.m2/repository/org/codehaus/groovy/eclipse/org.codehaus.groovy.m2eclipse/3.6.0-SNAPSHOT/org.codehaus.groovy.m2eclipse-3.6.0-SNAPSHOT-sources.jar
02-Oct-2019 17:08:46 [INFO] Installing /opt/bamboo-home/xml-data/build-dir/GRECLIPSE-E410-JOB1/extras/org.codehaus.groovy.m2eclipse/target/p2content.xml to /home/bamboo/.m2/repository/org/codehaus/groovy/eclipse/org.codehaus.groovy.m2eclipse/3.6.0-SNAPSHOT/org.codehaus.groovy.m2eclipse-3.6.0-SNAPSHOT-p2metadata.xml
02-Oct-2019 17:08:46 [INFO] Installing /opt/bamboo-home/xml-data/build-dir/GRECLIPSE-E410-JOB1/extras/org.codehaus.groovy.m2eclipse/target/p2artifacts.xml to /home/bamboo/.m2/repository/org/codehaus/groovy/eclipse/org.codehaus.groovy.m2eclipse/3.6.0-SNAPSHOT/org.codehaus.groovy.m2eclipse-3.6.0-SNAPSHOT-p2artifacts.xml
02-Oct-2019 17:08:46 [INFO] Installing /opt/bamboo-home/xml-data/build-dir/GRECLIPSE-E410-JOB1/extras/org.codehaus.groovy.m2eclipse/target/p2content.xml to /home/bamboo/.m2/repository/org/codehaus/groovy/eclipse/org.codehaus.groovy.m2eclipse/3.6.0-SNAPSHOT/org.codehaus.groovy.m2eclipse-3.6.0-SNAPSHOT-p2metadata.xml
02-Oct-2019 17:08:46 [INFO] Installing /opt/bamboo-home/xml-data/build-dir/GRECLIPSE-E410-JOB1/extras/org.codehaus.groovy.m2eclipse/target/p2artifacts.xml to /home/bamboo/.m2/repository/org/codehaus/groovy/eclipse/org.codehaus.groovy.m2eclipse/3.6.0-SNAPSHOT/org.codehaus.groovy.m2eclipse-3.6.0-SNAPSHOT-p2artifacts.xml
02-Oct-2019 17:08:46 [INFO]
02-Oct-2019 17:08:46 [INFO] --- tycho-p2-plugin:1.4.0:update-local-index (default-update-local-index) @ org.codehaus.groovy.m2eclipse ---
02-Oct-2019 17:08:46 [INFO]
02-Oct-2019 17:08:46 [INFO] --- maven-deploy-plugin:2.8.2:deploy (default-deploy) @ org.codehaus.groovy.m2eclipse ---
02-Oct-2019 17:08:46 [INFO] Skipping artifact deployment
02-Oct-2019 17:08:46 [INFO]                                                                         
02-Oct-2019 17:08:46 [INFO] ------------------------------------------------------------------------
02-Oct-2019 17:08:46 [INFO] Building org.codehaus.groovy.m2eclipse.feature 3.6.0-SNAPSHOT
02-Oct-2019 17:08:46 [INFO] ------------------------------------------------------------------------
02-Oct-2019 17:08:46 [INFO]
02-Oct-2019 17:08:46 [INFO] --- maven-clean-plugin:2.5:clean (default-clean) @ org.codehaus.groovy.m2eclipse.feature ---
02-Oct-2019 17:08:46 [INFO] Deleting /opt/bamboo-home/xml-data/build-dir/GRECLIPSE-E410-JOB1/extras/Feature-org.codehaus.groovy.m2eclipse/target
02-Oct-2019 17:08:46 [INFO]
02-Oct-2019 17:08:46 [INFO] --- tycho-packaging-plugin:1.4.0:build-qualifier-aggregator (default-build-qualifier-aggregator) @ org.codehaus.groovy.m2eclipse.feature ---
02-Oct-2019 17:08:46 [INFO] The project's OSGi version is 3.6.0.v201910021537-e1812
02-Oct-2019 17:08:46 [INFO]
02-Oct-2019 17:08:46 [INFO] --- tycho-packaging-plugin:1.4.0:validate-id (default-validate-id) @ org.codehaus.groovy.m2eclipse.feature ---
02-Oct-2019 17:08:46 [INFO]
02-Oct-2019 17:08:46 [INFO] --- tycho-packaging-plugin:1.4.0:validate-version (default-validate-version) @ org.codehaus.groovy.m2eclipse.feature ---
02-Oct-2019 17:08:46 [INFO]
02-Oct-2019 17:08:46 [INFO] --- properties-maven-plugin:1.0.0:read-project-properties (default) @ org.codehaus.groovy.m2eclipse.feature ---
02-Oct-2019 17:08:46 [INFO]
02-Oct-2019 17:08:46 [INFO] --- tycho-source-plugin:1.4.0:plugin-source (plugin-source) @ org.codehaus.groovy.m2eclipse.feature ---
02-Oct-2019 17:08:46 [INFO]
02-Oct-2019 17:08:46 [INFO] --- target-platform-configuration:1.4.0:target-platform (default-target-platform) @ org.codehaus.groovy.m2eclipse.feature ---
02-Oct-2019 17:08:46 [INFO]
02-Oct-2019 17:08:46 [INFO] --- tycho-packaging-plugin:1.4.0:package-feature (default-package-feature) @ org.codehaus.groovy.m2eclipse.feature ---
02-Oct-2019 17:08:46 [INFO] Building jar: /opt/bamboo-home/xml-data/build-dir/GRECLIPSE-E410-JOB1/extras/Feature-org.codehaus.groovy.m2eclipse/target/org.codehaus.groovy.m2eclipse.feature-3.6.0-SNAPSHOT.jar
02-Oct-2019 17:08:46 [INFO]
02-Oct-2019 17:08:46 [INFO] --- tycho-p2-plugin:1.4.0:p2-metadata-default (default-p2-metadata-default) @ org.codehaus.groovy.m2eclipse.feature ---
02-Oct-2019 17:08:46 [INFO]
02-Oct-2019 17:08:46 [INFO] --- tycho-p2-plugin:1.4.0:feature-p2-metadata (default-feature-p2-metadata) @ org.codehaus.groovy.m2eclipse.feature ---
02-Oct-2019 17:08:46 [INFO]
02-Oct-2019 17:08:46 [INFO] --- maven-jarsigner-plugin:1.4:sign (sign) @ org.codehaus.groovy.m2eclipse.feature ---
02-Oct-2019 17:08:46 [INFO] 1 archive(s) processed
02-Oct-2019 17:08:46 [INFO]
02-Oct-2019 17:08:46 [INFO] --- tycho-source-feature-plugin:1.4.0:source-feature (source-feature) @ org.codehaus.groovy.m2eclipse.feature ---
02-Oct-2019 17:08:46 [INFO] Building jar: /opt/bamboo-home/xml-data/build-dir/GRECLIPSE-E410-JOB1/extras/Feature-org.codehaus.groovy.m2eclipse/target/org.codehaus.groovy.m2eclipse.feature-3.6.0-SNAPSHOT-sources-feature.jar
02-Oct-2019 17:08:46 [INFO]
02-Oct-2019 17:08:46 [INFO] --- tycho-p2-plugin:1.4.0:p2-metadata (attach-p2-metadata) @ org.codehaus.groovy.m2eclipse.feature ---
02-Oct-2019 17:08:46 [INFO]
02-Oct-2019 17:08:46 [INFO] --- maven-install-plugin:2.3.1:install (default-install) @ org.codehaus.groovy.m2eclipse.feature ---
02-Oct-2019 17:08:46 [INFO] Installing /opt/bamboo-home/xml-data/build-dir/GRECLIPSE-E410-JOB1/extras/Feature-org.codehaus.groovy.m2eclipse/target/org.codehaus.groovy.m2eclipse.feature-3.6.0-SNAPSHOT.jar to /home/bamboo/.m2/repository/org/codehaus/groovy/eclipse/org.codehaus.groovy.m2eclipse.feature/3.6.0-SNAPSHOT/org.codehaus.groovy.m2eclipse.feature-3.6.0-SNAPSHOT.jar
02-Oct-2019 17:08:46 [INFO] Installing /opt/bamboo-home/xml-data/build-dir/GRECLIPSE-E410-JOB1/extras/Feature-org.codehaus.groovy.m2eclipse/pom.xml to /home/bamboo/.m2/repository/org/codehaus/groovy/eclipse/org.codehaus.groovy.m2eclipse.feature/3.6.0-SNAPSHOT/org.codehaus.groovy.m2eclipse.feature-3.6.0-SNAPSHOT.pom
02-Oct-2019 17:08:46 [INFO] Installing /opt/bamboo-home/xml-data/build-dir/GRECLIPSE-E410-JOB1/extras/Feature-org.codehaus.groovy.m2eclipse/target/p2content.xml to /home/bamboo/.m2/repository/org/codehaus/groovy/eclipse/org.codehaus.groovy.m2eclipse.feature/3.6.0-SNAPSHOT/org.codehaus.groovy.m2eclipse.feature-3.6.0-SNAPSHOT-p2metadata.xml
02-Oct-2019 17:08:46 [INFO] Installing /opt/bamboo-home/xml-data/build-dir/GRECLIPSE-E410-JOB1/extras/Feature-org.codehaus.groovy.m2eclipse/target/p2artifacts.xml to /home/bamboo/.m2/repository/org/codehaus/groovy/eclipse/org.codehaus.groovy.m2eclipse.feature/3.6.0-SNAPSHOT/org.codehaus.groovy.m2eclipse.feature-3.6.0-SNAPSHOT-p2artifacts.xml
02-Oct-2019 17:08:46 [INFO] Installing /opt/bamboo-home/xml-data/build-dir/GRECLIPSE-E410-JOB1/extras/Feature-org.codehaus.groovy.m2eclipse/target/org.codehaus.groovy.m2eclipse.feature-3.6.0-SNAPSHOT-sources-feature.jar to /home/bamboo/.m2/repository/org/codehaus/groovy/eclipse/org.codehaus.groovy.m2eclipse.feature/3.6.0-SNAPSHOT/org.codehaus.groovy.m2eclipse.feature-3.6.0-SNAPSHOT-sources-feature.jar
02-Oct-2019 17:08:46 [INFO] Installing /opt/bamboo-home/xml-data/build-dir/GRECLIPSE-E410-JOB1/extras/Feature-org.codehaus.groovy.m2eclipse/target/p2content.xml to /home/bamboo/.m2/repository/org/codehaus/groovy/eclipse/org.codehaus.groovy.m2eclipse.feature/3.6.0-SNAPSHOT/org.codehaus.groovy.m2eclipse.feature-3.6.0-SNAPSHOT-p2metadata.xml
02-Oct-2019 17:08:46 [INFO] Installing /opt/bamboo-home/xml-data/build-dir/GRECLIPSE-E410-JOB1/extras/Feature-org.codehaus.groovy.m2eclipse/target/p2artifacts.xml to /home/bamboo/.m2/repository/org/codehaus/groovy/eclipse/org.codehaus.groovy.m2eclipse.feature/3.6.0-SNAPSHOT/org.codehaus.groovy.m2eclipse.feature-3.6.0-SNAPSHOT-p2artifacts.xml
02-Oct-2019 17:08:46 [INFO]
02-Oct-2019 17:08:46 [INFO] --- tycho-p2-plugin:1.4.0:update-local-index (default-update-local-index) @ org.codehaus.groovy.m2eclipse.feature ---
02-Oct-2019 17:08:46 [INFO]
02-Oct-2019 17:08:46 [INFO] --- maven-deploy-plugin:2.8.2:deploy (default-deploy) @ org.codehaus.groovy.m2eclipse.feature ---
02-Oct-2019 17:08:46 [INFO] Skipping artifact deployment
02-Oct-2019 17:08:46 [INFO]                                                                         
02-Oct-2019 17:08:46 [INFO] ------------------------------------------------------------------------
02-Oct-2019 17:08:46 [INFO] Building org.codehaus.groovy.eclipse.site 3.6.0-SNAPSHOT
02-Oct-2019 17:08:46 [INFO] ------------------------------------------------------------------------
02-Oct-2019 17:08:46 [INFO]
02-Oct-2019 17:08:46 [INFO] --- maven-clean-plugin:2.5:clean (default-clean) @ org.codehaus.groovy.eclipse.site ---
02-Oct-2019 17:08:46 [INFO]
02-Oct-2019 17:08:46 [INFO] --- tycho-packaging-plugin:1.4.0:build-qualifier (default-build-qualifier) @ org.codehaus.groovy.eclipse.site ---
02-Oct-2019 17:08:47 [INFO] The project's OSGi version is 3.6.0.v201910021537-e1812
02-Oct-2019 17:08:47 [INFO]
02-Oct-2019 17:08:47 [INFO] --- properties-maven-plugin:1.0.0:read-project-properties (default) @ org.codehaus.groovy.eclipse.site ---
02-Oct-2019 17:08:47 [INFO]
02-Oct-2019 17:08:47 [INFO] --- tycho-source-plugin:1.4.0:plugin-source (plugin-source) @ org.codehaus.groovy.eclipse.site ---
02-Oct-2019 17:08:47 [INFO]
02-Oct-2019 17:08:47 [INFO] --- tycho-packaging-plugin:1.4.0:update-site (default-update-site) @ org.codehaus.groovy.eclipse.site ---
02-Oct-2019 17:08:47 [INFO]
02-Oct-2019 17:08:47 [INFO] --- tycho-p2-plugin:1.4.0:update-site-p2-metadata (default-update-site-p2-metadata) @ org.codehaus.groovy.eclipse.site ---
02-Oct-2019 17:08:47 [INFO] Command line:
02-Oct-2019 17:08:47         [/opt/jdk8u212-b03/jre/bin/java, -jar, /opt/users/bamboo/.m2/repository/org/eclipse/tycho/tycho-bundles-external/1.4.0/eclipse/plugins/org.eclipse.equinox.launcher_1.5.300.v20190213-1655.jar, -configuration, /tmp/GRECLIPSE-E410-JOB1/tycho-p2-runtime4763117031142281020.tmp/configuration, -nosplash, -application, org.eclipse.equinox.p2.publisher.UpdateSitePublisher, -source, /opt/bamboo-home/xml-data/build-dir/GRECLIPSE-E410-JOB1/Site-org.codehaus.groovy.eclipse/target/site, -metadataRepository, file:/opt/bamboo-home/xml-data/build-dir/GRECLIPSE-E410-JOB1/Site-org.codehaus.groovy.eclipse/target/site/, -metadataRepositoryName, org.codehaus.groovy.eclipse.site, -artifactRepository, file:/opt/bamboo-home/xml-data/build-dir/GRECLIPSE-E410-JOB1/Site-org.codehaus.groovy.eclipse/target/site/, -artifactRepositoryName, org.codehaus.groovy.eclipse.site Artifacts, -noDefaultIUs, -compress]
02-Oct-2019 17:08:48 Generating metadata for ..
02-Oct-2019 17:08:49 Generation completed with success [1 seconds].
02-Oct-2019 17:08:50 [INFO]
02-Oct-2019 17:08:50 [INFO] --- tycho-packaging-plugin:1.4.0:update-site-packaging (default-update-site-packaging) @ org.codehaus.groovy.eclipse.site ---
02-Oct-2019 17:08:50 [INFO] Building zip: /opt/bamboo-home/xml-data/build-dir/GRECLIPSE-E410-JOB1/Site-org.codehaus.groovy.eclipse/target/site.zip
02-Oct-2019 17:08:50 [INFO]
02-Oct-2019 17:08:50 [INFO] --- maven-jarsigner-plugin:1.4:sign (sign) @ org.codehaus.groovy.eclipse.site ---
02-Oct-2019 17:08:50 [INFO] 1 archive(s) processed
02-Oct-2019 17:08:50 [INFO]
02-Oct-2019 17:08:50 [INFO] --- tycho-source-feature-plugin:1.4.0:source-feature (source-feature) @ org.codehaus.groovy.eclipse.site ---
02-Oct-2019 17:08:50 [INFO]
02-Oct-2019 17:08:50 [INFO] --- tycho-p2-plugin:1.4.0:p2-metadata (attach-p2-metadata) @ org.codehaus.groovy.eclipse.site ---
02-Oct-2019 17:08:50 [INFO]
02-Oct-2019 17:08:50 [INFO] --- maven-install-plugin:2.3.1:install (default-install) @ org.codehaus.groovy.eclipse.site ---
02-Oct-2019 17:08:50 [INFO] Installing /opt/bamboo-home/xml-data/build-dir/GRECLIPSE-E410-JOB1/Site-org.codehaus.groovy.eclipse/target/site.zip to /home/bamboo/.m2/repository/org/codehaus/groovy/eclipse/org.codehaus.groovy.eclipse.site/3.6.0-SNAPSHOT/org.codehaus.groovy.eclipse.site-3.6.0-SNAPSHOT.zip
02-Oct-2019 17:08:50 [INFO] Installing /opt/bamboo-home/xml-data/build-dir/GRECLIPSE-E410-JOB1/Site-org.codehaus.groovy.eclipse/pom.xml to /home/bamboo/.m2/repository/org/codehaus/groovy/eclipse/org.codehaus.groovy.eclipse.site/3.6.0-SNAPSHOT/org.codehaus.groovy.eclipse.site-3.6.0-SNAPSHOT.pom
02-Oct-2019 17:08:50 [INFO]
02-Oct-2019 17:08:50 [INFO] --- maven-deploy-plugin:2.8.2:deploy (default-deploy) @ org.codehaus.groovy.eclipse.site ---
02-Oct-2019 17:08:50 [INFO] Skipping artifact deployment
02-Oct-2019 17:08:50 [INFO]
02-Oct-2019 17:08:50 [INFO] --- maven-antrun-plugin:1.8:run (upload-dist) @ org.codehaus.groovy.eclipse.site ---
02-Oct-2019 17:08:50 [INFO] Executing tasks
02-Oct-2019 17:08:50
02-Oct-2019 17:08:50 main:
02-Oct-2019 17:08:50      [echo] Uploading main update site to s3..."
02-Oct-2019 17:08:50      [echo] == Are props set so we can deploy? ==
02-Oct-2019 17:08:50      [echo] dist_properties=/home/bamboo/tools/s3.properties
02-Oct-2019 17:08:50      [echo] bamboo_s3_properties=/home/bamboo/tools/s3.properties
02-Oct-2019 17:08:50      [echo] dist.full.version=3.6.0.v201910021537-e1812
02-Oct-2019 17:08:50      [echo] dist.file.name=org.codehaus.groovy-3.6.0.v201910021537-e1812-updatesite.zip
02-Oct-2019 17:08:50       [zip] Building zip: /opt/bamboo-home/xml-data/build-dir/GRECLIPSE-E410-JOB1/Site-org.codehaus.groovy.eclipse/target/org.codehaus.groovy-3.6.0.v201910021537-e1812-updatesite.zip
02-Oct-2019 17:08:53      [echo] Preparing for upload...
02-Oct-2019 17:08:53      [echo] Will Delete:
02-Oct-2019 17:08:53      [echo] dist.bucket=dist.springsource.org
02-Oct-2019 17:08:53      [echo] dist.path=snapshot/GRECLIPSE/e4.10
02-Oct-2019 17:08:53      [echo] Will Upload:
02-Oct-2019 17:08:53      [echo] dist.bucket=dist.springsource.org
02-Oct-2019 17:08:53      [echo] fromDir=/opt/bamboo-home/xml-data/build-dir/GRECLIPSE-E410-JOB1/Site-org.codehaus.groovy.eclipse/target/site
02-Oct-2019 17:08:53      [echo] toDir=snapshot/GRECLIPSE/e4.10
02-Oct-2019 17:08:53      [echo] Will Upload:
02-Oct-2019 17:08:53      [echo] dist.bucket=dist.springsource.org
02-Oct-2019 17:08:53      [echo] fromFile=/opt/bamboo-home/xml-data/build-dir/GRECLIPSE-E410-JOB1/Site-org.codehaus.groovy.eclipse/target/org.codehaus.groovy-3.6.0.v201910021537-e1812-updatesite.zip
02-Oct-2019 17:08:53      [echo] toFile=snapshot/GRECLIPSE/e4.10/org.codehaus.groovy-3.6.0.v201910021537-e1812-updatesite.zip
02-Oct-2019 17:08:53      [echo] metadata bundle.version=3.6.0.v201910021537-e1812
02-Oct-2019 17:08:53      [echo] metadata package.file.name=org.codehaus.groovy-3.6.0.v201910021537-e1812-updatesite.zip
02-Oct-2019 17:08:53      [echo] metadata project.name=Groovy Eclipse
02-Oct-2019 17:08:53      [echo] metadata release.type=snapshot
02-Oct-2019 17:08:54 Deleted s3://dist.springsource.org/snapshot/GRECLIPSE/e4.10/artifacts.jar
02-Oct-2019 17:08:54 Deleted s3://dist.springsource.org/snapshot/GRECLIPSE/e4.10/content.jar
02-Oct-2019 17:08:55 Deleted s3://dist.springsource.org/snapshot/GRECLIPSE/e4.10/features/
02-Oct-2019 17:08:55 Deleted s3://dist.springsource.org/snapshot/GRECLIPSE/e4.10/features/org.codehaus.groovy.compilerless.feature_3.6.0.v201910012255-e1812.jar
02-Oct-2019 17:08:55 Deleted s3://dist.springsource.org/snapshot/GRECLIPSE/e4.10/features/org.codehaus.groovy.eclipse.feature_3.6.0.v201910012255-e1812.jar
02-Oct-2019 17:08:55 Deleted s3://dist.springsource.org/snapshot/GRECLIPSE/e4.10/features/org.codehaus.groovy.headless.feature_3.6.0.v201910012255-e1812.jar
02-Oct-2019 17:08:55 Deleted s3://dist.springsource.org/snapshot/GRECLIPSE/e4.10/features/org.codehaus.groovy.jdt.patch_3.6.0.v201910012255-e1812.jar
02-Oct-2019 17:08:55 Deleted s3://dist.springsource.org/snapshot/GRECLIPSE/e4.10/features/org.codehaus.groovy.m2eclipse.feature_3.6.0.v201910012255-e1812.jar
02-Oct-2019 17:08:55 Deleted s3://dist.springsource.org/snapshot/GRECLIPSE/e4.10/features/org.codehaus.groovy24.feature_3.6.0.v201910012255-e1812.jar
02-Oct-2019 17:08:55 Deleted s3://dist.springsource.org/snapshot/GRECLIPSE/e4.10/features/org.codehaus.groovy25.feature_3.6.0.v201910012255-e1812.jar
02-Oct-2019 17:08:56 Deleted s3://dist.springsource.org/snapshot/GRECLIPSE/e4.10/features/org.codehaus.groovy30.feature_3.6.0.v201910012255-e1812.jar
02-Oct-2019 17:08:56 Deleted s3://dist.springsource.org/snapshot/GRECLIPSE/e4.10/plugins/
02-Oct-2019 17:08:56 Deleted s3://dist.springsource.org/snapshot/GRECLIPSE/e4.10/plugins/org.codehaus.groovy.eclipse.ant_3.6.0.v201910012255-e1812.jar
02-Oct-2019 17:08:56 Deleted s3://dist.springsource.org/snapshot/GRECLIPSE/e4.10/plugins/org.codehaus.groovy.eclipse.astviews_3.6.0.v201910012255-e1812.jar
02-Oct-2019 17:08:56 Deleted s3://dist.springsource.org/snapshot/GRECLIPSE/e4.10/plugins/org.codehaus.groovy.eclipse.codeassist_3.6.0.v201910012255-e1812.jar
02-Oct-2019 17:08:56 Deleted s3://dist.springsource.org/snapshot/GRECLIPSE/e4.10/plugins/org.codehaus.groovy.eclipse.codebrowsing_3.6.0.v201910012255-e1812.jar
02-Oct-2019 17:08:56 Deleted s3://dist.springsource.org/snapshot/GRECLIPSE/e4.10/plugins/org.codehaus.groovy.eclipse.compilerResolver_3.6.0.v201910012255-e1812.jar
02-Oct-2019 17:08:56 Deleted s3://dist.springsource.org/snapshot/GRECLIPSE/e4.10/plugins/org.codehaus.groovy.eclipse.core_3.6.0.v201910012255-e1812.jar
02-Oct-2019 17:08:56 Deleted s3://dist.springsource.org/snapshot/GRECLIPSE/e4.10/plugins/org.codehaus.groovy.eclipse.dsl_3.6.0.v201910012255-e1812.jar
02-Oct-2019 17:08:56 Deleted s3://dist.springsource.org/snapshot/GRECLIPSE/e4.10/plugins/org.codehaus.groovy.eclipse.quickfix_3.6.0.v201910012255-e1812.jar
02-Oct-2019 17:08:57 Deleted s3://dist.springsource.org/snapshot/GRECLIPSE/e4.10/plugins/org.codehaus.groovy.eclipse.refactoring_3.6.0.v201910012255-e1812.jar
02-Oct-2019 17:08:57 Deleted s3://dist.springsource.org/snapshot/GRECLIPSE/e4.10/plugins/org.codehaus.groovy.eclipse.ui_3.6.0.v201910012255-e1812.jar
02-Oct-2019 17:08:57 Deleted s3://dist.springsource.org/snapshot/GRECLIPSE/e4.10/plugins/org.codehaus.groovy.eclipse_3.6.0.v201910012255-e1812.jar
02-Oct-2019 17:08:57 Deleted s3://dist.springsource.org/snapshot/GRECLIPSE/e4.10/plugins/org.codehaus.groovy.m2eclipse_3.6.0.v201910012255-e1812.jar
02-Oct-2019 17:08:57 Deleted s3://dist.springsource.org/snapshot/GRECLIPSE/e4.10/plugins/org.codehaus.groovy_2.4.17.v201910012255-e1812.jar
02-Oct-2019 17:08:57 Deleted s3://dist.springsource.org/snapshot/GRECLIPSE/e4.10/plugins/org.codehaus.groovy_2.5.8.v201910012255-e1812.jar
02-Oct-2019 17:08:57 Deleted s3://dist.springsource.org/snapshot/GRECLIPSE/e4.10/plugins/org.codehaus.groovy_3.0.0.v201910012255-e1812.jar
02-Oct-2019 17:08:57 Deleted s3://dist.springsource.org/snapshot/GRECLIPSE/e4.10/plugins/org.eclipse.jdt.core_3.16.0.v201910012255-e1812.jar
02-Oct-2019 17:08:57 Deleted s3://dist.springsource.org/snapshot/GRECLIPSE/e4.10/plugins/org.eclipse.jdt.groovy.core_3.6.0.v201910012255-e1812.jar
02-Oct-2019 17:08:57 Deleted s3://dist.springsource.org/snapshot/GRECLIPSE/e4.10/site.xml
02-Oct-2019 17:08:58 Uploading /opt/bamboo-home/xml-data/build-dir/GRECLIPSE-E410-JOB1/Site-org.codehaus.groovy.eclipse/target/site/artifacts.jar (2.8 KB) to s3://dist.springsource.org/snapshot/GRECLIPSE/e4.10/artifacts.jar
02-Oct-2019 17:08:58 Transfer Time: .2 s - Transfer Rate: 14.8 KB/s
02-Oct-2019 17:08:58 Uploading /opt/bamboo-home/xml-data/build-dir/GRECLIPSE-E410-JOB1/Site-org.codehaus.groovy.eclipse/target/site/content.jar (13.6 KB) to s3://dist.springsource.org/snapshot/GRECLIPSE/e4.10/content.jar
02-Oct-2019 17:08:58 Transfer Time: .2 s - Transfer Rate: 79.7 KB/s
02-Oct-2019 17:08:59 Uploading /opt/bamboo-home/xml-data/build-dir/GRECLIPSE-E410-JOB1/Site-org.codehaus.groovy.eclipse/target/site/features/org.codehaus.groovy.compilerless.feature_3.6.0.v201910021537-e1812.jar (15.0 KB) to s3://dist.springsource.org/snapshot/GRECLIPSE/e4.10/features/org.codehaus.groovy.compilerless.feature_3.6.0.v201910021537-e1812.jar
02-Oct-2019 17:08:59 Transfer Time: .2 s - Transfer Rate: 87.0 KB/s
02-Oct-2019 17:08:59 Uploading /opt/bamboo-home/xml-data/build-dir/GRECLIPSE-E410-JOB1/Site-org.codehaus.groovy.eclipse/target/site/features/org.codehaus.groovy.eclipse.feature_3.6.0.v201910021537-e1812.jar (14.9 KB) to s3://dist.springsource.org/snapshot/GRECLIPSE/e4.10/features/org.codehaus.groovy.eclipse.feature_3.6.0.v201910021537-e1812.jar
02-Oct-2019 17:09:00 Transfer Time: .2 s - Transfer Rate: 70.3 KB/s
02-Oct-2019 17:09:00 Uploading /opt/bamboo-home/xml-data/build-dir/GRECLIPSE-E410-JOB1/Site-org.codehaus.groovy.eclipse/target/site/features/org.codehaus.groovy.headless.feature_3.6.0.v201910021537-e1812.jar (14.9 KB) to s3://dist.springsource.org/snapshot/GRECLIPSE/e4.10/features/org.codehaus.groovy.headless.feature_3.6.0.v201910021537-e1812.jar
02-Oct-2019 17:09:00 Transfer Time: .2 s - Transfer Rate: 87.7 KB/s
02-Oct-2019 17:09:01 Uploading /opt/bamboo-home/xml-data/build-dir/GRECLIPSE-E410-JOB1/Site-org.codehaus.groovy.eclipse/target/site/features/org.codehaus.groovy.jdt.patch_3.6.0.v201910021537-e1812.jar (9.3 KB) to s3://dist.springsource.org/snapshot/GRECLIPSE/e4.10/features/org.codehaus.groovy.jdt.patch_3.6.0.v201910021537-e1812.jar
02-Oct-2019 17:09:01 Transfer Time: .3 s - Transfer Rate: 34.0 KB/s
02-Oct-2019 17:09:01 Uploading /opt/bamboo-home/xml-data/build-dir/GRECLIPSE-E410-JOB1/Site-org.codehaus.groovy.eclipse/target/site/features/org.codehaus.groovy.m2eclipse.feature_3.6.0.v201910021537-e1812.jar (14.9 KB) to s3://dist.springsource.org/snapshot/GRECLIPSE/e4.10/features/org.codehaus.groovy.m2eclipse.feature_3.6.0.v201910021537-e1812.jar
02-Oct-2019 17:09:02 Transfer Time: .2 s - Transfer Rate: 75.2 KB/s
02-Oct-2019 17:09:02 Uploading /opt/bamboo-home/xml-data/build-dir/GRECLIPSE-E410-JOB1/Site-org.codehaus.groovy.eclipse/target/site/features/org.codehaus.groovy24.feature_3.6.0.v201910021537-e1812.jar (14.8 KB) to s3://dist.springsource.org/snapshot/GRECLIPSE/e4.10/features/org.codehaus.groovy24.feature_3.6.0.v201910021537-e1812.jar
02-Oct-2019 17:09:02 Transfer Time: .2 s - Transfer Rate: 88.9 KB/s
02-Oct-2019 17:09:02 Uploading /opt/bamboo-home/xml-data/build-dir/GRECLIPSE-E410-JOB1/Site-org.codehaus.groovy.eclipse/target/site/features/org.codehaus.groovy25.feature_3.6.0.v201910021537-e1812.jar (14.8 KB) to s3://dist.springsource.org/snapshot/GRECLIPSE/e4.10/features/org.codehaus.groovy25.feature_3.6.0.v201910021537-e1812.jar
02-Oct-2019 17:09:03 Transfer Time: .2 s - Transfer Rate: 76.8 KB/s
02-Oct-2019 17:09:03 Uploading /opt/bamboo-home/xml-data/build-dir/GRECLIPSE-E410-JOB1/Site-org.codehaus.groovy.eclipse/target/site/features/org.codehaus.groovy30.feature_3.6.0.v201910021537-e1812.jar (14.8 KB) to s3://dist.springsource.org/snapshot/GRECLIPSE/e4.10/features/org.codehaus.groovy30.feature_3.6.0.v201910021537-e1812.jar
02-Oct-2019 17:09:03 Transfer Time: .2 s - Transfer Rate: 78.9 KB/s
02-Oct-2019 17:09:04 Uploading /opt/bamboo-home/xml-data/build-dir/GRECLIPSE-E410-JOB1/Site-org.codehaus.groovy.eclipse/target/site/plugins/org.codehaus.groovy.eclipse.ant_3.6.0.v201910021537-e1812.jar (11.5 KB) to s3://dist.springsource.org/snapshot/GRECLIPSE/e4.10/plugins/org.codehaus.groovy.eclipse.ant_3.6.0.v201910021537-e1812.jar
02-Oct-2019 17:09:04 Transfer Time: .2 s - Transfer Rate: 60.3 KB/s
02-Oct-2019 17:09:04 Uploading /opt/bamboo-home/xml-data/build-dir/GRECLIPSE-E410-JOB1/Site-org.codehaus.groovy.eclipse/target/site/plugins/org.codehaus.groovy.eclipse.astviews_3.6.0.v201910021537-e1812.jar (79.2 KB) to s3://dist.springsource.org/snapshot/GRECLIPSE/e4.10/plugins/org.codehaus.groovy.eclipse.astviews_3.6.0.v201910021537-e1812.jar
02-Oct-2019 17:09:05 Transfer Time: .3 s - Transfer Rate: 258.7 KB/s
02-Oct-2019 17:09:05 Uploading /opt/bamboo-home/xml-data/build-dir/GRECLIPSE-E410-JOB1/Site-org.codehaus.groovy.eclipse/target/site/plugins/org.codehaus.groovy.eclipse.codeassist_3.6.0.v201910021537-e1812.jar (273.6 KB) to s3://dist.springsource.org/snapshot/GRECLIPSE/e4.10/plugins/org.codehaus.groovy.eclipse.codeassist_3.6.0.v201910021537-e1812.jar
02-Oct-2019 17:09:05 Transfer Time: .3 s - Transfer Rate: 1.0 MB/s
02-Oct-2019 17:09:06 Uploading /opt/bamboo-home/xml-data/build-dir/GRECLIPSE-E410-JOB1/Site-org.codehaus.groovy.eclipse/target/site/plugins/org.codehaus.groovy.eclipse.codebrowsing_3.6.0.v201910021537-e1812.jar (86.8 KB) to s3://dist.springsource.org/snapshot/GRECLIPSE/e4.10/plugins/org.codehaus.groovy.eclipse.codebrowsing_3.6.0.v201910021537-e1812.jar
02-Oct-2019 17:09:06 Transfer Time: .2 s - Transfer Rate: 479.3 KB/s
02-Oct-2019 17:09:06 Uploading /opt/bamboo-home/xml-data/build-dir/GRECLIPSE-E410-JOB1/Site-org.codehaus.groovy.eclipse/target/site/plugins/org.codehaus.groovy.eclipse.compilerResolver_3.6.0.v201910021537-e1812.jar (20.4 KB) to s3://dist.springsource.org/snapshot/GRECLIPSE/e4.10/plugins/org.codehaus.groovy.eclipse.compilerResolver_3.6.0.v201910021537-e1812.jar
02-Oct-2019 17:09:07 Transfer Time: .3 s - Transfer Rate: 81.0 KB/s
02-Oct-2019 17:09:07 Uploading /opt/bamboo-home/xml-data/build-dir/GRECLIPSE-E410-JOB1/Site-org.codehaus.groovy.eclipse/target/site/plugins/org.codehaus.groovy.eclipse.core_3.6.0.v201910021537-e1812.jar (83.3 KB) to s3://dist.springsource.org/snapshot/GRECLIPSE/e4.10/plugins/org.codehaus.groovy.eclipse.core_3.6.0.v201910021537-e1812.jar
02-Oct-2019 17:09:07 Transfer Time: .2 s - Transfer Rate: 349.8 KB/s
02-Oct-2019 17:09:08 Uploading /opt/bamboo-home/xml-data/build-dir/GRECLIPSE-E410-JOB1/Site-org.codehaus.groovy.eclipse/target/site/plugins/org.codehaus.groovy.eclipse.dsl_3.6.0.v201910021537-e1812.jar (395.7 KB) to s3://dist.springsource.org/snapshot/GRECLIPSE/e4.10/plugins/org.codehaus.groovy.eclipse.dsl_3.6.0.v201910021537-e1812.jar
02-Oct-2019 17:09:08 Transfer Time: .3 s - Transfer Rate: 1.1 MB/s
02-Oct-2019 17:09:08 Uploading /opt/bamboo-home/xml-data/build-dir/GRECLIPSE-E410-JOB1/Site-org.codehaus.groovy.eclipse/target/site/plugins/org.codehaus.groovy.eclipse.quickfix_3.6.0.v201910021537-e1812.jar (110.1 KB) to s3://dist.springsource.org/snapshot/GRECLIPSE/e4.10/plugins/org.codehaus.groovy.eclipse.quickfix_3.6.0.v201910021537-e1812.jar
02-Oct-2019 17:09:09 Transfer Time: .2 s - Transfer Rate: 547.9 KB/s
02-Oct-2019 17:09:09 Uploading /opt/bamboo-home/xml-data/build-dir/GRECLIPSE-E410-JOB1/Site-org.codehaus.groovy.eclipse/target/site/plugins/org.codehaus.groovy.eclipse.refactoring_3.6.0.v201910021537-e1812.jar (271.9 KB) to s3://dist.springsource.org/snapshot/GRECLIPSE/e4.10/plugins/org.codehaus.groovy.eclipse.refactoring_3.6.0.v201910021537-e1812.jar
02-Oct-2019 17:09:09 Transfer Time: .4 s - Transfer Rate: 616.5 KB/s
02-Oct-2019 17:09:10 Uploading /opt/bamboo-home/xml-data/build-dir/GRECLIPSE-E410-JOB1/Site-org.codehaus.groovy.eclipse/target/site/plugins/org.codehaus.groovy.eclipse.ui_3.6.0.v201910021537-e1812.jar (552.1 KB) to s3://dist.springsource.org/snapshot/GRECLIPSE/e4.10/plugins/org.codehaus.groovy.eclipse.ui_3.6.0.v201910021537-e1812.jar
02-Oct-2019 17:09:10 Transfer Time: .3 s - Transfer Rate: 1.9 MB/s
02-Oct-2019 17:09:10 Uploading /opt/bamboo-home/xml-data/build-dir/GRECLIPSE-E410-JOB1/Site-org.codehaus.groovy.eclipse/target/site/plugins/org.codehaus.groovy.eclipse_3.6.0.v201910021537-e1812.jar (16.7 KB) to s3://dist.springsource.org/snapshot/GRECLIPSE/e4.10/plugins/org.codehaus.groovy.eclipse_3.6.0.v201910021537-e1812.jar
02-Oct-2019 17:09:11 Transfer Time: .2 s - Transfer Rate: 85.1 KB/s
02-Oct-2019 17:09:11 Uploading /opt/bamboo-home/xml-data/build-dir/GRECLIPSE-E410-JOB1/Site-org.codehaus.groovy.eclipse/target/site/plugins/org.codehaus.groovy.m2eclipse_3.6.0.v201910021537-e1812.jar (17.9 KB) to s3://dist.springsource.org/snapshot/GRECLIPSE/e4.10/plugins/org.codehaus.groovy.m2eclipse_3.6.0.v201910021537-e1812.jar
02-Oct-2019 17:09:11 Transfer Time: .2 s - Transfer Rate: 94.7 KB/s
02-Oct-2019 17:09:12 Uploading /opt/bamboo-home/xml-data/build-dir/GRECLIPSE-E410-JOB1/Site-org.codehaus.groovy.eclipse/target/site/plugins/org.codehaus.groovy_2.4.17.v201910021537-e1812.jar (18.8 MB) to s3://dist.springsource.org/snapshot/GRECLIPSE/e4.10/plugins/org.codehaus.groovy_2.4.17.v201910021537-e1812.jar
02-Oct-2019 17:09:13 Transfer Time: .9 s - Transfer Rate: 21.7 MB/s
02-Oct-2019 17:09:13 Uploading /opt/bamboo-home/xml-data/build-dir/GRECLIPSE-E410-JOB1/Site-org.codehaus.groovy.eclipse/target/site/plugins/org.codehaus.groovy_2.5.8.v201910021537-e1812.jar (17.7 MB) to s3://dist.springsource.org/snapshot/GRECLIPSE/e4.10/plugins/org.codehaus.groovy_2.5.8.v201910021537-e1812.jar
02-Oct-2019 17:09:14 Transfer Time: .7 s - Transfer Rate: 23.9 MB/s
02-Oct-2019 17:09:14 Uploading /opt/bamboo-home/xml-data/build-dir/GRECLIPSE-E410-JOB1/Site-org.codehaus.groovy.eclipse/target/site/plugins/org.codehaus.groovy_3.0.0.v201910021537-e1812.jar (21.6 MB) to s3://dist.springsource.org/snapshot/GRECLIPSE/e4.10/plugins/org.codehaus.groovy_3.0.0.v201910021537-e1812.jar
02-Oct-2019 17:09:15 Transfer Time: 1.0 s - Transfer Rate: 22.7 MB/s
02-Oct-2019 17:09:16 Uploading /opt/bamboo-home/xml-data/build-dir/GRECLIPSE-E410-JOB1/Site-org.codehaus.groovy.eclipse/target/site/plugins/org.eclipse.jdt.core_3.16.0.v201910021537-e1812.jar (6.6 MB) to s3://dist.springsource.org/snapshot/GRECLIPSE/e4.10/plugins/org.eclipse.jdt.core_3.16.0.v201910021537-e1812.jar
02-Oct-2019 17:09:16 Transfer Time: .4 s - Transfer Rate: 14.9 MB/s
02-Oct-2019 17:09:16 Uploading /opt/bamboo-home/xml-data/build-dir/GRECLIPSE-E410-JOB1/Site-org.codehaus.groovy.eclipse/target/site/plugins/org.eclipse.jdt.groovy.core_3.6.0.v201910021537-e1812.jar (458.1 KB) to s3://dist.springsource.org/snapshot/GRECLIPSE/e4.10/plugins/org.eclipse.jdt.groovy.core_3.6.0.v201910021537-e1812.jar
02-Oct-2019 17:09:17 Transfer Time: .3 s - Transfer Rate: 1.6 MB/s
02-Oct-2019 17:09:17 Uploading /opt/bamboo-home/xml-data/build-dir/GRECLIPSE-E410-JOB1/Site-org.codehaus.groovy.eclipse/target/site/site.xml (2.8 KB) to s3://dist.springsource.org/snapshot/GRECLIPSE/e4.10/site.xml
02-Oct-2019 17:09:17 Transfer Time: .2 s - Transfer Rate: 17.0 KB/s
02-Oct-2019 17:09:17 Uploading /opt/bamboo-home/xml-data/build-dir/GRECLIPSE-E410-JOB1/Site-org.codehaus.groovy.eclipse/target/org.codehaus.groovy-3.6.0.v201910021537-e1812-updatesite.zip (66.7 MB) to s3://dist.springsource.org/snapshot/GRECLIPSE/e4.10/org.codehaus.groovy-3.6.0.v201910021537-e1812-updatesite.zip
02-Oct-2019 17:09:20 Transfer Time: 2.2 s - Transfer Rate: 30.4 MB/s
02-Oct-2019 17:09:20 Uploading /opt/bamboo-home/xml-data/build-dir/GRECLIPSE-E410-JOB1/Site-org.codehaus.groovy.eclipse/target/org.codehaus.groovy-3.6.0.v201910021537-e1812-updatesite.zip.md5 (.0 KB) to s3://dist.springsource.org/snapshot/GRECLIPSE/e4.10/org.codehaus.groovy-3.6.0.v201910021537-e1812-updatesite.zip.md5
02-Oct-2019 17:09:20 Transfer Time: .2 s - Transfer Rate: .2 KB/s
02-Oct-2019 17:09:20 Uploading /opt/bamboo-home/xml-data/build-dir/GRECLIPSE-E410-JOB1/Site-org.codehaus.groovy.eclipse/target/org.codehaus.groovy-3.6.0.v201910021537-e1812-updatesite.zip.sha1 (.0 KB) to s3://dist.springsource.org/snapshot/GRECLIPSE/e4.10/org.codehaus.groovy-3.6.0.v201910021537-e1812-updatesite.zip.sha1
02-Oct-2019 17:09:21 Transfer Time: .2 s - Transfer Rate: .2 KB/s
02-Oct-2019 17:09:21 [INFO] Executed tasks
02-Oct-2019 17:09:21 [INFO] ------------------------------------------------------------------------
02-Oct-2019 17:09:21 [INFO] Reactor Summary:
02-Oct-2019 17:09:21 [INFO]
02-Oct-2019 17:09:21 [INFO] org.codehaus.groovy.eclipse.parent ................. SUCCESS [  0.197 s]
02-Oct-2019 17:09:21 [INFO] org.codehaus.groovy ................................ SUCCESS [  5.683 s]
02-Oct-2019 17:09:21 [INFO] org.codehaus.groovy ................................ SUCCESS [  3.488 s]
02-Oct-2019 17:09:21 [INFO] org.codehaus.groovy ................................ SUCCESS [  4.139 s]
02-Oct-2019 17:09:21 [INFO] org.codehaus.groovy.eclipse.compilerResolver ....... SUCCESS [  0.860 s]
02-Oct-2019 17:09:21 [INFO] org.eclipse.jdt.core ............................... SUCCESS [  9.498 s]
02-Oct-2019 17:09:21 [INFO] org.eclipse.jdt.groovy.core ........................ SUCCESS [  1.589 s]
02-Oct-2019 17:09:21 [INFO] org.codehaus.groovy.eclipse ........................ SUCCESS [  0.359 s]
02-Oct-2019 17:09:21 [INFO] org.codehaus.groovy.eclipse.core ................... SUCCESS [  1.118 s]
02-Oct-2019 17:09:21 [INFO] org.codehaus.groovy.eclipse.ant .................... SUCCESS [  0.854 s]
02-Oct-2019 17:09:21 [INFO] org.codehaus.groovy.eclipse.codebrowsing ........... SUCCESS [  1.104 s]
02-Oct-2019 17:09:21 [INFO] org.codehaus.groovy.eclipse.refactoring ............ SUCCESS [  1.315 s]
02-Oct-2019 17:09:21 [INFO] org.codehaus.groovy.eclipse.ui ..................... SUCCESS [  1.740 s]
02-Oct-2019 17:09:21 [INFO] org.codehaus.groovy.eclipse.astviews ............... SUCCESS [  2.564 s]
02-Oct-2019 17:09:21 [INFO] org.codehaus.groovy.eclipse.codeassist ............. SUCCESS [  1.462 s]
02-Oct-2019 17:09:21 [INFO] org.codehaus.groovy.eclipse.dsl .................... SUCCESS [  1.517 s]
02-Oct-2019 17:09:21 [INFO] org.codehaus.groovy.eclipse.quickfix ............... SUCCESS [  1.262 s]
02-Oct-2019 17:09:21 [INFO] org.codehaus.groovy24.feature ...................... SUCCESS [  0.471 s]
02-Oct-2019 17:09:21 [INFO] org.codehaus.groovy25.feature ...................... SUCCESS [  0.501 s]
02-Oct-2019 17:09:21 [INFO] org.codehaus.groovy30.feature ...................... SUCCESS [  0.442 s]
02-Oct-2019 17:09:21 [INFO] org.codehaus.groovy.jdt.patch ...................... SUCCESS [  0.394 s]
02-Oct-2019 17:09:21 [INFO] org.codehaus.groovy.headless.feature ............... SUCCESS [  0.538 s]
02-Oct-2019 17:09:21 [INFO] org.codehaus.groovy.compilerless.feature ........... SUCCESS [  0.641 s]
02-Oct-2019 17:09:21 [INFO] org.codehaus.groovy.eclipse.feature ................ SUCCESS [  0.428 s]
02-Oct-2019 17:09:21 [INFO] org.eclipse.jdt.core.tests.compiler ................ SUCCESS [  4.474 s]
02-Oct-2019 17:09:21 [INFO] org.eclipse.jdt.core.tests.builder ................. SUCCESS [  1.064 s]
02-Oct-2019 17:09:21 [INFO] org.eclipse.jdt.groovy.core.tests.compiler ......... SUCCESS [  0.892 s]
02-Oct-2019 17:09:21 [INFO] org.eclipse.jdt.groovy.core.tests.builder .......... SUCCESS [  1.307 s]
02-Oct-2019 17:09:21 [INFO] org.codehaus.groovy.eclipse.tests .................. SUCCESS [  2.657 s]
02-Oct-2019 17:09:21 [INFO] org.codehaus.groovy.eclipse.codeassist.test ........ SUCCESS [  1.799 s]
02-Oct-2019 17:09:21 [INFO] org.codehaus.groovy.eclipse.codebrowsing.test ...... SUCCESS [  1.466 s]
02-Oct-2019 17:09:21 [INFO] org.codehaus.groovy.eclipse.core.test .............. SUCCESS [  1.182 s]
02-Oct-2019 17:09:21 [INFO] org.codehaus.groovy.eclipse.dsl.tests .............. SUCCESS [  1.542 s]
02-Oct-2019 17:09:21 [INFO] org.codehaus.groovy.eclipse.junit.test ............. SUCCESS [  1.008 s]
02-Oct-2019 17:09:21 [INFO] org.codehaus.groovy.eclipse.refactoring.test ....... SUCCESS [  2.058 s]
02-Oct-2019 17:09:21 [INFO] org.codehaus.groovy.eclipse.quickfix.test .......... SUCCESS [  1.317 s]
02-Oct-2019 17:09:21 [INFO] org.codehaus.groovy.alltests ....................... SUCCESS [  01:30 h]
02-Oct-2019 17:09:21 [INFO] org.codehaus.groovy.m2eclipse ...................... SUCCESS [  0.828 s]
02-Oct-2019 17:09:21 [INFO] org.codehaus.groovy.m2eclipse.feature .............. SUCCESS [  0.451 s]
02-Oct-2019 17:09:21 [INFO] org.codehaus.groovy.eclipse.site ................... SUCCESS [ 34.155 s]
02-Oct-2019 17:09:21 [INFO] ------------------------------------------------------------------------
02-Oct-2019 17:09:21 [INFO] BUILD SUCCESS
02-Oct-2019 17:09:21 [INFO] ------------------------------------------------------------------------
02-Oct-2019 17:09:21 [INFO] Total time: 01:32 h
02-Oct-2019 17:09:21 [INFO] Finished at: 2019-10-02T17:09:21+00:00
02-Oct-2019 17:09:21 [INFO] Final Memory: 175M/1533M
02-Oct-2019 17:09:21 [INFO] ------------------------------------------------------------------------
02-Oct-2019 17:09:21 [WARNING] The requested profile "snapshot" could not be activated because it does not exist.
02-Oct-2019 17:09:22 Parsing test results under /opt/bamboo-home/xml-data/build-dir/GRECLIPSE-E410-JOB1...
02-Oct-2019 17:09:22 Failing task since 10 failing test cases were found.
02-Oct-2019 17:09:22 Finished task 'Maven 3.x' with result: Failed
02-Oct-2019 17:09:22 Running post build plugin 'Docker Container Cleanup'
02-Oct-2019 17:09:22 Running post build plugin 'NCover Results Collector'
02-Oct-2019 17:09:22 Running post build plugin 'Artifactory Release Management Staging'
02-Oct-2019 17:09:22 Running post build plugin 'Artifactory Build Info Copier'
02-Oct-2019 17:09:22 Running post build plugin 'Artifactory Gradle Properties Info Copier'
02-Oct-2019 17:09:22 Running post build plugin 'Clover Results Collector'
02-Oct-2019 17:09:22 Running post build plugin 'npm Cache Cleanup'
02-Oct-2019 17:09:22 Running post build plugin 'Artifact Copier'
02-Oct-2019 17:09:22 Publishing an artifact: surefire-reports
02-Oct-2019 17:09:23 Finished publishing of artifact Non required job artifact: [surefire-reports], pattern: [**/target/TEST-*.xml] in 640.1 ms
02-Oct-2019 17:09:23 Publishing an artifact: Zipped Update Site
02-Oct-2019 17:09:23 Finished publishing of artifact Non required job artifact: [Zipped Update Site], pattern: [**/*updatesite.zip] anchored at: [Site-org.codehaus.groovy.eclipse/target/site] in 8.353 ms
02-Oct-2019 17:09:23 Successfully removed working directory at '/opt/bamboo-home/xml-data/build-dir/GRECLIPSE-E410-JOB1'
02-Oct-2019 17:09:23 Finalising the build...
02-Oct-2019 17:09:23 Stopping timer.
02-Oct-2019 17:09:23 Build GRECLIPSE-E410-JOB1-374 completed.
02-Oct-2019 17:09:24 Running on server: post build plugin 'NCover Results Collector'
02-Oct-2019 17:09:24 Running on server: post build plugin 'Build Hanging Detection Configuration'
02-Oct-2019 17:09:24 Running on server: post build plugin 'Bamboo project link creator'
02-Oct-2019 17:09:24 Running on server: post build plugin 'Clover Delta Calculator'
02-Oct-2019 17:09:24 Running on server: post build plugin 'Maven Dependencies Postprocessor'
02-Oct-2019 17:09:24 All post build plugins have finished
02-Oct-2019 17:09:24 Generating build results summary...
02-Oct-2019 17:09:25 Saving build results to disk...
02-Oct-2019 17:09:25 Logging substituted variables...
02-Oct-2019 17:09:25 Indexing build results...
02-Oct-2019 17:09:25 Finished building GRECLIPSE-E410-JOB1-374.