Build: #374 failed

Job: Default Job failed

Stages & jobs

  1. Default Stage

Test results

  • 6,030 tests in total
  • 10 tests failed
  • 9 failures are new
  • 7 tests were fixed
  • 111 tests were quarantined / skipped
  • 87 minutes taken in total.

Build 374 has the following 10 errors: 9 new failure(s) occurred since the previous build.

New test failures 9
Status Test Duration
Collapse Failed BinarySearchTests testClassDecl2 History
1 sec
java.lang.AssertionError: Expecting 4 matches, but found 0

java.lang.AssertionError: 
Expecting 4 matches, but found 0

	at org.eclipse.jdt.core.groovy.tests.search.BinarySearchTests.assertMatches(BinarySearchTests.java:139)
	at org.eclipse.jdt.core.groovy.tests.search.BinarySearchTests.testClassDecl2(BinarySearchTests.java:172)
Collapse Failed BinarySearchTests testFieldRefInInitializer History
1 sec
java.lang.AssertionError: Expecting 1 matches, but found 0

java.lang.AssertionError: 
Expecting 1 matches, but found 0

	at org.eclipse.jdt.core.groovy.tests.search.BinarySearchTests.assertMatches(BinarySearchTests.java:139)
	at org.eclipse.jdt.core.groovy.tests.search.BinarySearchTests.testFieldRefInInitializer(BinarySearchTests.java:208)
Collapse Failed ConstructorReferenceSearchTests testConstructorReferences10 History
< 1 sec
java.lang.AssertionError: expected:<1> but was:<0>
	at org.eclipse.jdt.core.groovy.tests.search.ConstructorReferenceSearchTests.testConstructorReferences10(ConstructorReferenceSearchTests.java:258)
Collapse Failed ConstructorReferenceSearchTests testConstructorReferences3 History
< 1 sec
java.lang.AssertionError: expected:<3> but was:<0>
	at org.eclipse.jdt.core.groovy.tests.search.ConstructorReferenceSearchTests.testConstructorReferences3(ConstructorReferenceSearchTests.java:126)
Collapse Failed ConstructorReferenceSearchTests testConstructorReferences6 History
< 1 sec
java.lang.AssertionError: expected:<2> but was:<0>
	at org.eclipse.jdt.core.groovy.tests.search.ConstructorReferenceSearchTests.testConstructorReferences6(ConstructorReferenceSearchTests.java:180)
Collapse Failed ConstructorReferenceSearchTests testNewifyConstructorReferences2 History
< 1 sec
java.lang.AssertionError: expected:<2> but was:<0>
	at org.eclipse.jdt.core.groovy.tests.search.ConstructorReferenceSearchTests.testNewifyConstructorReferences2(ConstructorReferenceSearchTests.java:408)
Collapse Failed DGMInferencingTests testDGMClosure3 History
< 1 sec
java.lang.AssertionError: Expected type not found.
Expected: java.lang.String
Found: java.lang.Object
Declaring type: groovy.lang.Closure<V extends java.lang.Object>
ASTNode: org.codehaus.groovy.ast.expr.VariableExpression@ebcdb[variable: it]
Confidence: INFERRED

java.lang.AssertionError: 
(9 more lines...)
Collapse Failed MethodReferenceSearchTests testExplicitPropertySetterSearch2 History
< 1 sec
java.lang.AssertionError: expected:<5> but was:<0>
	at org.eclipse.jdt.core.groovy.tests.search.MethodReferenceSearchTests.testExplicitPropertySetterSearch2(MethodReferenceSearchTests.java:594)
Collapse Failed MethodReferenceSearchTests testMethodWithDefaultParameters3 History
< 1 sec
java.lang.AssertionError: expected:<2> but was:<0>
	at org.eclipse.jdt.core.groovy.tests.search.MethodReferenceSearchTests.testMethodWithDefaultParameters3(MethodReferenceSearchTests.java:369)
Existing test failures 1
Status Test Failing since Duration
junit.framework.ComparisonFailure: 
----------- Expected ------------

------------ but was ------------
Problem : The import util.MyException is never used [ resource : </Project/src/p/Test.java> range : <18,34> category : <120> severity : <1>]

--------- Difference is ----------
 expected:<[]> but was:<[Problem : The import util.MyException is never used [ resource : </Project/src/p/Test.java> range : <18,34> category : <120> severity : <1>]
(12 more lines...)