Build: #378 failed

Job: Default Job failed

Stages & jobs

  1. Default Stage

Job result summary

Completed
Duration
92 minutes
Agent
bamboo-20.af.pivotal.io
Revision
208dcfaeb862bdc7f8237802cc7f5a8650579c4e 208dcfaeb862bdc7f8237802cc7f5a8650579c4e
Total tests
6038
Failing since
#369 (Code changes detected – )

Tests

  • 6,038 tests in total
  • 10 tests failed
  • 9 failures are new
  • 5 tests were fixed
  • 111 tests were quarantined / skipped
  • 87 minutes taken in total.
New test failures 9
Status Test Duration
Collapse Failed BasicGroovyBuildTests testProjectBasedirAsOutputLocation History
< 1 sec
org.junit.ComparisonFailure: unexpected recompiled units. lenExpected=1 lenActual=2 expected:<{p.Script[]}> but was:<{p.Script[,p.Script]}>
	at org.eclipse.jdt.core.groovy.tests.builder.BasicGroovyBuildTests.testProjectBasedirAsOutputLocation(BasicGroovyBuildTests.java:274)
Collapse Failed ClosureInferencingTests testClosure16 History
< 1 sec
java.lang.AssertionError: Expected type not found.
Expected: C
Found: java.lang.Object
Declaring type: B
ASTNode: org.codehaus.groovy.ast.expr.VariableExpression@11d5c2[variable: xxx]
Confidence: UNKNOWN

java.lang.AssertionError: 
(8 more lines...)
Collapse Failed ClosureInferencingTests testWithAndClosure6 History
< 1 sec
java.lang.AssertionError: Expected declaring type not found.
 Expected: p.A
 Found type: java.lang.String
 Found declaring type: java.lang.Object
 ASTNode: org.codehaus.groovy.ast.expr.ConstantExpression@1146f6[foo]
java.lang.AssertionError: 
Expected declaring type not found.
	Expected: p.A
(4 more lines...)
Collapse Failed DGMInferencingTests testDGM17 History
< 1 sec
java.lang.AssertionError: Expected type not found.
Expected: java.lang.Integer
Found: java.lang.Object
Declaring type: Search
ASTNode: org.codehaus.groovy.ast.expr.VariableExpression@f6236[variable: value]
Confidence: INFERRED

java.lang.AssertionError: 
(9 more lines...)
Collapse Failed DGMInferencingTests testDGM23 History
< 1 sec
java.lang.AssertionError: Expected type not found.
Expected: java.lang.String
Found: java.lang.Object
Declaring type: Search
ASTNode: org.codehaus.groovy.ast.expr.VariableExpression@f2252[variable: key]
Confidence: INFERRED

java.lang.AssertionError: 
(9 more lines...)
Collapse Failed DGMInferencingTests testDGM8 History
< 1 sec
java.lang.AssertionError: Expected type not found.
Expected: java.lang.Integer
Found: java.lang.Object
Declaring type: Search
ASTNode: org.codehaus.groovy.ast.expr.VariableExpression@f4426[variable: value]
Confidence: INFERRED

java.lang.AssertionError: 
(9 more lines...)
Collapse Failed DGMInferencingTests testDGMDeclaring3 History
< 1 sec
java.lang.AssertionError: Expected declaring type not found.
 Expected: org.codehaus.groovy.runtime.IOGroovyMethods
 Found type: java.lang.String
 Found declaring type: java.io.Writer
 ASTNode: org.codehaus.groovy.ast.expr.ConstantExpression@f0bcc[leftShift]
java.lang.AssertionError: 
Expected declaring type not found.
	Expected: org.codehaus.groovy.runtime.IOGroovyMethods
(5 more lines...)
Collapse Failed DGMInferencingTests testStaticMixinDGM History
< 1 sec
java.lang.AssertionError: Expected declaring type not found.
 Expected: org.codehaus.groovy.runtime.DefaultGroovyMethods
 Found type: java.lang.String
 Found declaring type: java.lang.String
 ASTNode: org.codehaus.groovy.ast.expr.ConstantExpression@10f08a[mixin]
java.lang.AssertionError: 
Expected declaring type not found.
	Expected: org.codehaus.groovy.runtime.DefaultGroovyMethods
(5 more lines...)
Collapse Failed OperatorOverloadingInferencingTests testGetAt9 History
< 1 sec
java.lang.AssertionError: Expected type not found.
Expected: java.lang.Boolean
Found: java.util.BitSet
Declaring type: Search
ASTNode: org.codehaus.groovy.ast.expr.VariableExpression@fed3e[variable: xxx]
Confidence: INFERRED

java.lang.AssertionError: 
(8 more lines...)
Existing test failures 1
Status Test Failing since Duration
junit.framework.ComparisonFailure: 
----------- Expected ------------

------------ but was ------------
Problem : The import util.MyException is never used [ resource : </Project/src/p/Test.java> range : <18,34> category : <120> severity : <1>]

--------- Difference is ----------
 expected:<[]> but was:<[Problem : The import util.MyException is never used [ resource : </Project/src/p/Test.java> range : <18,34> category : <120> severity : <1>]
(12 more lines...)
Fixed tests 5
Status Test Failing since Duration
Successful ConstructorReferenceSearchTests testConstructorReferences13 History
Failing since build #377 (Code changes detected) < 1 sec
Successful DGMInferencingTests testDGM1 History
Failing since build #377 (Code changes detected) < 1 sec
Successful DGMInferencingTests testDGM31 History
Failing since build #377 (Code changes detected) < 1 sec
Successful DGMInferencingTests testDGM9 History
Failing since build #377 (Code changes detected) < 1 sec
Successful DGMInferencingTests testStaticWithDGM History
Failing since build #377 (Code changes detected) < 1 sec

Error summary

The build generated some errors. See the full build log for more details.

Waiting for: Updating index names
Waiting for: Java indexing... 17 files to index (/opt/jdk8u212-b03/jre/lib/rt.jar)
Waiting for: Java indexing... 18 files to index (/opt/jdk8u212-b03/jre/lib/rt.jar)
Waiting for: Java indexing... 18 files to index (/opt/jdk8u212-b03/jre/lib/rt.jar)
Waiting for: Java indexing... 20 files to index (/opt/jdk8u212-b03/jre/lib/rt.jar)
Waiting for: Java indexing... 18 files to index (/opt/jdk8u212-b03/jre/lib/rt.jar)
Waiting for: Updating index names
Waiting for: Java indexing... 17 files to index (/opt/jdk8u212-b03/jre/lib/rt.jar)
Waiting for: Java indexing... 16 files to index (/opt/jdk8u212-b03/jre/lib/rt.jar)
Waiting for: Java indexing... 18 files to index (/opt/jdk8u212-b03/jre/lib/rt.jar)
Waiting for: Updating index names
Waiting for: Java indexing... 18 files to index (/opt/jdk8u212-b03/jre/lib/rt.jar)
Waiting for: Updating index names
Waiting for: Java indexing... 25 files to index (/opt/jdk8u212-b03/jre/lib/rt.jar)
Waiting for: Updating index names
Waiting for: Java indexing... 22 files to index (/opt/jdk8u212-b03/jre/lib/rt.jar)
Waiting for: Updating index names
Waiting for: Java indexing...
Waiting for: Updating index names
Waiting for: Java indexing... 18 files to index (/opt/jdk8u212-b03/jre/lib/rt.jar)
Waiting for: Java indexing... 18 files to index (/opt/jdk8u212-b03/jre/lib/rt.jar)
Waiting for: Java indexing... 18 files to index (/opt/jdk8u212-b03/jre/lib/rt.jar)
Waiting for: Java indexing... 15 files to index (/opt/jdk8u212-b03/jre/lib/rt.jar)
Waiting for: Java indexing... 16 files to index (/opt/jdk8u212-b03/jre/lib/rt.jar)
Waiting for: Java indexing... 17 files to index (/opt/jdk8u212-b03/jre/lib/rt.jar)
Waiting for: Java indexing... 18 files to index (/opt/jdk8u212-b03/jre/lib/rt.jar)
Waiting for: Java indexing... 18 files to index (/opt/jdk8u212-b03/jre/lib/rt.jar)
Waiting for: Java indexing... 18 files to index (/opt/jdk8u212-b03/jre/lib/rt.jar)
Waiting for: Java indexing... 16 files to index (/opt/jdk8u212-b03/jre/lib/rt.jar)
Waiting for: Java indexing...
Waiting for: Updating index names
Waiting for: Java indexing... 19 files to index (/opt/jdk8u212-b03/jre/lib/rt.jar)
Waiting for: Updating index names
Waiting for: Java indexing... 21 files to index (/Project)
Waiting for: Java indexing... 15 files to index (/opt/jdk8u212-b03/jre/lib/rt.jar)
Waiting for: Java indexing... 18 files to index (/opt/jdk8u212-b03/jre/lib/rt.jar)
Waiting for: Java indexing... 16 files to index (/opt/jdk8u212-b03/jre/lib/rt.jar)
Waiting for: Java indexing... 16 files to index (/opt/jdk8u212-b03/jre/lib/rt.jar)
Waiting for: Java indexing... 18 files to index (/opt/jdk8u212-b03/jre/lib/rt.jar)
Waiting for: Java indexing...
Waiting for: Java indexing... 16 files to index (/opt/jdk8u212-b03/jre/lib/rt.jar)
Waiting for: Java indexing... 18 files to index (/opt/jdk8u212-b03/jre/lib/rt.jar)
Waiting for: Java indexing... 18 files to index (/opt/jdk8u212-b03/jre/lib/rt.jar)
Waiting for: Java indexing... 21 files to index (/Project)
Waiting for: Java indexing... 16 files to index (/opt/jdk8u212-b03/jre/lib/rt.jar)
Waiting for: Java indexing... 16 files to index (/opt/jdk8u212-b03/jre/lib/rt.jar)
Waiting for: Java indexing... 22 files to index (/opt/jdk8u212-b03/jre/lib/resources.jar)
Waiting for: Java indexing... 21 files to index (/Project)
Waiting for: Java indexing... 18 files to index (/opt/jdk8u212-b03/jre/lib/rt.jar)
Waiting for: Java indexing... 15 files to index (/opt/jdk8u212-b03/jre/lib/rt.jar)
Waiting for: Java indexing... 16 files to index (/opt/jdk8u212-b03/jre/lib/rt.jar)
Waiting for: Java indexing... 18 files to index (/opt/jdk8u212-b03/jre/lib/rt.jar)
Waiting for: Java indexing... 21 files to index (/Project)
Waiting for: Java indexing... 21 files to index (/Project)
Waiting for: Java indexing... 17 files to index (/opt/jdk8u212-b03/jre/lib/rt.jar)
Waiting for: Java indexing... 15 files to index (/opt/jdk8u212-b03/jre/lib/rt.jar)
Waiting for: Java indexing... 19 files to index (/opt/jdk8u212-b03/jre/lib/rt.jar)
Waiting for: Java indexing... 18 files to index (/opt/jdk8u212-b03/jre/lib/resources.jar)
Waiting for: Java indexing... 15 files to index (/opt/jdk8u212-b03/jre/lib/rt.jar)
Waiting for: Java indexing... 17 files to index (/opt/jdk8u212-b03/jre/lib/rt.jar)
Waiting for: Java indexing... 15 files to index (/opt/jdk8u212-b03/jre/lib/rt.jar)
Waiting for: Java indexing... 16 files to index (/opt/jdk8u212-b03/jre/lib/rt.jar)
Waiting for: Java indexing... 16 files to index (/Project)
Waiting for: Java indexing... 18 files to index (/opt/jdk8u212-b03/jre/lib/rt.jar)
Waiting for: Java indexing... 18 files to index (/opt/jdk8u212-b03/jre/lib/resources.jar)
Waiting for: Java indexing... 21 files to index (/Project)
Waiting for: Updating index names
Waiting for: Java indexing... 19 files to index (/opt/jdk8u212-b03/jre/lib/rt.jar)
Waiting for: Java indexing... 24 files to index (/Project)
Waiting for: Updating index names
Waiting for: Java indexing... 28 files to index (/Project)
Waiting for: Updating index names
Waiting for: Java indexing... 21 files to index (/Project)
Waiting for: Java indexing... 16 files to index (/opt/jdk8u212-b03/jre/lib/rt.jar)
Waiting for: Java indexing... 17 files to index (/opt/jdk8u212-b03/jre/lib/rt.jar)
Waiting for: Updating index names
Waiting for: Java indexing... 18 files to index (/opt/jdk8u212-b03/jre/lib/rt.jar)
Waiting for: Java indexing... 22 files to index (/opt/jdk8u212-b03/jre/lib/resources.jar)
Waiting for: Java indexing... 18 files to index (/opt/jdk8u212-b03/jre/lib/rt.jar)
Waiting for: Java indexing... 18 files to index (/opt/jdk8u212-b03/jre/lib/rt.jar)
Waiting for: Java indexing... 18 files to index (/opt/jdk8u212-b03/jre/lib/rt.jar)
Waiting for: Java indexing... 17 files to index (/opt/jdk8u212-b03/jre/lib/rt.jar)
Waiting for: Java indexing... 17 files to index (/opt/jdk8u212-b03/jre/lib/rt.jar)
Waiting for: Updating index names
Waiting for: Java indexing... 17 files to index (/opt/jdk8u212-b03/jre/lib/resources.jar)
Waiting for: Updating index names
Waiting for: Java indexing... 18 files to index (/opt/jdk8u212-b03/jre/lib/rt.jar)
Waiting for: Java indexing... 17 files to index (/opt/jdk8u212-b03/jre/lib/rt.jar)
Waiting for: Updating index names
Waiting for: Java indexing... 19 files to index (/opt/jdk8u212-b03/jre/lib/rt.jar)
Waiting for: Updating index names
Waiting for: Java indexing... 17 files to index (/opt/jdk8u212-b03/jre/lib/rt.jar)
Waiting for: Updating index names
Waiting for: Java indexing... 18 files to index (/opt/jdk8u212-b03/jre/lib/rt.jar)
Waiting for: Java indexing... 16 files to index (/opt/jdk8u212-b03/jre/lib/resources.jar)
Waiting for: Updating index names
Waiting for: Java indexing... 21 files to index (/Project)
Waiting for: Java indexing... 19 files to index (/Project)
Waiting for: Java indexing... 21 files to index (/Project)
Waiting for: Java indexing... 13 files to index (/opt/jdk8u212-b03/jre/lib/jce.jar)