Build: #378 failed

Job: Default Job failed

Stages & jobs

  1. Default Stage

Build log

The build generated 46,498 lines of output.The output is too long and has been truncated to the last 1,000 lines. Download or view full build log

06-Oct-2019 15:47:43 testStaticMethod11(org.eclipse.jdt.core.groovy.tests.search.GenericInferencingTests)  Time elapsed: 0.657 s
06-Oct-2019 15:47:43 testMethod1(org.eclipse.jdt.core.groovy.tests.search.GenericInferencingTests)  Time elapsed: 0.147 s
06-Oct-2019 15:47:43 testMethod2(org.eclipse.jdt.core.groovy.tests.search.GenericInferencingTests)  Time elapsed: 0.154 s
06-Oct-2019 15:47:43 testMethod3(org.eclipse.jdt.core.groovy.tests.search.GenericInferencingTests)  Time elapsed: 0.144 s
06-Oct-2019 15:47:43 testMethod4(org.eclipse.jdt.core.groovy.tests.search.GenericInferencingTests)  Time elapsed: 0.629 s
06-Oct-2019 15:47:43 testGetClass1(org.eclipse.jdt.core.groovy.tests.search.GenericInferencingTests)  Time elapsed: 0.135 s
06-Oct-2019 15:47:43 testGetClass2(org.eclipse.jdt.core.groovy.tests.search.GenericInferencingTests)  Time elapsed: 0.141 s
06-Oct-2019 15:47:43 testGetClass3(org.eclipse.jdt.core.groovy.tests.search.GenericInferencingTests)  Time elapsed: 0.136 s
06-Oct-2019 15:47:43 testCircularReference(org.eclipse.jdt.core.groovy.tests.search.GenericInferencingTests)  Time elapsed: 0.618 s
06-Oct-2019 15:47:43 testForLoop1(org.eclipse.jdt.core.groovy.tests.search.GenericInferencingTests)  Time elapsed: 0.14 s
06-Oct-2019 15:47:43 testForLoop2(org.eclipse.jdt.core.groovy.tests.search.GenericInferencingTests)  Time elapsed: 0.141 s
06-Oct-2019 15:47:43 testForLoop3(org.eclipse.jdt.core.groovy.tests.search.GenericInferencingTests)  Time elapsed: 0.136 s
06-Oct-2019 15:47:43 testForLoop4(org.eclipse.jdt.core.groovy.tests.search.GenericInferencingTests)  Time elapsed: 0.142 s
06-Oct-2019 15:47:43 testForLoop5(org.eclipse.jdt.core.groovy.tests.search.GenericInferencingTests)  Time elapsed: 0.557 s
06-Oct-2019 15:47:43 testForLoop6(org.eclipse.jdt.core.groovy.tests.search.GenericInferencingTests)  Time elapsed: 0.139 s
06-Oct-2019 15:47:43 testForLoop7(org.eclipse.jdt.core.groovy.tests.search.GenericInferencingTests)  Time elapsed: 0.144 s
06-Oct-2019 15:47:43 testForLoop8(org.eclipse.jdt.core.groovy.tests.search.GenericInferencingTests)  Time elapsed: 0.136 s
06-Oct-2019 15:47:43 testForLoop9(org.eclipse.jdt.core.groovy.tests.search.GenericInferencingTests)  Time elapsed: 0.06 s
06-Oct-2019 15:47:43 testMapOfMaps(org.eclipse.jdt.core.groovy.tests.search.GenericInferencingTests)  Time elapsed: 0.619 s
06-Oct-2019 15:47:43 testList10(org.eclipse.jdt.core.groovy.tests.search.GenericInferencingTests)  Time elapsed: 0.16 s
06-Oct-2019 15:47:43 testList11(org.eclipse.jdt.core.groovy.tests.search.GenericInferencingTests)  Time elapsed: 0.137 s
06-Oct-2019 15:47:43 testList12(org.eclipse.jdt.core.groovy.tests.search.GenericInferencingTests)  Time elapsed: 0.146 s
06-Oct-2019 15:47:43 testList13(org.eclipse.jdt.core.groovy.tests.search.GenericInferencingTests)  Time elapsed: 0.137 s
06-Oct-2019 15:47:43 testForLoop11(org.eclipse.jdt.core.groovy.tests.search.GenericInferencingTests)  Time elapsed: 0.515 s
06-Oct-2019 15:47:43 testForLoop2a(org.eclipse.jdt.core.groovy.tests.search.GenericInferencingTests)  Time elapsed: 0.597 s
06-Oct-2019 15:47:43 testRange1(org.eclipse.jdt.core.groovy.tests.search.GenericInferencingTests)  Time elapsed: 0.168 s
06-Oct-2019 15:47:43 testRange2(org.eclipse.jdt.core.groovy.tests.search.GenericInferencingTests)  Time elapsed: 0.141 s
06-Oct-2019 15:47:43 testClosure1(org.eclipse.jdt.core.groovy.tests.search.GenericInferencingTests)  Time elapsed: 0.134 s
06-Oct-2019 15:47:43 testClosure2(org.eclipse.jdt.core.groovy.tests.search.GenericInferencingTests)  Time elapsed: 0.136 s
06-Oct-2019 15:47:43 testClosure3(org.eclipse.jdt.core.groovy.tests.search.GenericInferencingTests)  Time elapsed: 0.524 s
06-Oct-2019 15:47:43 testClosure4(org.eclipse.jdt.core.groovy.tests.search.GenericInferencingTests)  Time elapsed: 0.597 s
06-Oct-2019 15:47:43 testMapOfList1(org.eclipse.jdt.core.groovy.tests.search.GenericInferencingTests)  Time elapsed: 0.166 s
06-Oct-2019 15:47:43 testMapOfList2(org.eclipse.jdt.core.groovy.tests.search.GenericInferencingTests)  Time elapsed: 0.144 s
06-Oct-2019 15:47:43 testMapOfList3(org.eclipse.jdt.core.groovy.tests.search.GenericInferencingTests)  Time elapsed: 0.144 s
06-Oct-2019 15:47:43 testMapOfList4(org.eclipse.jdt.core.groovy.tests.search.GenericInferencingTests)  Time elapsed: 0.145 s
06-Oct-2019 15:47:43 testMapOfList5(org.eclipse.jdt.core.groovy.tests.search.GenericInferencingTests)  Time elapsed: 0.499 s
06-Oct-2019 15:47:43 testMapOfList6(org.eclipse.jdt.core.groovy.tests.search.GenericInferencingTests)  Time elapsed: 0.627 s
06-Oct-2019 15:47:43 testMapOfList7(org.eclipse.jdt.core.groovy.tests.search.GenericInferencingTests)  Time elapsed: 0.174 s
06-Oct-2019 15:47:43 testGenericsMapper(org.eclipse.jdt.core.groovy.tests.search.GenericsMappingTests)  Time elapsed: 0.052 s
06-Oct-2019 15:47:43 testCompileStatic10(org.eclipse.jdt.core.groovy.tests.search.Groovy20InferencingTests)  Time elapsed: 0.149 s
06-Oct-2019 15:47:43 testCompileStatic11(org.eclipse.jdt.core.groovy.tests.search.Groovy20InferencingTests)  Time elapsed: 0.659 s
06-Oct-2019 15:47:43 testCompileStatic12(org.eclipse.jdt.core.groovy.tests.search.Groovy20InferencingTests)  Time elapsed: 0.179 s
06-Oct-2019 15:47:43 testCompileStatic13(org.eclipse.jdt.core.groovy.tests.search.Groovy20InferencingTests)  Time elapsed: 0.229 s
06-Oct-2019 15:47:43 testCompileStatic14(org.eclipse.jdt.core.groovy.tests.search.Groovy20InferencingTests)  Time elapsed: 0.66 s
06-Oct-2019 15:47:43 testCompileStatic15(org.eclipse.jdt.core.groovy.tests.search.Groovy20InferencingTests)  Time elapsed: 0.174 s
06-Oct-2019 15:47:43 testCompileStatic16(org.eclipse.jdt.core.groovy.tests.search.Groovy20InferencingTests)  Time elapsed: 0.222 s
06-Oct-2019 15:47:43 testCompileStatic17(org.eclipse.jdt.core.groovy.tests.search.Groovy20InferencingTests)  Time elapsed: 0.145 s
06-Oct-2019 15:47:43 testCompileStatic1(org.eclipse.jdt.core.groovy.tests.search.Groovy20InferencingTests)  Time elapsed: 0.555 s
06-Oct-2019 15:47:43 testCompileStatic2(org.eclipse.jdt.core.groovy.tests.search.Groovy20InferencingTests)  Time elapsed: 0.137 s
06-Oct-2019 15:47:43 testCompileStatic3(org.eclipse.jdt.core.groovy.tests.search.Groovy20InferencingTests)  Time elapsed: 0.145 s
06-Oct-2019 15:47:43 testCompileStatic4(org.eclipse.jdt.core.groovy.tests.search.Groovy20InferencingTests)  Time elapsed: 0.14 s
06-Oct-2019 15:47:43 testCompileStatic5(org.eclipse.jdt.core.groovy.tests.search.Groovy20InferencingTests)  Time elapsed: 0.142 s
06-Oct-2019 15:47:43 testCompileStatic6(org.eclipse.jdt.core.groovy.tests.search.Groovy20InferencingTests)  Time elapsed: 0.533 s
06-Oct-2019 15:47:43 testCompileStatic7(org.eclipse.jdt.core.groovy.tests.search.Groovy20InferencingTests)  Time elapsed: 0.594 s
06-Oct-2019 15:47:43 testCompileStatic8(org.eclipse.jdt.core.groovy.tests.search.Groovy20InferencingTests)  Time elapsed: 0.135 s
06-Oct-2019 15:47:43 testCompileStatic9(org.eclipse.jdt.core.groovy.tests.search.Groovy20InferencingTests)  Time elapsed: 0.144 s
06-Oct-2019 15:47:43 testTypeChecked1(org.eclipse.jdt.core.groovy.tests.search.Groovy20InferencingTests)  Time elapsed: 0.14 s
06-Oct-2019 15:47:43 testTypeChecked2(org.eclipse.jdt.core.groovy.tests.search.Groovy20InferencingTests)  Time elapsed: 0.147 s
06-Oct-2019 15:47:43 testTypeChecked3(org.eclipse.jdt.core.groovy.tests.search.Groovy20InferencingTests)  Time elapsed: 0.531 s
06-Oct-2019 15:47:43 testTypeChecked4(org.eclipse.jdt.core.groovy.tests.search.Groovy20InferencingTests)  Time elapsed: 0.597 s
06-Oct-2019 15:47:43 testTypeChecked5(org.eclipse.jdt.core.groovy.tests.search.Groovy20InferencingTests)  Time elapsed: 0.145 s
06-Oct-2019 15:47:43 testTypeChecked6(org.eclipse.jdt.core.groovy.tests.search.Groovy20InferencingTests)  Time elapsed: 0.142 s
06-Oct-2019 15:47:43 testTypeChecked7(org.eclipse.jdt.core.groovy.tests.search.Groovy20InferencingTests)  Time elapsed: 0.139 s
06-Oct-2019 15:47:43 testTypeChecked8(org.eclipse.jdt.core.groovy.tests.search.Groovy20InferencingTests)  Time elapsed: 0.149 s
06-Oct-2019 15:47:43 testDelegatesToResolveStrategy2(org.eclipse.jdt.core.groovy.tests.search.Groovy21InferencingTests)  Time elapsed: 1.073 s
06-Oct-2019 15:47:43 testDelegatesToResolveStrategy3(org.eclipse.jdt.core.groovy.tests.search.Groovy21InferencingTests)  Time elapsed: 0.218 s
06-Oct-2019 15:47:43 testDelegatesToResolveStrategy4(org.eclipse.jdt.core.groovy.tests.search.Groovy21InferencingTests)  Time elapsed: 0.208 s
06-Oct-2019 15:47:43 testDelegatesToTarget2a(org.eclipse.jdt.core.groovy.tests.search.Groovy21InferencingTests)  Time elapsed: 0.625 s
06-Oct-2019 15:47:43 testDelegatesToTypeName3a(org.eclipse.jdt.core.groovy.tests.search.Groovy21InferencingTests)  Time elapsed: 0.192 s
06-Oct-2019 15:47:43 testDelegatesToTypeName3b(org.eclipse.jdt.core.groovy.tests.search.Groovy21InferencingTests)  Time elapsed: 0.32 s
06-Oct-2019 15:47:43 testTypeCheckingExtension(org.eclipse.jdt.core.groovy.tests.search.Groovy21InferencingTests)  Time elapsed: 1.203 s
06-Oct-2019 15:47:43 testDelegatesToTarget1(org.eclipse.jdt.core.groovy.tests.search.Groovy21InferencingTests)  Time elapsed: 0.636 s
06-Oct-2019 15:47:43 testDelegatesToTarget2(org.eclipse.jdt.core.groovy.tests.search.Groovy21InferencingTests)  Time elapsed: 0.227 s
06-Oct-2019 15:47:43 testDelegatesToTarget3(org.eclipse.jdt.core.groovy.tests.search.Groovy21InferencingTests)  Time elapsed: 0.199 s
06-Oct-2019 15:47:43 testDelegatesToTarget4(org.eclipse.jdt.core.groovy.tests.search.Groovy21InferencingTests)  Time elapsed: 0.812 s
06-Oct-2019 15:47:43 testDelegatesToTarget5(org.eclipse.jdt.core.groovy.tests.search.Groovy21InferencingTests)  Time elapsed: 0.222 s
06-Oct-2019 15:47:43 testDelegatesToTarget6(org.eclipse.jdt.core.groovy.tests.search.Groovy21InferencingTests)  Time elapsed: 0.723 s
06-Oct-2019 15:47:43 testDelegatesToValue2(org.eclipse.jdt.core.groovy.tests.search.Groovy21InferencingTests)  Time elapsed: 0.146 s
06-Oct-2019 15:47:43 testDelegatesToValue3(org.eclipse.jdt.core.groovy.tests.search.Groovy21InferencingTests)  Time elapsed: 0.155 s
06-Oct-2019 15:47:43 testDelegatesToValue4(org.eclipse.jdt.core.groovy.tests.search.Groovy21InferencingTests)  Time elapsed: 0.144 s
06-Oct-2019 15:47:43 testDelegatesToValue5(org.eclipse.jdt.core.groovy.tests.search.Groovy21InferencingTests)  Time elapsed: 0.159 s
06-Oct-2019 15:47:43 testDelegatesToValue6(org.eclipse.jdt.core.groovy.tests.search.Groovy21InferencingTests)  Time elapsed: 0.528 s
06-Oct-2019 15:47:43 testDelegatesToTypeName1(org.eclipse.jdt.core.groovy.tests.search.Groovy21InferencingTests)  Time elapsed: 0.573 s
06-Oct-2019 15:47:43 testDelegatesToTypeName2(org.eclipse.jdt.core.groovy.tests.search.Groovy21InferencingTests)  Time elapsed: 0.152 s
06-Oct-2019 15:47:43 testDelegatesToTypeName3(org.eclipse.jdt.core.groovy.tests.search.Groovy21InferencingTests)  Time elapsed: 0.295 s
06-Oct-2019 15:47:43 testDelegatesToValue(org.eclipse.jdt.core.groovy.tests.search.Groovy21InferencingTests)  Time elapsed: 0.149 s
06-Oct-2019 15:47:43 testEnumOverrides(org.eclipse.jdt.core.groovy.tests.search.Groovy21InferencingTests)  Time elapsed: 0.512 s
06-Oct-2019 15:47:43 testEnumOverrides2(org.eclipse.jdt.core.groovy.tests.search.Groovy21InferencingTests)  Time elapsed: 0.639 s
06-Oct-2019 15:47:43 org.eclipse.jdt.core.groovy.tests.search.Groovy25InferencingTests skipped
06-Oct-2019 15:47:43 testFieldAndPropertyWithSameName(org.eclipse.jdt.core.groovy.tests.search.InferencingTests)  Time elapsed: 0.152 s
06-Oct-2019 15:47:43 testObjectMethodOnInterface(org.eclipse.jdt.core.groovy.tests.search.InferencingTests)  Time elapsed: 0.155 s
06-Oct-2019 15:47:43 testLocalWithInitializer1(org.eclipse.jdt.core.groovy.tests.search.InferencingTests)  Time elapsed: 0.148 s
06-Oct-2019 15:47:43 testLocalWithInitializer2(org.eclipse.jdt.core.groovy.tests.search.InferencingTests)  Time elapsed: 0.658 s
06-Oct-2019 15:47:43 testLocalWithInitializer3(org.eclipse.jdt.core.groovy.tests.search.InferencingTests)  Time elapsed: 0.146 s
06-Oct-2019 15:47:43 testLocalWithInitializer4(org.eclipse.jdt.core.groovy.tests.search.InferencingTests)  Time elapsed: 0.179 s
06-Oct-2019 15:47:43 testLocalWithInitializer5(org.eclipse.jdt.core.groovy.tests.search.InferencingTests)  Time elapsed: 0.153 s
06-Oct-2019 15:47:43 testNothingIsUnknown(org.eclipse.jdt.core.groovy.tests.search.InferencingTests)  Time elapsed: 0.146 s
06-Oct-2019 15:47:43 testInnerClass1(org.eclipse.jdt.core.groovy.tests.search.InferencingTests)  Time elapsed: 0.482 s
06-Oct-2019 15:47:43 testInnerClass2(org.eclipse.jdt.core.groovy.tests.search.InferencingTests)  Time elapsed: 0.662 s
06-Oct-2019 15:47:43 testInnerClass3(org.eclipse.jdt.core.groovy.tests.search.InferencingTests)  Time elapsed: 0.188 s
06-Oct-2019 15:47:43 testInnerClass4(org.eclipse.jdt.core.groovy.tests.search.InferencingTests)  Time elapsed: 0.164 s
06-Oct-2019 15:47:43 testInnerClass5(org.eclipse.jdt.core.groovy.tests.search.InferencingTests)  Time elapsed: 0.069 s
06-Oct-2019 15:47:43 testInnerClass6(org.eclipse.jdt.core.groovy.tests.search.InferencingTests)  Time elapsed: 0.1 s
06-Oct-2019 15:47:43 testInnerClass7(org.eclipse.jdt.core.groovy.tests.search.InferencingTests)  Time elapsed: 0.697 s
06-Oct-2019 15:47:43 testInnerClass8(org.eclipse.jdt.core.groovy.tests.search.InferencingTests)  Time elapsed: 0.272 s
06-Oct-2019 15:47:43 testInnerClass9(org.eclipse.jdt.core.groovy.tests.search.InferencingTests)  Time elapsed: 0.66 s
06-Oct-2019 15:47:43 testMethodOverloadsArgumentMatching1(org.eclipse.jdt.core.groovy.tests.search.InferencingTests)  Time elapsed: 0.149 s
06-Oct-2019 15:47:43 testMethodOverloadsArgumentMatching2(org.eclipse.jdt.core.groovy.tests.search.InferencingTests)  Time elapsed: 0.155 s
06-Oct-2019 15:47:43 testMethodOverloadsArgumentMatching3(org.eclipse.jdt.core.groovy.tests.search.InferencingTests)  Time elapsed: 0.152 s
06-Oct-2019 15:47:43 testMethodOverloadsArgumentMatching4(org.eclipse.jdt.core.groovy.tests.search.InferencingTests)  Time elapsed: 0.629 s
06-Oct-2019 15:47:43 testMethodOverloadsArgumentMatching5(org.eclipse.jdt.core.groovy.tests.search.InferencingTests)  Time elapsed: 0.182 s
06-Oct-2019 15:47:43 testMethodOverloadsArgumentMatching6(org.eclipse.jdt.core.groovy.tests.search.InferencingTests)  Time elapsed: 0.158 s
06-Oct-2019 15:47:43 testMethodOverloadsArgumentMatching7(org.eclipse.jdt.core.groovy.tests.search.InferencingTests)  Time elapsed: 0.175 s
06-Oct-2019 15:47:43 testBoolean1(org.eclipse.jdt.core.groovy.tests.search.InferencingTests)  Time elapsed: 0.592 s
06-Oct-2019 15:47:43 testBoolean2(org.eclipse.jdt.core.groovy.tests.search.InferencingTests)  Time elapsed: 0.143 s
06-Oct-2019 15:47:43 testBoolean3(org.eclipse.jdt.core.groovy.tests.search.InferencingTests)  Time elapsed: 0.141 s
06-Oct-2019 15:47:43 testBoolean4(org.eclipse.jdt.core.groovy.tests.search.InferencingTests)  Time elapsed: 0.154 s
06-Oct-2019 15:47:43 testBoolean5(org.eclipse.jdt.core.groovy.tests.search.InferencingTests)  Time elapsed: 0.158 s
06-Oct-2019 15:47:43 testBoolean6(org.eclipse.jdt.core.groovy.tests.search.InferencingTests)  Time elapsed: 0.505 s
06-Oct-2019 15:47:43 testBoolean7(org.eclipse.jdt.core.groovy.tests.search.InferencingTests)  Time elapsed: 0.621 s
06-Oct-2019 15:47:43 testDeclarationAtBeginningOfMethod(org.eclipse.jdt.core.groovy.tests.search.InferencingTests)  Time elapsed: 0.14 s
06-Oct-2019 15:47:43 testLocalTypeAndDefaultImportCollision(org.eclipse.jdt.core.groovy.tests.search.InferencingTests)  Time elapsed: 0.205 s
06-Oct-2019 15:47:43 testTernaryInitializer(org.eclipse.jdt.core.groovy.tests.search.InferencingTests)  Time elapsed: 0.143 s
06-Oct-2019 15:47:43 testSuperFieldReference3a(org.eclipse.jdt.core.groovy.tests.search.InferencingTests)  Time elapsed: 0.618 s
06-Oct-2019 15:47:43 testSuperFieldReference3b(org.eclipse.jdt.core.groovy.tests.search.InferencingTests)  Time elapsed: 0.152 s
06-Oct-2019 15:47:43 testSuperFieldReference3c(org.eclipse.jdt.core.groovy.tests.search.InferencingTests)  Time elapsed: 0.161 s
06-Oct-2019 15:47:43 testSuperFieldReference5a(org.eclipse.jdt.core.groovy.tests.search.InferencingTests)  Time elapsed: 0.149 s
06-Oct-2019 15:47:43 testSuperFieldReference5b(org.eclipse.jdt.core.groovy.tests.search.InferencingTests)  Time elapsed: 0.667 s
06-Oct-2019 15:47:43 testSpecialConstructor1(org.eclipse.jdt.core.groovy.tests.search.InferencingTests)  Time elapsed: 0.096 s
06-Oct-2019 15:47:43 testSpecialConstructor2(org.eclipse.jdt.core.groovy.tests.search.InferencingTests)  Time elapsed: 0.113 s
06-Oct-2019 15:47:43 testInnerClass10(org.eclipse.jdt.core.groovy.tests.search.InferencingTests)  Time elapsed: 0.177 s
06-Oct-2019 15:47:43 testInnerClass11(org.eclipse.jdt.core.groovy.tests.search.InferencingTests)  Time elapsed: 0.654 s
06-Oct-2019 15:47:43 testMultiDecl10(org.eclipse.jdt.core.groovy.tests.search.InferencingTests)  Time elapsed: 0.627 s
06-Oct-2019 15:47:43 testMultiDecl11(org.eclipse.jdt.core.groovy.tests.search.InferencingTests)  Time elapsed: 0.195 s
06-Oct-2019 15:47:43 testMultiDecl12(org.eclipse.jdt.core.groovy.tests.search.InferencingTests)  Time elapsed: 0.174 s
06-Oct-2019 15:47:43 testMultiDecl13(org.eclipse.jdt.core.groovy.tests.search.InferencingTests)  Time elapsed: 0.636 s
06-Oct-2019 15:47:43 testAsExpression1(org.eclipse.jdt.core.groovy.tests.search.InferencingTests)  Time elapsed: 0.144 s
06-Oct-2019 15:47:43 testAsExpression2(org.eclipse.jdt.core.groovy.tests.search.InferencingTests)  Time elapsed: 0.14 s
06-Oct-2019 15:47:43 testSuperClassMethod1(org.eclipse.jdt.core.groovy.tests.search.InferencingTests)  Time elapsed: 0.162 s
06-Oct-2019 15:47:43 testSuperClassMethod2(org.eclipse.jdt.core.groovy.tests.search.InferencingTests)  Time elapsed: 0.197 s
06-Oct-2019 15:47:43 testSuperClassMethod3(org.eclipse.jdt.core.groovy.tests.search.InferencingTests)  Time elapsed: 0.457 s
06-Oct-2019 15:47:43 testSuperClassMethod4(org.eclipse.jdt.core.groovy.tests.search.InferencingTests)  Time elapsed: 0.652 s
06-Oct-2019 15:47:43 testSuperClassMethod5(org.eclipse.jdt.core.groovy.tests.search.InferencingTests)  Time elapsed: 0.179 s
06-Oct-2019 15:47:43 testElvisInitializer(org.eclipse.jdt.core.groovy.tests.search.InferencingTests)  Time elapsed: 0.14 s
06-Oct-2019 15:47:43 testRangeExpression1(org.eclipse.jdt.core.groovy.tests.search.InferencingTests)  Time elapsed: 0.169 s
06-Oct-2019 15:47:43 testRangeExpression2(org.eclipse.jdt.core.groovy.tests.search.InferencingTests)  Time elapsed: 0.615 s
06-Oct-2019 15:47:43 testRangeExpression3(org.eclipse.jdt.core.groovy.tests.search.InferencingTests)  Time elapsed: 0.148 s
06-Oct-2019 15:47:43 testRangeExpression4(org.eclipse.jdt.core.groovy.tests.search.InferencingTests)  Time elapsed: 0.144 s
06-Oct-2019 15:47:43 testRangeExpression5(org.eclipse.jdt.core.groovy.tests.search.InferencingTests)  Time elapsed: 0.146 s
06-Oct-2019 15:47:43 testRangeExpression6(org.eclipse.jdt.core.groovy.tests.search.InferencingTests)  Time elapsed: 0.19 s
06-Oct-2019 15:47:43 testSpread10(org.eclipse.jdt.core.groovy.tests.search.InferencingTests)  Time elapsed: 0.48 s
06-Oct-2019 15:47:43 testSpread11(org.eclipse.jdt.core.groovy.tests.search.InferencingTests)  Time elapsed: 0.061 s
06-Oct-2019 15:47:43 testSpread12(org.eclipse.jdt.core.groovy.tests.search.InferencingTests)  Time elapsed: 0.596 s
06-Oct-2019 15:47:43 testSpread13(org.eclipse.jdt.core.groovy.tests.search.InferencingTests)  Time elapsed: 0.538 s
06-Oct-2019 15:47:43 testSpread14(org.eclipse.jdt.core.groovy.tests.search.InferencingTests)  Time elapsed: 0.567 s
06-Oct-2019 15:47:43 testSpread15(org.eclipse.jdt.core.groovy.tests.search.InferencingTests)  Time elapsed: 0.212 s
06-Oct-2019 15:47:43 testSpread16(org.eclipse.jdt.core.groovy.tests.search.InferencingTests)  Time elapsed: 0.167 s
06-Oct-2019 15:47:43 testSpread17(org.eclipse.jdt.core.groovy.tests.search.InferencingTests)  Time elapsed: 0.164 s
06-Oct-2019 15:47:43 testStaticThisAndSuper1(org.eclipse.jdt.core.groovy.tests.search.InferencingTests)  Time elapsed: 0.625 s
06-Oct-2019 15:47:43 testStaticThisAndSuper2(org.eclipse.jdt.core.groovy.tests.search.InferencingTests)  Time elapsed: 0.185 s
06-Oct-2019 15:47:43 testMethodOverloadsArgumentMatching4a(org.eclipse.jdt.core.groovy.tests.search.InferencingTests)  Time elapsed: 0.153 s
06-Oct-2019 15:47:43 testMethodOverloadsArgumentMatching4b(org.eclipse.jdt.core.groovy.tests.search.InferencingTests)  Time elapsed: 0.167 s
06-Oct-2019 15:47:43 testMethodOverloadsArgumentMatching5a(org.eclipse.jdt.core.groovy.tests.search.InferencingTests)  Time elapsed: 0.562 s
06-Oct-2019 15:47:43 testMethodOverloadsArgumentMatching5b(org.eclipse.jdt.core.groovy.tests.search.InferencingTests)  Time elapsed: 0.149 s
06-Oct-2019 15:47:43 testMethodOverloadsArgumentMatching6a(org.eclipse.jdt.core.groovy.tests.search.InferencingTests)  Time elapsed: 0.16 s
06-Oct-2019 15:47:43 testMethodOverloadsArgumentMatching6b(org.eclipse.jdt.core.groovy.tests.search.InferencingTests)  Time elapsed: 0.157 s
06-Oct-2019 15:47:43 testConstructor1(org.eclipse.jdt.core.groovy.tests.search.InferencingTests)  Time elapsed: 0.786 s
06-Oct-2019 15:47:43 testConstructor2(org.eclipse.jdt.core.groovy.tests.search.InferencingTests)  Time elapsed: 0.253 s
06-Oct-2019 15:47:43 testConstructor3(org.eclipse.jdt.core.groovy.tests.search.InferencingTests)  Time elapsed: 0.669 s
06-Oct-2019 15:47:43 testConstructor4(org.eclipse.jdt.core.groovy.tests.search.InferencingTests)  Time elapsed: 0.284 s
06-Oct-2019 15:47:43 testConstructor5(org.eclipse.jdt.core.groovy.tests.search.InferencingTests)  Time elapsed: 0.757 s
06-Oct-2019 15:47:43 testConstructor6(org.eclipse.jdt.core.groovy.tests.search.InferencingTests)  Time elapsed: 0.269 s
06-Oct-2019 15:47:43 testInterfaceMethodsAsProperty(org.eclipse.jdt.core.groovy.tests.search.InferencingTests)  Time elapsed: 0.211 s
06-Oct-2019 15:47:43 testStaticMethod1(org.eclipse.jdt.core.groovy.tests.search.InferencingTests)  Time elapsed: 0.642 s
06-Oct-2019 15:47:43 testStaticMethod2(org.eclipse.jdt.core.groovy.tests.search.InferencingTests)  Time elapsed: 0.173 s
06-Oct-2019 15:47:43 testStaticMethod3(org.eclipse.jdt.core.groovy.tests.search.InferencingTests)  Time elapsed: 0.076 s
06-Oct-2019 15:47:43 testStaticMethod4(org.eclipse.jdt.core.groovy.tests.search.InferencingTests)  Time elapsed: 0.164 s
06-Oct-2019 15:47:43 testStaticMethod5(org.eclipse.jdt.core.groovy.tests.search.InferencingTests)  Time elapsed: 0.088 s
06-Oct-2019 15:47:43 testStaticMethod6(org.eclipse.jdt.core.groovy.tests.search.InferencingTests)  Time elapsed: 0.56 s
06-Oct-2019 15:47:43 testStaticMethod7(org.eclipse.jdt.core.groovy.tests.search.InferencingTests)  Time elapsed: 0.161 s
06-Oct-2019 15:47:43 testStaticMethod8(org.eclipse.jdt.core.groovy.tests.search.InferencingTests)  Time elapsed: 0.148 s
06-Oct-2019 15:47:43 testStaticMethod9(org.eclipse.jdt.core.groovy.tests.search.InferencingTests)  Time elapsed: 0.172 s
06-Oct-2019 15:47:43 testClassWithInitializer1(org.eclipse.jdt.core.groovy.tests.search.InferencingTests)  Time elapsed: 0.621 s
06-Oct-2019 15:47:43 testClassWithInitializer2(org.eclipse.jdt.core.groovy.tests.search.InferencingTests)  Time elapsed: 0.149 s
06-Oct-2019 15:47:43 testClassWithInitializer3(org.eclipse.jdt.core.groovy.tests.search.InferencingTests)  Time elapsed: 0.15 s
06-Oct-2019 15:47:43 testPostfix(org.eclipse.jdt.core.groovy.tests.search.InferencingTests)  Time elapsed: 0.145 s
06-Oct-2019 15:47:43 testSuperClassMethod4a(org.eclipse.jdt.core.groovy.tests.search.InferencingTests)  Time elapsed: 0.177 s
06-Oct-2019 15:47:43 testSuperClassMethod4b(org.eclipse.jdt.core.groovy.tests.search.InferencingTests)  Time elapsed: 0.486 s
06-Oct-2019 15:47:43 testSuperClassMethod4c(org.eclipse.jdt.core.groovy.tests.search.InferencingTests)  Time elapsed: 0.617 s
06-Oct-2019 15:47:43 testSuperClassMethod5a(org.eclipse.jdt.core.groovy.tests.search.InferencingTests)  Time elapsed: 0.251 s
06-Oct-2019 15:47:43 testSuperClassMethod5b(org.eclipse.jdt.core.groovy.tests.search.InferencingTests)  Time elapsed: 0.188 s
06-Oct-2019 15:47:43 testListSort1(org.eclipse.jdt.core.groovy.tests.search.InferencingTests)  Time elapsed: 0.599 s
06-Oct-2019 15:47:43 testListSort2(org.eclipse.jdt.core.groovy.tests.search.InferencingTests)  Time elapsed: 0.198 s
06-Oct-2019 15:47:43 testListSort3(org.eclipse.jdt.core.groovy.tests.search.InferencingTests)  Time elapsed: 0.186 s
06-Oct-2019 15:47:43 testLocalVar1(org.eclipse.jdt.core.groovy.tests.search.InferencingTests)  Time elapsed: 0.149 s
06-Oct-2019 15:47:43 testLocalVar2(org.eclipse.jdt.core.groovy.tests.search.InferencingTests)  Time elapsed: 0.57 s
06-Oct-2019 15:47:43 testLocalVar3(org.eclipse.jdt.core.groovy.tests.search.InferencingTests)  Time elapsed: 0.061 s
06-Oct-2019 15:47:43 testLocalVar4(org.eclipse.jdt.core.groovy.tests.search.InferencingTests)  Time elapsed: 0.17 s
06-Oct-2019 15:47:43 testLocalVar5(org.eclipse.jdt.core.groovy.tests.search.InferencingTests)  Time elapsed: 0.149 s
06-Oct-2019 15:47:43 testLocalVar6(org.eclipse.jdt.core.groovy.tests.search.InferencingTests)  Time elapsed: 0.144 s
06-Oct-2019 15:47:43 testLocalVar7(org.eclipse.jdt.core.groovy.tests.search.InferencingTests)  Time elapsed: 0.583 s
06-Oct-2019 15:47:43 testLocalVar8(org.eclipse.jdt.core.groovy.tests.search.InferencingTests)  Time elapsed: 0.158 s
06-Oct-2019 15:47:43 testLocalVar9(org.eclipse.jdt.core.groovy.tests.search.InferencingTests)  Time elapsed: 0.155 s
06-Oct-2019 15:47:43 testIndirectInterfaceMethod(org.eclipse.jdt.core.groovy.tests.search.InferencingTests)  Time elapsed: 0.218 s
06-Oct-2019 15:47:43 testMapLiteral(org.eclipse.jdt.core.groovy.tests.search.InferencingTests)  Time elapsed: 0.572 s
06-Oct-2019 15:47:43 testListRemove(org.eclipse.jdt.core.groovy.tests.search.InferencingTests)  Time elapsed: 0.153 s
06-Oct-2019 15:47:43 testCategoryMethodAsProperty(org.eclipse.jdt.core.groovy.tests.search.InferencingTests)  Time elapsed: 0.159 s
06-Oct-2019 15:47:43 testNothingIsUnknownWithCategories(org.eclipse.jdt.core.groovy.tests.search.InferencingTests)  Time elapsed: 0.152 s
06-Oct-2019 15:47:43 testImplicitVar1(org.eclipse.jdt.core.groovy.tests.search.InferencingTests)  Time elapsed: 0.646 s
06-Oct-2019 15:47:43 testImplicitVar2(org.eclipse.jdt.core.groovy.tests.search.InferencingTests)  Time elapsed: 0.151 s
06-Oct-2019 15:47:43 testImplicitVar3(org.eclipse.jdt.core.groovy.tests.search.InferencingTests)  Time elapsed: 0.15 s
06-Oct-2019 15:47:43 testImplicitVar4(org.eclipse.jdt.core.groovy.tests.search.InferencingTests)  Time elapsed: 0.153 s
06-Oct-2019 15:47:43 testImplicitVar5(org.eclipse.jdt.core.groovy.tests.search.InferencingTests)  Time elapsed: 0.652 s
06-Oct-2019 15:47:43 testImplicitVar6(org.eclipse.jdt.core.groovy.tests.search.InferencingTests)  Time elapsed: 0.068 s
06-Oct-2019 15:47:43 testImplicitVar7(org.eclipse.jdt.core.groovy.tests.search.InferencingTests)  Time elapsed: 0.174 s
06-Oct-2019 15:47:43 testClassLiteral1(org.eclipse.jdt.core.groovy.tests.search.InferencingTests)  Time elapsed: 0.06 s
06-Oct-2019 15:47:43 testClassLiteral2(org.eclipse.jdt.core.groovy.tests.search.InferencingTests)  Time elapsed: 0.154 s
06-Oct-2019 15:47:43 testClassLiteral3(org.eclipse.jdt.core.groovy.tests.search.InferencingTests)  Time elapsed: 0.651 s
06-Oct-2019 15:47:43 testClassLiteral4(org.eclipse.jdt.core.groovy.tests.search.InferencingTests)  Time elapsed: 0.156 s
06-Oct-2019 15:47:43 testClassLiteral5(org.eclipse.jdt.core.groovy.tests.search.InferencingTests)  Time elapsed: 0.153 s
06-Oct-2019 15:47:43 testInstanceOf10(org.eclipse.jdt.core.groovy.tests.search.InferencingTests)  Time elapsed: 0.796 s
06-Oct-2019 15:47:43 testInstanceOf11(org.eclipse.jdt.core.groovy.tests.search.InferencingTests)  Time elapsed: 0.32 s
06-Oct-2019 15:47:43 testInstanceOf1a(org.eclipse.jdt.core.groovy.tests.search.InferencingTests)  Time elapsed: 0.755 s
06-Oct-2019 15:47:43 testInstanceOf1b(org.eclipse.jdt.core.groovy.tests.search.InferencingTests)  Time elapsed: 0.313 s
06-Oct-2019 15:47:43 testThisInInnerClass(org.eclipse.jdt.core.groovy.tests.search.InferencingTests)  Time elapsed: 0.622 s
06-Oct-2019 15:47:43 testStaticImports1(org.eclipse.jdt.core.groovy.tests.search.InferencingTests)  Time elapsed: 0.156 s
06-Oct-2019 15:47:43 testStaticImports2(org.eclipse.jdt.core.groovy.tests.search.InferencingTests)  Time elapsed: 0.148 s
06-Oct-2019 15:47:43 testStaticImports3(org.eclipse.jdt.core.groovy.tests.search.InferencingTests)  Time elapsed: 0.15 s
06-Oct-2019 15:47:43 testStaticImports4(org.eclipse.jdt.core.groovy.tests.search.InferencingTests)  Time elapsed: 0.673 s
06-Oct-2019 15:47:43 testMultiDecl1(org.eclipse.jdt.core.groovy.tests.search.InferencingTests)  Time elapsed: 0.187 s
06-Oct-2019 15:47:43 testMultiDecl2(org.eclipse.jdt.core.groovy.tests.search.InferencingTests)  Time elapsed: 0.184 s
06-Oct-2019 15:47:43 testMultiDecl3(org.eclipse.jdt.core.groovy.tests.search.InferencingTests)  Time elapsed: 0.662 s
06-Oct-2019 15:47:43 testMultiDecl4(org.eclipse.jdt.core.groovy.tests.search.InferencingTests)  Time elapsed: 0.188 s
06-Oct-2019 15:47:43 testMultiDecl6(org.eclipse.jdt.core.groovy.tests.search.InferencingTests)  Time elapsed: 0.213 s
06-Oct-2019 15:47:43 testMultiDecl7(org.eclipse.jdt.core.groovy.tests.search.InferencingTests)  Time elapsed: 0.636 s
06-Oct-2019 15:47:43 testMultiDecl8(org.eclipse.jdt.core.groovy.tests.search.InferencingTests)  Time elapsed: 0.181 s
06-Oct-2019 15:47:43 testMultiDecl9(org.eclipse.jdt.core.groovy.tests.search.InferencingTests)  Time elapsed: 0.185 s
06-Oct-2019 15:47:43 testLocalMethod1(org.eclipse.jdt.core.groovy.tests.search.InferencingTests)  Time elapsed: 0.155 s
06-Oct-2019 15:47:43 testLocalMethod2(org.eclipse.jdt.core.groovy.tests.search.InferencingTests)  Time elapsed: 0.586 s
06-Oct-2019 15:47:43 testLocalMethod3(org.eclipse.jdt.core.groovy.tests.search.InferencingTests)  Time elapsed: 0.163 s
06-Oct-2019 15:47:43 testLocalMethod4(org.eclipse.jdt.core.groovy.tests.search.InferencingTests)  Time elapsed: 0.153 s
06-Oct-2019 15:47:43 testLocalMethod5(org.eclipse.jdt.core.groovy.tests.search.InferencingTests)  Time elapsed: 0.153 s
06-Oct-2019 15:47:43 testLocalVar10(org.eclipse.jdt.core.groovy.tests.search.InferencingTests)  Time elapsed: 0.643 s
06-Oct-2019 15:47:43 testLocalVar11(org.eclipse.jdt.core.groovy.tests.search.InferencingTests)  Time elapsed: 0.171 s
06-Oct-2019 15:47:43 testLocalVar12(org.eclipse.jdt.core.groovy.tests.search.InferencingTests)  Time elapsed: 0.15 s
06-Oct-2019 15:47:43 testLocalVar13(org.eclipse.jdt.core.groovy.tests.search.InferencingTests)  Time elapsed: 0.144 s
06-Oct-2019 15:47:43 testLocalVar14(org.eclipse.jdt.core.groovy.tests.search.InferencingTests)  Time elapsed: 0.646 s
06-Oct-2019 15:47:43 testLocalVar15(org.eclipse.jdt.core.groovy.tests.search.InferencingTests)  Time elapsed: 0.311 s
06-Oct-2019 15:47:43 testLocalVar16(org.eclipse.jdt.core.groovy.tests.search.InferencingTests)  Time elapsed: 0.762 s
06-Oct-2019 15:47:43 testLocalVar17(org.eclipse.jdt.core.groovy.tests.search.InferencingTests)  Time elapsed: 0.255 s
06-Oct-2019 15:47:43 testLocalVar18(org.eclipse.jdt.core.groovy.tests.search.InferencingTests)  Time elapsed: 0.747 s
06-Oct-2019 15:47:43 testLocalVar19(org.eclipse.jdt.core.groovy.tests.search.InferencingTests)  Time elapsed: 0.286 s
06-Oct-2019 15:47:43 testLocalVar20(org.eclipse.jdt.core.groovy.tests.search.InferencingTests)  Time elapsed: 0.25 s
06-Oct-2019 15:47:43 testLocalVar21(org.eclipse.jdt.core.groovy.tests.search.InferencingTests)  Time elapsed: 0.684 s
06-Oct-2019 15:47:43 testLocalVar22(org.eclipse.jdt.core.groovy.tests.search.InferencingTests)  Time elapsed: 0.302 s
06-Oct-2019 15:47:43 testLocalVar23(org.eclipse.jdt.core.groovy.tests.search.InferencingTests)  Time elapsed: 0.733 s
06-Oct-2019 15:47:43 testLocalVar24(org.eclipse.jdt.core.groovy.tests.search.InferencingTests)  Time elapsed: 0.313 s
06-Oct-2019 15:47:43 testLocalVar25(org.eclipse.jdt.core.groovy.tests.search.InferencingTests)  Time elapsed: 0.751 s
06-Oct-2019 15:47:43 testLocalVar26(org.eclipse.jdt.core.groovy.tests.search.InferencingTests)  Time elapsed: 0.165 s
06-Oct-2019 15:47:43 testLocalVar27(org.eclipse.jdt.core.groovy.tests.search.InferencingTests)  Time elapsed: 0.148 s
06-Oct-2019 15:47:43 testLocalVar28(org.eclipse.jdt.core.groovy.tests.search.InferencingTests)  Time elapsed: 0.669 s
06-Oct-2019 15:47:43 testNoGString(org.eclipse.jdt.core.groovy.tests.search.InferencingTests)  Time elapsed: 0.161 s
06-Oct-2019 15:47:43 testObjectMethodOnInterfaceAsProperty(org.eclipse.jdt.core.groovy.tests.search.InferencingTests)  Time elapsed: 0.165 s
06-Oct-2019 15:47:43 testMatcher1(org.eclipse.jdt.core.groovy.tests.search.InferencingTests)  Time elapsed: 0.19 s
06-Oct-2019 15:47:43 testMatcher2(org.eclipse.jdt.core.groovy.tests.search.InferencingTests)  Time elapsed: 0.589 s
06-Oct-2019 15:47:43 testCatchBlock1(org.eclipse.jdt.core.groovy.tests.search.InferencingTests)  Time elapsed: 0.201 s
06-Oct-2019 15:47:43 testCatchBlock2(org.eclipse.jdt.core.groovy.tests.search.InferencingTests)  Time elapsed: 0.161 s
06-Oct-2019 15:47:43 testCatchBlock3(org.eclipse.jdt.core.groovy.tests.search.InferencingTests)  Time elapsed: 0.151 s
06-Oct-2019 15:47:43 testCatchBlock4(org.eclipse.jdt.core.groovy.tests.search.InferencingTests)  Time elapsed: 0.591 s
06-Oct-2019 15:47:43 testCatchBlock5(org.eclipse.jdt.core.groovy.tests.search.InferencingTests)  Time elapsed: 0.177 s
06-Oct-2019 15:47:43 testInterfaceMethodAsProperty2(org.eclipse.jdt.core.groovy.tests.search.InferencingTests)  Time elapsed: 0.195 s
06-Oct-2019 15:47:43 testInterfaceMethodAsProperty3(org.eclipse.jdt.core.groovy.tests.search.InferencingTests)  Time elapsed: 0.669 s
06-Oct-2019 15:47:43 testGetAt1(org.eclipse.jdt.core.groovy.tests.search.InferencingTests)  Time elapsed: 0.153 s
06-Oct-2019 15:47:43 testGetAt2(org.eclipse.jdt.core.groovy.tests.search.InferencingTests)  Time elapsed: 0.063 s
06-Oct-2019 15:47:43 testGetAt3(org.eclipse.jdt.core.groovy.tests.search.InferencingTests)  Time elapsed: 0.178 s
06-Oct-2019 15:47:43 testGetAt4(org.eclipse.jdt.core.groovy.tests.search.InferencingTests)  Time elapsed: 0.152 s
06-Oct-2019 15:47:43 testGetAt5(org.eclipse.jdt.core.groovy.tests.search.InferencingTests)  Time elapsed: 0.599 s
06-Oct-2019 15:47:43 testGetAt6(org.eclipse.jdt.core.groovy.tests.search.InferencingTests)  Time elapsed: 0.187 s
06-Oct-2019 15:47:43 testGetAt7(org.eclipse.jdt.core.groovy.tests.search.InferencingTests)  Time elapsed: 0.202 s
06-Oct-2019 15:47:43 testGetAt8(org.eclipse.jdt.core.groovy.tests.search.InferencingTests) skipped
06-Oct-2019 15:47:43 testGetAt9(org.eclipse.jdt.core.groovy.tests.search.InferencingTests) skipped
06-Oct-2019 15:47:43 testFieldWithInitializer1(org.eclipse.jdt.core.groovy.tests.search.InferencingTests)  Time elapsed: 0.602 s
06-Oct-2019 15:47:43 testFieldWithInitializer2(org.eclipse.jdt.core.groovy.tests.search.InferencingTests)  Time elapsed: 0.156 s
06-Oct-2019 15:47:43 testNested1(org.eclipse.jdt.core.groovy.tests.search.InferencingTests)  Time elapsed: 0.153 s
06-Oct-2019 15:47:43 testNested2(org.eclipse.jdt.core.groovy.tests.search.InferencingTests)  Time elapsed: 0.184 s
06-Oct-2019 15:47:43 testNested3(org.eclipse.jdt.core.groovy.tests.search.InferencingTests)  Time elapsed: 0.612 s
06-Oct-2019 15:47:43 testNested4(org.eclipse.jdt.core.groovy.tests.search.InferencingTests)  Time elapsed: 0.172 s
06-Oct-2019 15:47:43 testIndirectInterfaceConstant(org.eclipse.jdt.core.groovy.tests.search.InferencingTests)  Time elapsed: 0.196 s
06-Oct-2019 15:47:43 testInstanceOf1(org.eclipse.jdt.core.groovy.tests.search.InferencingTests)  Time elapsed: 0.762 s
06-Oct-2019 15:47:43 testInstanceOf2(org.eclipse.jdt.core.groovy.tests.search.InferencingTests)  Time elapsed: 0.267 s
06-Oct-2019 15:47:43 testInstanceOf3(org.eclipse.jdt.core.groovy.tests.search.InferencingTests)  Time elapsed: 2.094 s
06-Oct-2019 15:47:43 testInstanceOf4(org.eclipse.jdt.core.groovy.tests.search.InferencingTests)  Time elapsed: 0.397 s
06-Oct-2019 15:47:43 testInstanceOf5(org.eclipse.jdt.core.groovy.tests.search.InferencingTests)  Time elapsed: 0.779 s
06-Oct-2019 15:47:43 testInstanceOf6(org.eclipse.jdt.core.groovy.tests.search.InferencingTests)  Time elapsed: 0.324 s
06-Oct-2019 15:47:43 testInstanceOf7(org.eclipse.jdt.core.groovy.tests.search.InferencingTests)  Time elapsed: 0.748 s
06-Oct-2019 15:47:43 testInstanceOf8(org.eclipse.jdt.core.groovy.tests.search.InferencingTests)  Time elapsed: 0.292 s
06-Oct-2019 15:47:43 testInstanceOf9(org.eclipse.jdt.core.groovy.tests.search.InferencingTests)  Time elapsed: 0.799 s
06-Oct-2019 15:47:43 testAnonInner1(org.eclipse.jdt.core.groovy.tests.search.InferencingTests)  Time elapsed: 0.058 s
06-Oct-2019 15:47:43 testAnonInner2(org.eclipse.jdt.core.groovy.tests.search.InferencingTests)  Time elapsed: 0.164 s
06-Oct-2019 15:47:43 testAnonInner3(org.eclipse.jdt.core.groovy.tests.search.InferencingTests)  Time elapsed: 0.154 s
06-Oct-2019 15:47:43 testAnonInner4(org.eclipse.jdt.core.groovy.tests.search.InferencingTests)  Time elapsed: 0.608 s
06-Oct-2019 15:47:43 testAnonInner5(org.eclipse.jdt.core.groovy.tests.search.InferencingTests)  Time elapsed: 0.192 s
06-Oct-2019 15:47:43 testAnonInner6(org.eclipse.jdt.core.groovy.tests.search.InferencingTests)  Time elapsed: 0.211 s
06-Oct-2019 15:47:43 testAnonInner7(org.eclipse.jdt.core.groovy.tests.search.InferencingTests)  Time elapsed: 0.637 s
06-Oct-2019 15:47:43 testAnonInner8(org.eclipse.jdt.core.groovy.tests.search.InferencingTests)  Time elapsed: 0.264 s
06-Oct-2019 15:47:43 testNumber1(org.eclipse.jdt.core.groovy.tests.search.InferencingTests)  Time elapsed: 0.171 s
06-Oct-2019 15:47:43 testNumber2(org.eclipse.jdt.core.groovy.tests.search.InferencingTests)  Time elapsed: 0.15 s
06-Oct-2019 15:47:43 testNumber3(org.eclipse.jdt.core.groovy.tests.search.InferencingTests)  Time elapsed: 0.518 s
06-Oct-2019 15:47:43 testNumber4(org.eclipse.jdt.core.groovy.tests.search.InferencingTests)  Time elapsed: 0.613 s
06-Oct-2019 15:47:43 testNumber5(org.eclipse.jdt.core.groovy.tests.search.InferencingTests)  Time elapsed: 0.16 s
06-Oct-2019 15:47:43 testNumber6(org.eclipse.jdt.core.groovy.tests.search.InferencingTests)  Time elapsed: 0.154 s
06-Oct-2019 15:47:43 testSpread1(org.eclipse.jdt.core.groovy.tests.search.InferencingTests)  Time elapsed: 0.172 s
06-Oct-2019 15:47:43 testSpread2(org.eclipse.jdt.core.groovy.tests.search.InferencingTests)  Time elapsed: 0.622 s
06-Oct-2019 15:47:43 testSpread3(org.eclipse.jdt.core.groovy.tests.search.InferencingTests)  Time elapsed: 0.147 s
06-Oct-2019 15:47:43 testSpread4(org.eclipse.jdt.core.groovy.tests.search.InferencingTests)  Time elapsed: 0.151 s
06-Oct-2019 15:47:43 testSpread5(org.eclipse.jdt.core.groovy.tests.search.InferencingTests)  Time elapsed: 0.162 s
06-Oct-2019 15:47:43 testSpread6(org.eclipse.jdt.core.groovy.tests.search.InferencingTests)  Time elapsed: 0.642 s
06-Oct-2019 15:47:43 testSpread7(org.eclipse.jdt.core.groovy.tests.search.InferencingTests)  Time elapsed: 0.178 s
06-Oct-2019 15:47:43 testSpread8(org.eclipse.jdt.core.groovy.tests.search.InferencingTests)  Time elapsed: 0.164 s
06-Oct-2019 15:47:43 testSpread9(org.eclipse.jdt.core.groovy.tests.search.InferencingTests)  Time elapsed: 0.161 s
06-Oct-2019 15:47:43 testPattern1(org.eclipse.jdt.core.groovy.tests.search.InferencingTests)  Time elapsed: 0.604 s
06-Oct-2019 15:47:43 testPattern2(org.eclipse.jdt.core.groovy.tests.search.InferencingTests)  Time elapsed: 0.154 s
06-Oct-2019 15:47:43 testClassReference2a(org.eclipse.jdt.core.groovy.tests.search.InferencingTests)  Time elapsed: 0.208 s
06-Oct-2019 15:47:43 testClassReference3a(org.eclipse.jdt.core.groovy.tests.search.InferencingTests)  Time elapsed: 0.677 s
06-Oct-2019 15:47:43 testClassReference4a(org.eclipse.jdt.core.groovy.tests.search.InferencingTests)  Time elapsed: 0.183 s
06-Oct-2019 15:47:43 testClassReference4b(org.eclipse.jdt.core.groovy.tests.search.InferencingTests)  Time elapsed: 0.189 s
06-Oct-2019 15:47:43 testString1(org.eclipse.jdt.core.groovy.tests.search.InferencingTests)  Time elapsed: 0.152 s
06-Oct-2019 15:47:43 testString2(org.eclipse.jdt.core.groovy.tests.search.InferencingTests)  Time elapsed: 0.607 s
06-Oct-2019 15:47:43 testString3(org.eclipse.jdt.core.groovy.tests.search.InferencingTests)  Time elapsed: 0.161 s
06-Oct-2019 15:47:43 testSuperFieldReference1(org.eclipse.jdt.core.groovy.tests.search.InferencingTests)  Time elapsed: 0.16 s
06-Oct-2019 15:47:43 testSuperFieldReference2(org.eclipse.jdt.core.groovy.tests.search.InferencingTests)  Time elapsed: 0.152 s
06-Oct-2019 15:47:43 testSuperFieldReference3(org.eclipse.jdt.core.groovy.tests.search.InferencingTests)  Time elapsed: 0.636 s
06-Oct-2019 15:47:43 testSuperFieldReference4(org.eclipse.jdt.core.groovy.tests.search.InferencingTests)  Time elapsed: 0.146 s
06-Oct-2019 15:47:43 testSuperFieldReference5(org.eclipse.jdt.core.groovy.tests.search.InferencingTests)  Time elapsed: 0.166 s
06-Oct-2019 15:47:43 testClassReference1(org.eclipse.jdt.core.groovy.tests.search.InferencingTests)  Time elapsed: 0.146 s
06-Oct-2019 15:47:43 testClassReference2(org.eclipse.jdt.core.groovy.tests.search.InferencingTests)  Time elapsed: 0.685 s
06-Oct-2019 15:47:43 testClassReference3(org.eclipse.jdt.core.groovy.tests.search.InferencingTests)  Time elapsed: 0.183 s
06-Oct-2019 15:47:43 testClassReference4(org.eclipse.jdt.core.groovy.tests.search.InferencingTests)  Time elapsed: 0.21 s
06-Oct-2019 15:47:43 testPropertyNodeFromJava1(org.eclipse.jdt.core.groovy.tests.search.JDTPropertyNodeInferencingTests)  Time elapsed: 0.094 s
06-Oct-2019 15:47:43 testPropertyNodeFromJava2(org.eclipse.jdt.core.groovy.tests.search.JDTPropertyNodeInferencingTests)  Time elapsed: 0.583 s
06-Oct-2019 15:47:43 testPropertyNodeFromJava3(org.eclipse.jdt.core.groovy.tests.search.JDTPropertyNodeInferencingTests)  Time elapsed: 0.07 s
06-Oct-2019 15:47:43 testPropertyNodeFromJava4(org.eclipse.jdt.core.groovy.tests.search.JDTPropertyNodeInferencingTests)  Time elapsed: 0.167 s
06-Oct-2019 15:47:43 testNodeFromJava1(org.eclipse.jdt.core.groovy.tests.search.JDTPropertyNodeInferencingTests)  Time elapsed: 0.164 s
06-Oct-2019 15:47:43 testPropertyNodeReferenceInBinary1(org.eclipse.jdt.core.groovy.tests.search.JDTPropertyNodeInferencingTests)  Time elapsed: 0.158 s
06-Oct-2019 15:47:43 testVarReferenceInGString1(org.eclipse.jdt.core.groovy.tests.search.LocalVariableReferenceSearchTests)  Time elapsed: 0.174 s
06-Oct-2019 15:47:43 testVarReferenceInGString2(org.eclipse.jdt.core.groovy.tests.search.LocalVariableReferenceSearchTests)  Time elapsed: 0.148 s
06-Oct-2019 15:47:43 testVarReferenceInGString3(org.eclipse.jdt.core.groovy.tests.search.LocalVariableReferenceSearchTests)  Time elapsed: 0.142 s
06-Oct-2019 15:47:43 testVarReferenceInGString4(org.eclipse.jdt.core.groovy.tests.search.LocalVariableReferenceSearchTests)  Time elapsed: 0.155 s
06-Oct-2019 15:47:43 testVarReferenceInGString5(org.eclipse.jdt.core.groovy.tests.search.LocalVariableReferenceSearchTests)  Time elapsed: 0.157 s
06-Oct-2019 15:47:43 testVarReference10(org.eclipse.jdt.core.groovy.tests.search.LocalVariableReferenceSearchTests)  Time elapsed: 0.155 s
06-Oct-2019 15:47:43 testVarReference1(org.eclipse.jdt.core.groovy.tests.search.LocalVariableReferenceSearchTests)  Time elapsed: 0.164 s
06-Oct-2019 15:47:43 testVarReference2(org.eclipse.jdt.core.groovy.tests.search.LocalVariableReferenceSearchTests)  Time elapsed: 0.154 s
06-Oct-2019 15:47:43 testVarReference3(org.eclipse.jdt.core.groovy.tests.search.LocalVariableReferenceSearchTests)  Time elapsed: 0.158 s
06-Oct-2019 15:47:43 testVarReference4(org.eclipse.jdt.core.groovy.tests.search.LocalVariableReferenceSearchTests)  Time elapsed: 0.163 s
06-Oct-2019 15:47:43 testVarReference5(org.eclipse.jdt.core.groovy.tests.search.LocalVariableReferenceSearchTests)  Time elapsed: 0.16 s
06-Oct-2019 15:47:43 testVarReference6(org.eclipse.jdt.core.groovy.tests.search.LocalVariableReferenceSearchTests)  Time elapsed: 0.156 s
06-Oct-2019 15:47:43 testVarReference7(org.eclipse.jdt.core.groovy.tests.search.LocalVariableReferenceSearchTests)  Time elapsed: 0.198 s
06-Oct-2019 15:47:43 testVarReference8(org.eclipse.jdt.core.groovy.tests.search.LocalVariableReferenceSearchTests)  Time elapsed: 0.156 s
06-Oct-2019 15:47:43 testVarReference9(org.eclipse.jdt.core.groovy.tests.search.LocalVariableReferenceSearchTests)  Time elapsed: 0.187 s
06-Oct-2019 15:47:43 testExplicitPropertySetterSearch1(org.eclipse.jdt.core.groovy.tests.search.MethodReferenceSearchTests)  Time elapsed: 0.382 s
06-Oct-2019 15:47:43 testExplicitPropertySetterSearch2(org.eclipse.jdt.core.groovy.tests.search.MethodReferenceSearchTests)  Time elapsed: 0.756 s
06-Oct-2019 15:47:43 testOverloadedMethodReferences1(org.eclipse.jdt.core.groovy.tests.search.MethodReferenceSearchTests)  Time elapsed: 0.328 s
06-Oct-2019 15:47:43 testOverloadedMethodReferences2(org.eclipse.jdt.core.groovy.tests.search.MethodReferenceSearchTests)  Time elapsed: 0.2 s
06-Oct-2019 15:47:43 testOverloadedMethodReferences3(org.eclipse.jdt.core.groovy.tests.search.MethodReferenceSearchTests)  Time elapsed: 0.191 s
06-Oct-2019 15:47:43 testOverloadedMethodReferences4(org.eclipse.jdt.core.groovy.tests.search.MethodReferenceSearchTests)  Time elapsed: 0.206 s
06-Oct-2019 15:47:43 testOverloadedMethodReferences5(org.eclipse.jdt.core.groovy.tests.search.MethodReferenceSearchTests)  Time elapsed: 0.223 s
06-Oct-2019 15:47:43 testOverloadedMethodReferences6(org.eclipse.jdt.core.groovy.tests.search.MethodReferenceSearchTests)  Time elapsed: 0.207 s
06-Oct-2019 15:47:43 testStaticMethodReferenceSearch(org.eclipse.jdt.core.groovy.tests.search.MethodReferenceSearchTests)  Time elapsed: 0.094 s
06-Oct-2019 15:47:43 testMethodReferencesInClass1(org.eclipse.jdt.core.groovy.tests.search.MethodReferenceSearchTests)  Time elapsed: 0.189 s
06-Oct-2019 15:47:43 testMethodReferencesInClass2(org.eclipse.jdt.core.groovy.tests.search.MethodReferenceSearchTests)  Time elapsed: 0.213 s
06-Oct-2019 15:47:43 testMethodReferencesInClass3(org.eclipse.jdt.core.groovy.tests.search.MethodReferenceSearchTests)  Time elapsed: 0.244 s
06-Oct-2019 15:47:43 testGenericsMethodReferenceSearch(org.eclipse.jdt.core.groovy.tests.search.MethodReferenceSearchTests)  Time elapsed: 0.526 s
06-Oct-2019 15:47:43 testMethodReferencesInScript1(org.eclipse.jdt.core.groovy.tests.search.MethodReferenceSearchTests)  Time elapsed: 0.206 s
06-Oct-2019 15:47:43 testMethodReferencesInScript2(org.eclipse.jdt.core.groovy.tests.search.MethodReferenceSearchTests)  Time elapsed: 0.205 s
06-Oct-2019 15:47:43 testMethodReferencesInScript3(org.eclipse.jdt.core.groovy.tests.search.MethodReferenceSearchTests)  Time elapsed: 0.222 s
06-Oct-2019 15:47:43 testMethodReferencesInScript4(org.eclipse.jdt.core.groovy.tests.search.MethodReferenceSearchTests)  Time elapsed: 0.213 s
06-Oct-2019 15:47:43 testMethodReferencesInScript5(org.eclipse.jdt.core.groovy.tests.search.MethodReferenceSearchTests)  Time elapsed: 0.214 s
06-Oct-2019 15:47:43 testMethodReferencesInScript6(org.eclipse.jdt.core.groovy.tests.search.MethodReferenceSearchTests)  Time elapsed: 0.206 s
06-Oct-2019 15:47:43 testMethodReferencesInScript7(org.eclipse.jdt.core.groovy.tests.search.MethodReferenceSearchTests)  Time elapsed: 0.231 s
06-Oct-2019 15:47:43 testMethodReferencesInScript8(org.eclipse.jdt.core.groovy.tests.search.MethodReferenceSearchTests)  Time elapsed: 0.209 s
06-Oct-2019 15:47:43 testMethodReferencesInScript9(org.eclipse.jdt.core.groovy.tests.search.MethodReferenceSearchTests)  Time elapsed: 0.203 s
06-Oct-2019 15:47:43 testMethodWithDefaultParameters1(org.eclipse.jdt.core.groovy.tests.search.MethodReferenceSearchTests)  Time elapsed: 0.205 s
06-Oct-2019 15:47:43 testMethodWithDefaultParameters2(org.eclipse.jdt.core.groovy.tests.search.MethodReferenceSearchTests)  Time elapsed: 0.238 s
06-Oct-2019 15:47:43 testMethodWithDefaultParameters3(org.eclipse.jdt.core.groovy.tests.search.MethodReferenceSearchTests)  Time elapsed: 0.219 s
06-Oct-2019 15:47:43 testMethodWithDefaultParameters4(org.eclipse.jdt.core.groovy.tests.search.MethodReferenceSearchTests) skipped
06-Oct-2019 15:47:43 testExplicitPropertyGetterSearch1(org.eclipse.jdt.core.groovy.tests.search.MethodReferenceSearchTests)  Time elapsed: 0.627 s
06-Oct-2019 15:47:43 testExplicitPropertyGetterSearch2(org.eclipse.jdt.core.groovy.tests.search.MethodReferenceSearchTests)  Time elapsed: 0.64 s
06-Oct-2019 15:47:43 testRightShift(org.eclipse.jdt.core.groovy.tests.search.OperatorOverloadingInferencingTests)  Time elapsed: 0.475 s
06-Oct-2019 15:47:43 testLeftShift(org.eclipse.jdt.core.groovy.tests.search.OperatorOverloadingInferencingTests)  Time elapsed: 0.637 s
06-Oct-2019 15:47:43 testAnd(org.eclipse.jdt.core.groovy.tests.search.OperatorOverloadingInferencingTests)  Time elapsed: 0.179 s
06-Oct-2019 15:47:43 testMod(org.eclipse.jdt.core.groovy.tests.search.OperatorOverloadingInferencingTests)  Time elapsed: 0.161 s
06-Oct-2019 15:47:43 testXor(org.eclipse.jdt.core.groovy.tests.search.OperatorOverloadingInferencingTests)  Time elapsed: 0.161 s
06-Oct-2019 15:47:43 testPlus1(org.eclipse.jdt.core.groovy.tests.search.OperatorOverloadingInferencingTests)  Time elapsed: 0.607 s
06-Oct-2019 15:47:43 testPlus2(org.eclipse.jdt.core.groovy.tests.search.OperatorOverloadingInferencingTests)  Time elapsed: 0.168 s
06-Oct-2019 15:47:43 testPlus3(org.eclipse.jdt.core.groovy.tests.search.OperatorOverloadingInferencingTests)  Time elapsed: 0.155 s
06-Oct-2019 15:47:43 testOr(org.eclipse.jdt.core.groovy.tests.search.OperatorOverloadingInferencingTests)  Time elapsed: 1.568 s
06-Oct-2019 15:47:43 testPrefix1(org.eclipse.jdt.core.groovy.tests.search.OperatorOverloadingInferencingTests)  Time elapsed: 0.159 s
06-Oct-2019 15:47:43 testPrefix2(org.eclipse.jdt.core.groovy.tests.search.OperatorOverloadingInferencingTests)  Time elapsed: 0.161 s
06-Oct-2019 15:47:43 testPrefix3(org.eclipse.jdt.core.groovy.tests.search.OperatorOverloadingInferencingTests)  Time elapsed: 0.156 s
06-Oct-2019 15:47:43 testPrefix4(org.eclipse.jdt.core.groovy.tests.search.OperatorOverloadingInferencingTests)  Time elapsed: 0.638 s
06-Oct-2019 15:47:43 testPrefix5(org.eclipse.jdt.core.groovy.tests.search.OperatorOverloadingInferencingTests)  Time elapsed: 0.189 s
06-Oct-2019 15:47:43 testPrefix6(org.eclipse.jdt.core.groovy.tests.search.OperatorOverloadingInferencingTests)  Time elapsed: 0.17 s
06-Oct-2019 15:47:43 testLongExpr1(org.eclipse.jdt.core.groovy.tests.search.OperatorOverloadingInferencingTests)  Time elapsed: 0.166 s
06-Oct-2019 15:47:43 testLongExpr2(org.eclipse.jdt.core.groovy.tests.search.OperatorOverloadingInferencingTests)  Time elapsed: 0.589 s
06-Oct-2019 15:47:43 testLongExpr3(org.eclipse.jdt.core.groovy.tests.search.OperatorOverloadingInferencingTests)  Time elapsed: 0.173 s
06-Oct-2019 15:47:43 testAttributeExpr1(org.eclipse.jdt.core.groovy.tests.search.OperatorOverloadingInferencingTests)  Time elapsed: 0.183 s
06-Oct-2019 15:47:43 testAttributeExpr2(org.eclipse.jdt.core.groovy.tests.search.OperatorOverloadingInferencingTests)  Time elapsed: 2.039 s
06-Oct-2019 15:47:43 testDivide(org.eclipse.jdt.core.groovy.tests.search.OperatorOverloadingInferencingTests)  Time elapsed: 0.157 s
06-Oct-2019 15:47:43 testMultiply(org.eclipse.jdt.core.groovy.tests.search.OperatorOverloadingInferencingTests)  Time elapsed: 0.158 s
06-Oct-2019 15:47:43 testGetAt1(org.eclipse.jdt.core.groovy.tests.search.OperatorOverloadingInferencingTests)  Time elapsed: 0.164 s
06-Oct-2019 15:47:43 testGetAt2(org.eclipse.jdt.core.groovy.tests.search.OperatorOverloadingInferencingTests)  Time elapsed: 0.632 s
06-Oct-2019 15:47:43 testGetAt3(org.eclipse.jdt.core.groovy.tests.search.OperatorOverloadingInferencingTests)  Time elapsed: 0.158 s
06-Oct-2019 15:47:43 testGetAt4(org.eclipse.jdt.core.groovy.tests.search.OperatorOverloadingInferencingTests)  Time elapsed: 0.183 s
06-Oct-2019 15:47:43 testGetAt5(org.eclipse.jdt.core.groovy.tests.search.OperatorOverloadingInferencingTests)  Time elapsed: 0.164 s
06-Oct-2019 15:47:43 testGetAt6(org.eclipse.jdt.core.groovy.tests.search.OperatorOverloadingInferencingTests)  Time elapsed: 0.606 s
06-Oct-2019 15:47:43 testGetAt7(org.eclipse.jdt.core.groovy.tests.search.OperatorOverloadingInferencingTests)  Time elapsed: 0.157 s
06-Oct-2019 15:47:43 testGetAt8(org.eclipse.jdt.core.groovy.tests.search.OperatorOverloadingInferencingTests)  Time elapsed: 0.174 s
06-Oct-2019 15:47:43 testGetAt9(org.eclipse.jdt.core.groovy.tests.search.OperatorOverloadingInferencingTests)  Time elapsed: 0.067 s  <<< FAILURE!
06-Oct-2019 15:47:43 java.lang.AssertionError:
06-Oct-2019 15:47:43 Expected type not found.
06-Oct-2019 15:47:43 Expected: java.lang.Boolean
06-Oct-2019 15:47:43 Found: java.util.BitSet
06-Oct-2019 15:47:43 Declaring type: Search
06-Oct-2019 15:47:43 ASTNode: org.codehaus.groovy.ast.expr.VariableExpression@fed3e[variable: xxx]
06-Oct-2019 15:47:43 Confidence: INFERRED
06-Oct-2019 15:47:43
06-Oct-2019 15:47:43         at org.eclipse.jdt.core.groovy.tests.search.OperatorOverloadingInferencingTests.testGetAt9(OperatorOverloadingInferencingTests.java:285)
06-Oct-2019 15:47:43
06-Oct-2019 15:47:43 testPostfix1(org.eclipse.jdt.core.groovy.tests.search.OperatorOverloadingInferencingTests)  Time elapsed: 0.178 s
06-Oct-2019 15:47:43 testPostfix2(org.eclipse.jdt.core.groovy.tests.search.OperatorOverloadingInferencingTests)  Time elapsed: 0.538 s
06-Oct-2019 15:47:43 testMinus1(org.eclipse.jdt.core.groovy.tests.search.OperatorOverloadingInferencingTests)  Time elapsed: 0.598 s
06-Oct-2019 15:47:43 testMinus2(org.eclipse.jdt.core.groovy.tests.search.OperatorOverloadingInferencingTests)  Time elapsed: 0.152 s
06-Oct-2019 15:47:43 testNumberPlusString1(org.eclipse.jdt.core.groovy.tests.search.OperatorOverloadingInferencingTests)  Time elapsed: 0.158 s
06-Oct-2019 15:47:43 testNumberPlusString2(org.eclipse.jdt.core.groovy.tests.search.OperatorOverloadingInferencingTests)  Time elapsed: 0.185 s
06-Oct-2019 15:47:43 testCompleteExpr1(org.eclipse.jdt.core.groovy.tests.search.OperatorOverloadingInferencingTests)  Time elapsed: 0.61 s
06-Oct-2019 15:47:43 testCompleteExpr2(org.eclipse.jdt.core.groovy.tests.search.OperatorOverloadingInferencingTests)  Time elapsed: 0.156 s
06-Oct-2019 15:47:43 testCompleteExpr3(org.eclipse.jdt.core.groovy.tests.search.OperatorOverloadingInferencingTests)  Time elapsed: 0.165 s
06-Oct-2019 15:47:43 testCompleteExpr4(org.eclipse.jdt.core.groovy.tests.search.OperatorOverloadingInferencingTests)  Time elapsed: 0.162 s
06-Oct-2019 15:47:43 testCompleteExpr5(org.eclipse.jdt.core.groovy.tests.search.OperatorOverloadingInferencingTests)  Time elapsed: 0.627 s
06-Oct-2019 15:47:43 testCompleteExpr6(org.eclipse.jdt.core.groovy.tests.search.OperatorOverloadingInferencingTests)  Time elapsed: 1.15 s
06-Oct-2019 15:47:43 testCompleteExpr7(org.eclipse.jdt.core.groovy.tests.search.OperatorOverloadingInferencingTests)  Time elapsed: 0.535 s
06-Oct-2019 15:47:43 testCompleteExpr8(org.eclipse.jdt.core.groovy.tests.search.OperatorOverloadingInferencingTests)  Time elapsed: 0.599 s
06-Oct-2019 15:47:43 testEqualsCheck(org.eclipse.jdt.core.groovy.tests.search.SpockInferencingTests) skipped
06-Oct-2019 15:47:43 testDataTableChecks(org.eclipse.jdt.core.groovy.tests.search.SpockInferencingTests) skipped
06-Oct-2019 15:47:43 testGetterCheck(org.eclipse.jdt.core.groovy.tests.search.SpockInferencingTests) skipped
06-Oct-2019 15:47:43 testPropertyCheck(org.eclipse.jdt.core.groovy.tests.search.SpockInferencingTests) skipped
06-Oct-2019 15:47:43 testBasics(org.eclipse.jdt.core.groovy.tests.search.SpockInferencingTests) skipped
06-Oct-2019 15:47:43 testNonStaticReference1(org.eclipse.jdt.core.groovy.tests.search.StaticInferencingTests)  Time elapsed: 0.151 s
06-Oct-2019 15:47:43 testNonStaticReference2(org.eclipse.jdt.core.groovy.tests.search.StaticInferencingTests)  Time elapsed: 1.305 s
06-Oct-2019 15:47:43 testNonStaticReference3(org.eclipse.jdt.core.groovy.tests.search.StaticInferencingTests)  Time elapsed: 0.498 s
06-Oct-2019 15:47:43 testNonStaticReference4(org.eclipse.jdt.core.groovy.tests.search.StaticInferencingTests)  Time elapsed: 0.608 s
06-Oct-2019 15:47:43 testNonStaticReference5(org.eclipse.jdt.core.groovy.tests.search.StaticInferencingTests)  Time elapsed: 0.153 s
06-Oct-2019 15:47:43 testNonStaticReference6(org.eclipse.jdt.core.groovy.tests.search.StaticInferencingTests)  Time elapsed: 0.159 s
06-Oct-2019 15:47:43 testNonStaticReference7(org.eclipse.jdt.core.groovy.tests.search.StaticInferencingTests)  Time elapsed: 0.156 s
06-Oct-2019 15:47:43 testNonStaticReference8(org.eclipse.jdt.core.groovy.tests.search.StaticInferencingTests)  Time elapsed: 1.503 s
06-Oct-2019 15:47:43 testStaticReference1(org.eclipse.jdt.core.groovy.tests.search.StaticInferencingTests)  Time elapsed: 0.159 s
06-Oct-2019 15:47:43 testStaticReference2(org.eclipse.jdt.core.groovy.tests.search.StaticInferencingTests)  Time elapsed: 0.096 s
06-Oct-2019 15:47:43 testStaticReference3(org.eclipse.jdt.core.groovy.tests.search.StaticInferencingTests)  Time elapsed: 0.162 s
06-Oct-2019 15:47:43 testStaticReference4(org.eclipse.jdt.core.groovy.tests.search.StaticInferencingTests)  Time elapsed: 0.155 s
06-Oct-2019 15:47:43 testStaticReference5(org.eclipse.jdt.core.groovy.tests.search.StaticInferencingTests)  Time elapsed: 2.099 s
06-Oct-2019 15:47:43 testStaticReference6(org.eclipse.jdt.core.groovy.tests.search.StaticInferencingTests)  Time elapsed: 0.547 s
06-Oct-2019 15:47:43 testStaticReference7(org.eclipse.jdt.core.groovy.tests.search.StaticInferencingTests)  Time elapsed: 0.593 s
06-Oct-2019 15:47:43 testStaticReference8(org.eclipse.jdt.core.groovy.tests.search.StaticInferencingTests)  Time elapsed: 0.171 s
06-Oct-2019 15:47:43 testStaticReference9(org.eclipse.jdt.core.groovy.tests.search.StaticInferencingTests)  Time elapsed: 0.161 s
06-Oct-2019 15:47:43 testStaticImport1(org.eclipse.jdt.core.groovy.tests.search.StaticInferencingTests)  Time elapsed: 0.163 s
06-Oct-2019 15:47:43 testStaticImport2(org.eclipse.jdt.core.groovy.tests.search.StaticInferencingTests)  Time elapsed: 3.092 s
06-Oct-2019 15:47:43 testStaticImport3(org.eclipse.jdt.core.groovy.tests.search.StaticInferencingTests)  Time elapsed: 0.168 s
06-Oct-2019 15:47:43 testStaticImport4(org.eclipse.jdt.core.groovy.tests.search.StaticInferencingTests)  Time elapsed: 0.164 s
06-Oct-2019 15:47:43 testStaticImport5(org.eclipse.jdt.core.groovy.tests.search.StaticInferencingTests)  Time elapsed: 0.641 s
06-Oct-2019 15:47:43 testStaticImport6(org.eclipse.jdt.core.groovy.tests.search.StaticInferencingTests)  Time elapsed: 0.172 s
06-Oct-2019 15:47:43 testStaticImport7(org.eclipse.jdt.core.groovy.tests.search.StaticInferencingTests)  Time elapsed: 1.796 s
06-Oct-2019 15:47:43 testStaticImport8(org.eclipse.jdt.core.groovy.tests.search.StaticInferencingTests)  Time elapsed: 0.163 s
06-Oct-2019 15:47:43 testStaticImport9(org.eclipse.jdt.core.groovy.tests.search.StaticInferencingTests)  Time elapsed: 0.173 s
06-Oct-2019 15:47:43 testStaticImport10(org.eclipse.jdt.core.groovy.tests.search.StaticInferencingTests)  Time elapsed: 0.167 s
06-Oct-2019 15:47:43 testStaticImport11(org.eclipse.jdt.core.groovy.tests.search.StaticInferencingTests)  Time elapsed: 0.608 s
06-Oct-2019 15:47:43 testStaticImport12(org.eclipse.jdt.core.groovy.tests.search.StaticInferencingTests)  Time elapsed: 5.49 s
06-Oct-2019 15:47:43 testStaticImport13(org.eclipse.jdt.core.groovy.tests.search.StaticInferencingTests) skipped
06-Oct-2019 15:47:43 testStaticImport14(org.eclipse.jdt.core.groovy.tests.search.StaticInferencingTests) skipped
06-Oct-2019 15:47:43 testStaticImport15(org.eclipse.jdt.core.groovy.tests.search.StaticInferencingTests) skipped
06-Oct-2019 15:47:43 testClassReference16a(org.eclipse.jdt.core.groovy.tests.search.StaticInferencingTests)  Time elapsed: 0.155 s
06-Oct-2019 15:47:43 testClassReference17a(org.eclipse.jdt.core.groovy.tests.search.StaticInferencingTests)  Time elapsed: 0.161 s
06-Oct-2019 15:47:43 testStaticReference10a(org.eclipse.jdt.core.groovy.tests.search.StaticInferencingTests)  Time elapsed: 0.167 s
06-Oct-2019 15:47:43 testClassReference10(org.eclipse.jdt.core.groovy.tests.search.StaticInferencingTests)  Time elapsed: 0.496 s
06-Oct-2019 15:47:43 testClassReference11(org.eclipse.jdt.core.groovy.tests.search.StaticInferencingTests)  Time elapsed: 2.002 s
06-Oct-2019 15:47:43 testClassReference12(org.eclipse.jdt.core.groovy.tests.search.StaticInferencingTests)  Time elapsed: 0.161 s
06-Oct-2019 15:47:43 testClassReference13(org.eclipse.jdt.core.groovy.tests.search.StaticInferencingTests)  Time elapsed: 0.157 s
06-Oct-2019 15:47:43 testClassReference14(org.eclipse.jdt.core.groovy.tests.search.StaticInferencingTests)  Time elapsed: 0.147 s
06-Oct-2019 15:47:43 testClassReference15(org.eclipse.jdt.core.groovy.tests.search.StaticInferencingTests)  Time elapsed: 0.642 s
06-Oct-2019 15:47:43 testClassReference16(org.eclipse.jdt.core.groovy.tests.search.StaticInferencingTests)  Time elapsed: 0.164 s
06-Oct-2019 15:47:43 testClassReference17(org.eclipse.jdt.core.groovy.tests.search.StaticInferencingTests)  Time elapsed: 1.945 s
06-Oct-2019 15:47:43 testClassReference4a(org.eclipse.jdt.core.groovy.tests.search.StaticInferencingTests)  Time elapsed: 0.162 s
06-Oct-2019 15:47:43 testStaticReference10(org.eclipse.jdt.core.groovy.tests.search.StaticInferencingTests)  Time elapsed: 0.155 s
06-Oct-2019 15:47:43 testStaticReference1a(org.eclipse.jdt.core.groovy.tests.search.StaticInferencingTests)  Time elapsed: 0.163 s
06-Oct-2019 15:47:43 testStaticReference1b(org.eclipse.jdt.core.groovy.tests.search.StaticInferencingTests)  Time elapsed: 0.631 s
06-Oct-2019 15:47:43 testStaticReference9a(org.eclipse.jdt.core.groovy.tests.search.StaticInferencingTests)  Time elapsed: 1.992 s
06-Oct-2019 15:47:43 testClassReference1(org.eclipse.jdt.core.groovy.tests.search.StaticInferencingTests)  Time elapsed: 0.163 s
06-Oct-2019 15:47:43 testClassReference2(org.eclipse.jdt.core.groovy.tests.search.StaticInferencingTests)  Time elapsed: 0.156 s
06-Oct-2019 15:47:43 testClassReference3(org.eclipse.jdt.core.groovy.tests.search.StaticInferencingTests)  Time elapsed: 0.064 s
06-Oct-2019 15:47:43 testClassReference4(org.eclipse.jdt.core.groovy.tests.search.StaticInferencingTests)  Time elapsed: 0.162 s
06-Oct-2019 15:47:43 testClassReference5(org.eclipse.jdt.core.groovy.tests.search.StaticInferencingTests)  Time elapsed: 1.621 s
06-Oct-2019 15:47:43 testClassReference6(org.eclipse.jdt.core.groovy.tests.search.StaticInferencingTests)  Time elapsed: 0.167 s
06-Oct-2019 15:47:43 testClassReference7(org.eclipse.jdt.core.groovy.tests.search.StaticInferencingTests)  Time elapsed: 0.17 s
06-Oct-2019 15:47:43 testClassReference8(org.eclipse.jdt.core.groovy.tests.search.StaticInferencingTests)  Time elapsed: 0.165 s
06-Oct-2019 15:47:43 testClassReference9(org.eclipse.jdt.core.groovy.tests.search.StaticInferencingTests)  Time elapsed: 0.615 s
06-Oct-2019 15:47:43 testSyntheticAccessors1(org.eclipse.jdt.core.groovy.tests.search.SyntheticAccessorInferencingTests)  Time elapsed: 2.141 s
06-Oct-2019 15:47:43 testSyntheticAccessors2(org.eclipse.jdt.core.groovy.tests.search.SyntheticAccessorInferencingTests)  Time elapsed: 0.238 s
06-Oct-2019 15:47:43 testSyntheticAccessors3(org.eclipse.jdt.core.groovy.tests.search.SyntheticAccessorInferencingTests)  Time elapsed: 0.768 s
06-Oct-2019 15:47:43 testSyntheticAccessors4(org.eclipse.jdt.core.groovy.tests.search.SyntheticAccessorInferencingTests)  Time elapsed: 5.103 s
06-Oct-2019 15:47:43 testPublicStaticSuperMethod1(org.eclipse.jdt.core.groovy.tests.search.TraitInferencingTests)  Time elapsed: 0.21 s
06-Oct-2019 15:47:43 testPublicStaticSuperMethod2(org.eclipse.jdt.core.groovy.tests.search.TraitInferencingTests)  Time elapsed: 0.198 s
06-Oct-2019 15:47:43 testProperty10(org.eclipse.jdt.core.groovy.tests.search.TraitInferencingTests)  Time elapsed: 0.655 s
06-Oct-2019 15:47:43 testProperty11(org.eclipse.jdt.core.groovy.tests.search.TraitInferencingTests)  Time elapsed: 1.771 s
06-Oct-2019 15:47:43 testProperty12(org.eclipse.jdt.core.groovy.tests.search.TraitInferencingTests)  Time elapsed: 0.201 s
06-Oct-2019 15:47:43 testProperty13(org.eclipse.jdt.core.groovy.tests.search.TraitInferencingTests)  Time elapsed: 0.168 s
06-Oct-2019 15:47:43 testProperty14(org.eclipse.jdt.core.groovy.tests.search.TraitInferencingTests)  Time elapsed: 0.629 s
06-Oct-2019 15:47:43 testPrivateStaticField(org.eclipse.jdt.core.groovy.tests.search.TraitInferencingTests)  Time elapsed: 2.021 s
06-Oct-2019 15:47:43 testPrivateMethod1(org.eclipse.jdt.core.groovy.tests.search.TraitInferencingTests)  Time elapsed: 0.193 s
06-Oct-2019 15:47:43 testPrivateMethod2(org.eclipse.jdt.core.groovy.tests.search.TraitInferencingTests)  Time elapsed: 0.198 s
06-Oct-2019 15:47:43 testPrivateMethod3(org.eclipse.jdt.core.groovy.tests.search.TraitInferencingTests)  Time elapsed: 0.649 s
06-Oct-2019 15:47:43 testPrivateMethod4(org.eclipse.jdt.core.groovy.tests.search.TraitInferencingTests)  Time elapsed: 1.792 s
06-Oct-2019 15:47:43 testPublicStaticField(org.eclipse.jdt.core.groovy.tests.search.TraitInferencingTests)  Time elapsed: 0.204 s
06-Oct-2019 15:47:43 testPublicMethod1(org.eclipse.jdt.core.groovy.tests.search.TraitInferencingTests)  Time elapsed: 0.199 s
06-Oct-2019 15:47:43 testPublicMethod2(org.eclipse.jdt.core.groovy.tests.search.TraitInferencingTests)  Time elapsed: 0.606 s
06-Oct-2019 15:47:43 testPublicMethod3(org.eclipse.jdt.core.groovy.tests.search.TraitInferencingTests)  Time elapsed: 1.44 s
06-Oct-2019 15:47:43 testPublicMethod4(org.eclipse.jdt.core.groovy.tests.search.TraitInferencingTests)  Time elapsed: 0.207 s
06-Oct-2019 15:47:43 testPrivateStaticMethod(org.eclipse.jdt.core.groovy.tests.search.TraitInferencingTests)  Time elapsed: 0.208 s
06-Oct-2019 15:47:43 testProperty1(org.eclipse.jdt.core.groovy.tests.search.TraitInferencingTests)  Time elapsed: 0.693 s
06-Oct-2019 15:47:43 testProperty2(org.eclipse.jdt.core.groovy.tests.search.TraitInferencingTests)  Time elapsed: 1.643 s
06-Oct-2019 15:47:43 testProperty3(org.eclipse.jdt.core.groovy.tests.search.TraitInferencingTests)  Time elapsed: 0.198 s
06-Oct-2019 15:47:43 testProperty4(org.eclipse.jdt.core.groovy.tests.search.TraitInferencingTests)  Time elapsed: 0.203 s
06-Oct-2019 15:47:43 testProperty5(org.eclipse.jdt.core.groovy.tests.search.TraitInferencingTests)  Time elapsed: 0.598 s
06-Oct-2019 15:47:43 testProperty6(org.eclipse.jdt.core.groovy.tests.search.TraitInferencingTests)  Time elapsed: 1.482 s
06-Oct-2019 15:47:43 testProperty7(org.eclipse.jdt.core.groovy.tests.search.TraitInferencingTests)  Time elapsed: 0.236 s
06-Oct-2019 15:47:43 testProperty8(org.eclipse.jdt.core.groovy.tests.search.TraitInferencingTests)  Time elapsed: 0.225 s
06-Oct-2019 15:47:43 testProperty9(org.eclipse.jdt.core.groovy.tests.search.TraitInferencingTests)  Time elapsed: 0.656 s
06-Oct-2019 15:47:43 testPublicStaticFinalField(org.eclipse.jdt.core.groovy.tests.search.TraitInferencingTests)  Time elapsed: 1.507 s
06-Oct-2019 15:47:43 testPublicField1(org.eclipse.jdt.core.groovy.tests.search.TraitInferencingTests)  Time elapsed: 0.203 s
06-Oct-2019 15:47:43 testPublicField2(org.eclipse.jdt.core.groovy.tests.search.TraitInferencingTests)  Time elapsed: 0.164 s
06-Oct-2019 15:47:43 testPrivateStaticFinalField(org.eclipse.jdt.core.groovy.tests.search.TraitInferencingTests)  Time elapsed: 0.633 s
06-Oct-2019 15:47:43 testPrivateField1(org.eclipse.jdt.core.groovy.tests.search.TraitInferencingTests)  Time elapsed: 1.522 s
06-Oct-2019 15:47:43 testPrivateField2(org.eclipse.jdt.core.groovy.tests.search.TraitInferencingTests)  Time elapsed: 0.204 s
06-Oct-2019 15:47:43 testFindClassDeclarationWithPattern(org.eclipse.jdt.core.groovy.tests.search.TypeReferenceSearchTests)  Time elapsed: 0.418 s
06-Oct-2019 15:47:43 testInnerTypes1(org.eclipse.jdt.core.groovy.tests.search.TypeReferenceSearchTests)  Time elapsed: 1.116 s
06-Oct-2019 15:47:43 testInnerTypes2(org.eclipse.jdt.core.groovy.tests.search.TypeReferenceSearchTests)  Time elapsed: 1.878 s
06-Oct-2019 15:47:43 testInnerTypes3(org.eclipse.jdt.core.groovy.tests.search.TypeReferenceSearchTests)  Time elapsed: 1.116 s
06-Oct-2019 15:47:43 testSearchForTypesScript1(org.eclipse.jdt.core.groovy.tests.search.TypeReferenceSearchTests)  Time elapsed: 0.187 s
06-Oct-2019 15:47:43 testSearchForTypesScript2(org.eclipse.jdt.core.groovy.tests.search.TypeReferenceSearchTests)  Time elapsed: 0.171 s
06-Oct-2019 15:47:43 testSearchForTypesScript3(org.eclipse.jdt.core.groovy.tests.search.TypeReferenceSearchTests)  Time elapsed: 0.17 s
06-Oct-2019 15:47:43 testSearchForTypesScript4(org.eclipse.jdt.core.groovy.tests.search.TypeReferenceSearchTests)  Time elapsed: 1.043 s
06-Oct-2019 15:47:43 testSearchForTypesScript5(org.eclipse.jdt.core.groovy.tests.search.TypeReferenceSearchTests)  Time elapsed: 0.168 s
06-Oct-2019 15:47:43 testSearchForTypesScript6(org.eclipse.jdt.core.groovy.tests.search.TypeReferenceSearchTests)  Time elapsed: 0.161 s
06-Oct-2019 15:47:43 testShouldntFindClassDeclarationInScript(org.eclipse.jdt.core.groovy.tests.search.TypeReferenceSearchTests)  Time elapsed: 0.192 s
06-Oct-2019 15:47:43 testSearchForTypesArray1(org.eclipse.jdt.core.groovy.tests.search.TypeReferenceSearchTests)  Time elapsed: 1.287 s
06-Oct-2019 15:47:43 testSearchForTypesClass1(org.eclipse.jdt.core.groovy.tests.search.TypeReferenceSearchTests)  Time elapsed: 0.072 s
06-Oct-2019 15:47:43 testSearchForTypesClass2(org.eclipse.jdt.core.groovy.tests.search.TypeReferenceSearchTests)  Time elapsed: 0.094 s
06-Oct-2019 15:47:43 testSearchForTypesClass3(org.eclipse.jdt.core.groovy.tests.search.TypeReferenceSearchTests)  Time elapsed: 0.103 s
06-Oct-2019 15:47:43 testSearchForTypesClass4(org.eclipse.jdt.core.groovy.tests.search.TypeReferenceSearchTests)  Time elapsed: 0.107 s
06-Oct-2019 15:47:43 testSearchForTypesClass5(org.eclipse.jdt.core.groovy.tests.search.TypeReferenceSearchTests)  Time elapsed: 0.168 s
06-Oct-2019 15:47:43 testSearchForTypesClass6(org.eclipse.jdt.core.groovy.tests.search.TypeReferenceSearchTests)  Time elapsed: 0.927 s
06-Oct-2019 15:47:43 testSearchForTypesClass7(org.eclipse.jdt.core.groovy.tests.search.TypeReferenceSearchTests)  Time elapsed: 0.176 s
06-Oct-2019 15:47:43 testSearchForTypesClosure1(org.eclipse.jdt.core.groovy.tests.search.TypeReferenceSearchTests)  Time elapsed: 0.195 s
06-Oct-2019 15:47:43 testSearchForTypesClosure2(org.eclipse.jdt.core.groovy.tests.search.TypeReferenceSearchTests)  Time elapsed: 0.171 s
06-Oct-2019 15:47:43 testSearchForTypesClosure3(org.eclipse.jdt.core.groovy.tests.search.TypeReferenceSearchTests)  Time elapsed: 0.173 s
06-Oct-2019 15:47:43 testCoercion1(org.eclipse.jdt.core.groovy.tests.search.TypeReferenceSearchTests)  Time elapsed: 1.302 s
06-Oct-2019 15:47:43 testGenerics1(org.eclipse.jdt.core.groovy.tests.search.TypeReferenceSearchTests)  Time elapsed: 0.072 s
06-Oct-2019 15:47:43 testFindClassDeclaration(org.eclipse.jdt.core.groovy.tests.search.TypeReferenceSearchTests)  Time elapsed: 0.075 s
06-Oct-2019 15:47:43 testConstructorWithDefaultArgsInCompileStatic(org.eclipse.jdt.core.groovy.tests.search.TypeReferenceSearchTests)  Time elapsed: 0.9 s
06-Oct-2019 15:47:43
06-Oct-2019 15:47:43 Results:
06-Oct-2019 15:47:43
06-Oct-2019 15:47:43 Failures:
06-Oct-2019 15:47:43   BasicGroovyBuildTests.testProjectBasedirAsOutputLocation:274->BuilderTestSuite.expectingCompiledClasses:215->BuilderTestSuite.expectingCompiling:231 unexpected recompiled units. lenExpected=1 lenActual=2 expected:<{p.Script[]}> but was:<{p.Script[,p.Script]}>
06-Oct-2019 15:47:43   BasicGroovyBuildTests.testUpdateProjectPreferences:3328->BuilderTestSuite.expectingNoProblems:244->BuilderTestSuite.expectingNoProblemsFor:249
06-Oct-2019 15:47:43 ----------- Expected ------------
06-Oct-2019 15:47:43
06-Oct-2019 15:47:43 ------------ but was ------------
06-Oct-2019 15:47:43 Problem : The import util.MyException is never used [ resource : </Project/src/p/Test.java> range : <18,34> category : <120> severity : <1>]
06-Oct-2019 15:47:43
06-Oct-2019 15:47:43 --------- Difference is ----------
06-Oct-2019 15:47:43 expected:<[]> but was:<[Problem : The import util.MyException is never used [ resource : </Project/src/p/Test.java> range : <18,34> category : <120> severity : <1>]
06-Oct-2019 15:47:43 ]>
06-Oct-2019 15:47:43   ClosureInferencingTests.testClosure16:404->InferencingTestSuite.assertType:59->InferencingTestSuite.assertType:64->InferencingTestSuite.assertType:83 Expected type not found.
06-Oct-2019 15:47:43 Expected: C
06-Oct-2019 15:47:43 Found: java.lang.Object
06-Oct-2019 15:47:43 Declaring type: B
06-Oct-2019 15:47:43 ASTNode: org.codehaus.groovy.ast.expr.VariableExpression@11d5c2[variable: xxx]
06-Oct-2019 15:47:43 Confidence: UNKNOWN
06-Oct-2019 15:47:43
06-Oct-2019 15:47:43   ClosureInferencingTests.testWithAndClosure6:1234->InferencingTestSuite.assertDeclaringType:105->InferencingTestSuite.assertDeclaringType:109->InferencingTestSuite.assertDeclaringType:122 Expected declaring type not found.
06-Oct-2019 15:47:43         Expected: p.A
06-Oct-2019 15:47:43         Found type: java.lang.String
06-Oct-2019 15:47:43         Found declaring type: java.lang.Object
06-Oct-2019 15:47:43         ASTNode: org.codehaus.groovy.ast.expr.ConstantExpression@1146f6[foo]
06-Oct-2019 15:47:43   DGMInferencingTests.testDGM17:248->assertExprType:34->InferencingTestSuite.assertType:59->InferencingTestSuite.assertType:64->InferencingTestSuite.assertType:83 Expected type not found.
06-Oct-2019 15:47:43 Expected: java.lang.Integer
06-Oct-2019 15:47:43 Found: java.lang.Object
06-Oct-2019 15:47:43 Declaring type: Search
06-Oct-2019 15:47:43 ASTNode: org.codehaus.groovy.ast.expr.VariableExpression@f6236[variable: value]
06-Oct-2019 15:47:43 Confidence: INFERRED
06-Oct-2019 15:47:43
06-Oct-2019 15:47:43   DGMInferencingTests.testDGM23:308->assertExprType:34->InferencingTestSuite.assertType:59->InferencingTestSuite.assertType:64->InferencingTestSuite.assertType:83 Expected type not found.
06-Oct-2019 15:47:43 Expected: java.lang.String
06-Oct-2019 15:47:43 Found: java.lang.Object
06-Oct-2019 15:47:43 Declaring type: Search
06-Oct-2019 15:47:43 ASTNode: org.codehaus.groovy.ast.expr.VariableExpression@f2252[variable: key]
06-Oct-2019 15:47:43 Confidence: INFERRED
06-Oct-2019 15:47:43
06-Oct-2019 15:47:43   DGMInferencingTests.testDGM8:157->assertExprType:34->InferencingTestSuite.assertType:59->InferencingTestSuite.assertType:64->InferencingTestSuite.assertType:83 Expected type not found.
06-Oct-2019 15:47:43 Expected: java.lang.Integer
06-Oct-2019 15:47:43 Found: java.lang.Object
06-Oct-2019 15:47:43 Declaring type: Search
06-Oct-2019 15:47:43 ASTNode: org.codehaus.groovy.ast.expr.VariableExpression@f4426[variable: value]
06-Oct-2019 15:47:43 Confidence: INFERRED
06-Oct-2019 15:47:43
06-Oct-2019 15:47:43   DGMInferencingTests.testDGMDeclaring3:958->assertDeclType:30->InferencingTestSuite.assertDeclaringType:101->InferencingTestSuite.assertDeclaringType:105->InferencingTestSuite.assertDeclaringType:109->InferencingTestSuite.assertDeclaringType:122 Expected declaring type not found.
06-Oct-2019 15:47:43         Expected: org.codehaus.groovy.runtime.IOGroovyMethods
06-Oct-2019 15:47:43         Found type: java.lang.String
06-Oct-2019 15:47:43         Found declaring type: java.io.Writer
06-Oct-2019 15:47:43         ASTNode: org.codehaus.groovy.ast.expr.ConstantExpression@f0bcc[leftShift]
06-Oct-2019 15:47:43   DGMInferencingTests.testStaticMixinDGM:1007->assertDeclType:30->InferencingTestSuite.assertDeclaringType:101->InferencingTestSuite.assertDeclaringType:105->InferencingTestSuite.assertDeclaringType:109->InferencingTestSuite.assertDeclaringType:122 Expected declaring type not found.
06-Oct-2019 15:47:43         Expected: org.codehaus.groovy.runtime.DefaultGroovyMethods
06-Oct-2019 15:47:43         Found type: java.lang.String
06-Oct-2019 15:47:43         Found declaring type: java.lang.String
06-Oct-2019 15:47:43         ASTNode: org.codehaus.groovy.ast.expr.ConstantExpression@10f08a[mixin]
06-Oct-2019 15:47:43   OperatorOverloadingInferencingTests.testGetAt9:285->InferencingTestSuite.assertType:59->InferencingTestSuite.assertType:64->InferencingTestSuite.assertType:83 Expected type not found.
06-Oct-2019 15:47:43 Expected: java.lang.Boolean
06-Oct-2019 15:47:43 Found: java.util.BitSet
06-Oct-2019 15:47:43 Declaring type: Search
06-Oct-2019 15:47:43 ASTNode: org.codehaus.groovy.ast.expr.VariableExpression@fed3e[variable: xxx]
06-Oct-2019 15:47:43 Confidence: INFERRED
06-Oct-2019 15:47:43
06-Oct-2019 15:47:43
06-Oct-2019 15:47:43 Tests run: 6039, Failures: 10, Errors: 0, Skipped: 111
06-Oct-2019 15:47:43
06-Oct-2019 15:47:46
06-Oct-2019 15:47:46 !ENTRY org.eclipse.core.resources 2 10035 2019-10-06 15:47:46.204
06-Oct-2019 15:47:46 !MESSAGE The workspace will exit with unsaved changes in this session.
06-Oct-2019 15:47:46 [ERROR] There are test failures.
06-Oct-2019 15:47:46
06-Oct-2019 15:47:46 Please refer to /opt/bamboo-home/xml-data/build-dir/GRECLIPSE-E410-JOB1/ide-test/org.codehaus.groovy.alltests/target/surefire-reports for the individual test results.
06-Oct-2019 15:47:46 [INFO]
06-Oct-2019 15:47:46 [INFO] --- maven-install-plugin:2.3.1:install (default-install) @ org.codehaus.groovy.alltests ---
06-Oct-2019 15:47:46 [INFO] Installing /opt/bamboo-home/xml-data/build-dir/GRECLIPSE-E410-JOB1/ide-test/org.codehaus.groovy.alltests/target/org.codehaus.groovy.alltests-3.6.0-SNAPSHOT.jar to /home/bamboo/.m2/repository/org/codehaus/groovy/eclipse/org.codehaus.groovy.alltests/3.6.0-SNAPSHOT/org.codehaus.groovy.alltests-3.6.0-SNAPSHOT.jar
06-Oct-2019 15:47:46 [INFO] Installing /opt/bamboo-home/xml-data/build-dir/GRECLIPSE-E410-JOB1/ide-test/org.codehaus.groovy.alltests/pom.xml to /home/bamboo/.m2/repository/org/codehaus/groovy/eclipse/org.codehaus.groovy.alltests/3.6.0-SNAPSHOT/org.codehaus.groovy.alltests-3.6.0-SNAPSHOT.pom
06-Oct-2019 15:47:46 [INFO] Installing /opt/bamboo-home/xml-data/build-dir/GRECLIPSE-E410-JOB1/ide-test/org.codehaus.groovy.alltests/target/org.codehaus.groovy.alltests-3.6.0-SNAPSHOT-sources.jar to /home/bamboo/.m2/repository/org/codehaus/groovy/eclipse/org.codehaus.groovy.alltests/3.6.0-SNAPSHOT/org.codehaus.groovy.alltests-3.6.0-SNAPSHOT-sources.jar
06-Oct-2019 15:47:46 [INFO] Installing /opt/bamboo-home/xml-data/build-dir/GRECLIPSE-E410-JOB1/ide-test/org.codehaus.groovy.alltests/target/p2content.xml to /home/bamboo/.m2/repository/org/codehaus/groovy/eclipse/org.codehaus.groovy.alltests/3.6.0-SNAPSHOT/org.codehaus.groovy.alltests-3.6.0-SNAPSHOT-p2metadata.xml
06-Oct-2019 15:47:46 [INFO] Installing /opt/bamboo-home/xml-data/build-dir/GRECLIPSE-E410-JOB1/ide-test/org.codehaus.groovy.alltests/target/p2artifacts.xml to /home/bamboo/.m2/repository/org/codehaus/groovy/eclipse/org.codehaus.groovy.alltests/3.6.0-SNAPSHOT/org.codehaus.groovy.alltests-3.6.0-SNAPSHOT-p2artifacts.xml
06-Oct-2019 15:47:46 [INFO] Installing /opt/bamboo-home/xml-data/build-dir/GRECLIPSE-E410-JOB1/ide-test/org.codehaus.groovy.alltests/target/p2content.xml to /home/bamboo/.m2/repository/org/codehaus/groovy/eclipse/org.codehaus.groovy.alltests/3.6.0-SNAPSHOT/org.codehaus.groovy.alltests-3.6.0-SNAPSHOT-p2metadata.xml
06-Oct-2019 15:47:46 [INFO] Installing /opt/bamboo-home/xml-data/build-dir/GRECLIPSE-E410-JOB1/ide-test/org.codehaus.groovy.alltests/target/p2artifacts.xml to /home/bamboo/.m2/repository/org/codehaus/groovy/eclipse/org.codehaus.groovy.alltests/3.6.0-SNAPSHOT/org.codehaus.groovy.alltests-3.6.0-SNAPSHOT-p2artifacts.xml
06-Oct-2019 15:47:46 [INFO]
06-Oct-2019 15:47:46 [INFO] --- tycho-p2-plugin:1.4.0:update-local-index (default-update-local-index) @ org.codehaus.groovy.alltests ---
06-Oct-2019 15:47:46 [INFO]
06-Oct-2019 15:47:46 [INFO] --- maven-deploy-plugin:2.8.2:deploy (default-deploy) @ org.codehaus.groovy.alltests ---
06-Oct-2019 15:47:46 [INFO] Skipping artifact deployment
06-Oct-2019 15:47:46 [INFO]                                                                         
06-Oct-2019 15:47:46 [INFO] ------------------------------------------------------------------------
06-Oct-2019 15:47:46 [INFO] Building org.codehaus.groovy.m2eclipse 3.6.0-SNAPSHOT
06-Oct-2019 15:47:46 [INFO] ------------------------------------------------------------------------
06-Oct-2019 15:47:46 [INFO]
06-Oct-2019 15:47:46 [INFO] --- maven-clean-plugin:2.5:clean (default-clean) @ org.codehaus.groovy.m2eclipse ---
06-Oct-2019 15:47:46 [INFO]
06-Oct-2019 15:47:46 [INFO] --- tycho-packaging-plugin:1.4.0:build-qualifier (default-build-qualifier) @ org.codehaus.groovy.m2eclipse ---
06-Oct-2019 15:47:46 [INFO] The project's OSGi version is 3.6.0.v201910061416-e1812
06-Oct-2019 15:47:46 [INFO]
06-Oct-2019 15:47:46 [INFO] --- tycho-packaging-plugin:1.4.0:validate-id (default-validate-id) @ org.codehaus.groovy.m2eclipse ---
06-Oct-2019 15:47:46 [INFO]
06-Oct-2019 15:47:46 [INFO] --- tycho-packaging-plugin:1.4.0:validate-version (default-validate-version) @ org.codehaus.groovy.m2eclipse ---
06-Oct-2019 15:47:46 [INFO]
06-Oct-2019 15:47:46 [INFO] --- properties-maven-plugin:1.0.0:read-project-properties (default) @ org.codehaus.groovy.m2eclipse ---
06-Oct-2019 15:47:46 [INFO]
06-Oct-2019 15:47:46 [INFO] --- maven-resources-plugin:2.4.3:resources (default-resources) @ org.codehaus.groovy.m2eclipse ---
06-Oct-2019 15:47:46 [INFO] Using 'UTF-8' encoding to copy filtered resources.
06-Oct-2019 15:47:46 [INFO] skip non existing resourceDirectory /opt/bamboo-home/xml-data/build-dir/GRECLIPSE-E410-JOB1/extras/org.codehaus.groovy.m2eclipse/src/main/resources
06-Oct-2019 15:47:46 [INFO]
06-Oct-2019 15:47:46 [INFO] --- tycho-compiler-plugin:1.4.0:compile (default-compile) @ org.codehaus.groovy.m2eclipse ---
06-Oct-2019 15:47:46 [INFO] Compiling 2 source files to /opt/bamboo-home/xml-data/build-dir/GRECLIPSE-E410-JOB1/extras/org.codehaus.groovy.m2eclipse/target/classes
06-Oct-2019 15:47:46 [INFO]
06-Oct-2019 15:47:46 [INFO] --- maven-resources-plugin:2.4.3:testResources (default-testResources) @ org.codehaus.groovy.m2eclipse ---
06-Oct-2019 15:47:46 [INFO] Using 'UTF-8' encoding to copy filtered resources.
06-Oct-2019 15:47:46 [INFO] skip non existing resourceDirectory /opt/bamboo-home/xml-data/build-dir/GRECLIPSE-E410-JOB1/extras/org.codehaus.groovy.m2eclipse/src/test/resources
06-Oct-2019 15:47:46 [INFO]
06-Oct-2019 15:47:46 [INFO] --- tycho-source-plugin:1.4.0:plugin-source (plugin-source) @ org.codehaus.groovy.m2eclipse ---
06-Oct-2019 15:47:46 [INFO] Building jar: /opt/bamboo-home/xml-data/build-dir/GRECLIPSE-E410-JOB1/extras/org.codehaus.groovy.m2eclipse/target/org.codehaus.groovy.m2eclipse-3.6.0-SNAPSHOT-sources.jar
06-Oct-2019 15:47:46 [INFO]
06-Oct-2019 15:47:46 [INFO] --- target-platform-configuration:1.4.0:target-platform (default-target-platform) @ org.codehaus.groovy.m2eclipse ---
06-Oct-2019 15:47:46 [INFO]
06-Oct-2019 15:47:46 [INFO] --- tycho-packaging-plugin:1.4.0:package-plugin (default-package-plugin) @ org.codehaus.groovy.m2eclipse ---
06-Oct-2019 15:47:46 [INFO] Building jar: /opt/bamboo-home/xml-data/build-dir/GRECLIPSE-E410-JOB1/extras/org.codehaus.groovy.m2eclipse/target/org.codehaus.groovy.m2eclipse-3.6.0-SNAPSHOT.jar
06-Oct-2019 15:47:46 [INFO]
06-Oct-2019 15:47:46 [INFO] --- tycho-p2-plugin:1.4.0:p2-metadata-default (default-p2-metadata-default) @ org.codehaus.groovy.m2eclipse ---
06-Oct-2019 15:47:46 [INFO]
06-Oct-2019 15:47:46 [INFO] --- maven-jarsigner-plugin:1.4:sign (sign) @ org.codehaus.groovy.m2eclipse ---
06-Oct-2019 15:47:47 [INFO] 2 archive(s) processed
06-Oct-2019 15:47:47 [INFO]
06-Oct-2019 15:47:47 [INFO] --- tycho-source-feature-plugin:1.4.0:source-feature (source-feature) @ org.codehaus.groovy.m2eclipse ---
06-Oct-2019 15:47:47 [INFO]
06-Oct-2019 15:47:47 [INFO] --- tycho-p2-plugin:1.4.0:p2-metadata (attach-p2-metadata) @ org.codehaus.groovy.m2eclipse ---
06-Oct-2019 15:47:47 [INFO]
06-Oct-2019 15:47:47 [INFO] --- maven-install-plugin:2.3.1:install (default-install) @ org.codehaus.groovy.m2eclipse ---
06-Oct-2019 15:47:47 [INFO] Installing /opt/bamboo-home/xml-data/build-dir/GRECLIPSE-E410-JOB1/extras/org.codehaus.groovy.m2eclipse/target/org.codehaus.groovy.m2eclipse-3.6.0-SNAPSHOT.jar to /home/bamboo/.m2/repository/org/codehaus/groovy/eclipse/org.codehaus.groovy.m2eclipse/3.6.0-SNAPSHOT/org.codehaus.groovy.m2eclipse-3.6.0-SNAPSHOT.jar
06-Oct-2019 15:47:47 [INFO] Installing /opt/bamboo-home/xml-data/build-dir/GRECLIPSE-E410-JOB1/extras/org.codehaus.groovy.m2eclipse/pom.xml to /home/bamboo/.m2/repository/org/codehaus/groovy/eclipse/org.codehaus.groovy.m2eclipse/3.6.0-SNAPSHOT/org.codehaus.groovy.m2eclipse-3.6.0-SNAPSHOT.pom
06-Oct-2019 15:47:47 [INFO] Installing /opt/bamboo-home/xml-data/build-dir/GRECLIPSE-E410-JOB1/extras/org.codehaus.groovy.m2eclipse/target/org.codehaus.groovy.m2eclipse-3.6.0-SNAPSHOT-sources.jar to /home/bamboo/.m2/repository/org/codehaus/groovy/eclipse/org.codehaus.groovy.m2eclipse/3.6.0-SNAPSHOT/org.codehaus.groovy.m2eclipse-3.6.0-SNAPSHOT-sources.jar
06-Oct-2019 15:47:47 [INFO] Installing /opt/bamboo-home/xml-data/build-dir/GRECLIPSE-E410-JOB1/extras/org.codehaus.groovy.m2eclipse/target/p2content.xml to /home/bamboo/.m2/repository/org/codehaus/groovy/eclipse/org.codehaus.groovy.m2eclipse/3.6.0-SNAPSHOT/org.codehaus.groovy.m2eclipse-3.6.0-SNAPSHOT-p2metadata.xml
06-Oct-2019 15:47:47 [INFO] Installing /opt/bamboo-home/xml-data/build-dir/GRECLIPSE-E410-JOB1/extras/org.codehaus.groovy.m2eclipse/target/p2artifacts.xml to /home/bamboo/.m2/repository/org/codehaus/groovy/eclipse/org.codehaus.groovy.m2eclipse/3.6.0-SNAPSHOT/org.codehaus.groovy.m2eclipse-3.6.0-SNAPSHOT-p2artifacts.xml
06-Oct-2019 15:47:47 [INFO] Installing /opt/bamboo-home/xml-data/build-dir/GRECLIPSE-E410-JOB1/extras/org.codehaus.groovy.m2eclipse/target/p2content.xml to /home/bamboo/.m2/repository/org/codehaus/groovy/eclipse/org.codehaus.groovy.m2eclipse/3.6.0-SNAPSHOT/org.codehaus.groovy.m2eclipse-3.6.0-SNAPSHOT-p2metadata.xml
06-Oct-2019 15:47:47 [INFO] Installing /opt/bamboo-home/xml-data/build-dir/GRECLIPSE-E410-JOB1/extras/org.codehaus.groovy.m2eclipse/target/p2artifacts.xml to /home/bamboo/.m2/repository/org/codehaus/groovy/eclipse/org.codehaus.groovy.m2eclipse/3.6.0-SNAPSHOT/org.codehaus.groovy.m2eclipse-3.6.0-SNAPSHOT-p2artifacts.xml
06-Oct-2019 15:47:47 [INFO]
06-Oct-2019 15:47:47 [INFO] --- tycho-p2-plugin:1.4.0:update-local-index (default-update-local-index) @ org.codehaus.groovy.m2eclipse ---
06-Oct-2019 15:47:47 [INFO]
06-Oct-2019 15:47:47 [INFO] --- maven-deploy-plugin:2.8.2:deploy (default-deploy) @ org.codehaus.groovy.m2eclipse ---
06-Oct-2019 15:47:47 [INFO] Skipping artifact deployment
06-Oct-2019 15:47:47 [INFO]                                                                         
06-Oct-2019 15:47:47 [INFO] ------------------------------------------------------------------------
06-Oct-2019 15:47:47 [INFO] Building org.codehaus.groovy.m2eclipse.feature 3.6.0-SNAPSHOT
06-Oct-2019 15:47:47 [INFO] ------------------------------------------------------------------------
06-Oct-2019 15:47:47 [INFO]
06-Oct-2019 15:47:47 [INFO] --- maven-clean-plugin:2.5:clean (default-clean) @ org.codehaus.groovy.m2eclipse.feature ---
06-Oct-2019 15:47:47 [INFO] Deleting /opt/bamboo-home/xml-data/build-dir/GRECLIPSE-E410-JOB1/extras/Feature-org.codehaus.groovy.m2eclipse/target
06-Oct-2019 15:47:47 [INFO]
06-Oct-2019 15:47:47 [INFO] --- tycho-packaging-plugin:1.4.0:build-qualifier-aggregator (default-build-qualifier-aggregator) @ org.codehaus.groovy.m2eclipse.feature ---
06-Oct-2019 15:47:47 [INFO] The project's OSGi version is 3.6.0.v201910061416-e1812
06-Oct-2019 15:47:47 [INFO]
06-Oct-2019 15:47:47 [INFO] --- tycho-packaging-plugin:1.4.0:validate-id (default-validate-id) @ org.codehaus.groovy.m2eclipse.feature ---
06-Oct-2019 15:47:47 [INFO]
06-Oct-2019 15:47:47 [INFO] --- tycho-packaging-plugin:1.4.0:validate-version (default-validate-version) @ org.codehaus.groovy.m2eclipse.feature ---
06-Oct-2019 15:47:47 [INFO]
06-Oct-2019 15:47:47 [INFO] --- properties-maven-plugin:1.0.0:read-project-properties (default) @ org.codehaus.groovy.m2eclipse.feature ---
06-Oct-2019 15:47:47 [INFO]
06-Oct-2019 15:47:47 [INFO] --- tycho-source-plugin:1.4.0:plugin-source (plugin-source) @ org.codehaus.groovy.m2eclipse.feature ---
06-Oct-2019 15:47:47 [INFO]
06-Oct-2019 15:47:47 [INFO] --- target-platform-configuration:1.4.0:target-platform (default-target-platform) @ org.codehaus.groovy.m2eclipse.feature ---
06-Oct-2019 15:47:47 [INFO]
06-Oct-2019 15:47:47 [INFO] --- tycho-packaging-plugin:1.4.0:package-feature (default-package-feature) @ org.codehaus.groovy.m2eclipse.feature ---
06-Oct-2019 15:47:47 [INFO] Building jar: /opt/bamboo-home/xml-data/build-dir/GRECLIPSE-E410-JOB1/extras/Feature-org.codehaus.groovy.m2eclipse/target/org.codehaus.groovy.m2eclipse.feature-3.6.0-SNAPSHOT.jar
06-Oct-2019 15:47:47 [INFO]
06-Oct-2019 15:47:47 [INFO] --- tycho-p2-plugin:1.4.0:p2-metadata-default (default-p2-metadata-default) @ org.codehaus.groovy.m2eclipse.feature ---
06-Oct-2019 15:47:47 [INFO]
06-Oct-2019 15:47:47 [INFO] --- tycho-p2-plugin:1.4.0:feature-p2-metadata (default-feature-p2-metadata) @ org.codehaus.groovy.m2eclipse.feature ---
06-Oct-2019 15:47:47 [INFO]
06-Oct-2019 15:47:47 [INFO] --- maven-jarsigner-plugin:1.4:sign (sign) @ org.codehaus.groovy.m2eclipse.feature ---
06-Oct-2019 15:47:47 [INFO] 1 archive(s) processed
06-Oct-2019 15:47:47 [INFO]
06-Oct-2019 15:47:47 [INFO] --- tycho-source-feature-plugin:1.4.0:source-feature (source-feature) @ org.codehaus.groovy.m2eclipse.feature ---
06-Oct-2019 15:47:47 [INFO] Building jar: /opt/bamboo-home/xml-data/build-dir/GRECLIPSE-E410-JOB1/extras/Feature-org.codehaus.groovy.m2eclipse/target/org.codehaus.groovy.m2eclipse.feature-3.6.0-SNAPSHOT-sources-feature.jar
06-Oct-2019 15:47:47 [INFO]
06-Oct-2019 15:47:47 [INFO] --- tycho-p2-plugin:1.4.0:p2-metadata (attach-p2-metadata) @ org.codehaus.groovy.m2eclipse.feature ---
06-Oct-2019 15:47:47 [INFO]
06-Oct-2019 15:47:47 [INFO] --- maven-install-plugin:2.3.1:install (default-install) @ org.codehaus.groovy.m2eclipse.feature ---
06-Oct-2019 15:47:47 [INFO] Installing /opt/bamboo-home/xml-data/build-dir/GRECLIPSE-E410-JOB1/extras/Feature-org.codehaus.groovy.m2eclipse/target/org.codehaus.groovy.m2eclipse.feature-3.6.0-SNAPSHOT.jar to /home/bamboo/.m2/repository/org/codehaus/groovy/eclipse/org.codehaus.groovy.m2eclipse.feature/3.6.0-SNAPSHOT/org.codehaus.groovy.m2eclipse.feature-3.6.0-SNAPSHOT.jar
06-Oct-2019 15:47:47 [INFO] Installing /opt/bamboo-home/xml-data/build-dir/GRECLIPSE-E410-JOB1/extras/Feature-org.codehaus.groovy.m2eclipse/pom.xml to /home/bamboo/.m2/repository/org/codehaus/groovy/eclipse/org.codehaus.groovy.m2eclipse.feature/3.6.0-SNAPSHOT/org.codehaus.groovy.m2eclipse.feature-3.6.0-SNAPSHOT.pom
06-Oct-2019 15:47:47 [INFO] Installing /opt/bamboo-home/xml-data/build-dir/GRECLIPSE-E410-JOB1/extras/Feature-org.codehaus.groovy.m2eclipse/target/p2content.xml to /home/bamboo/.m2/repository/org/codehaus/groovy/eclipse/org.codehaus.groovy.m2eclipse.feature/3.6.0-SNAPSHOT/org.codehaus.groovy.m2eclipse.feature-3.6.0-SNAPSHOT-p2metadata.xml
06-Oct-2019 15:47:47 [INFO] Installing /opt/bamboo-home/xml-data/build-dir/GRECLIPSE-E410-JOB1/extras/Feature-org.codehaus.groovy.m2eclipse/target/p2artifacts.xml to /home/bamboo/.m2/repository/org/codehaus/groovy/eclipse/org.codehaus.groovy.m2eclipse.feature/3.6.0-SNAPSHOT/org.codehaus.groovy.m2eclipse.feature-3.6.0-SNAPSHOT-p2artifacts.xml
06-Oct-2019 15:47:47 [INFO] Installing /opt/bamboo-home/xml-data/build-dir/GRECLIPSE-E410-JOB1/extras/Feature-org.codehaus.groovy.m2eclipse/target/org.codehaus.groovy.m2eclipse.feature-3.6.0-SNAPSHOT-sources-feature.jar to /home/bamboo/.m2/repository/org/codehaus/groovy/eclipse/org.codehaus.groovy.m2eclipse.feature/3.6.0-SNAPSHOT/org.codehaus.groovy.m2eclipse.feature-3.6.0-SNAPSHOT-sources-feature.jar
06-Oct-2019 15:47:47 [INFO] Installing /opt/bamboo-home/xml-data/build-dir/GRECLIPSE-E410-JOB1/extras/Feature-org.codehaus.groovy.m2eclipse/target/p2content.xml to /home/bamboo/.m2/repository/org/codehaus/groovy/eclipse/org.codehaus.groovy.m2eclipse.feature/3.6.0-SNAPSHOT/org.codehaus.groovy.m2eclipse.feature-3.6.0-SNAPSHOT-p2metadata.xml
06-Oct-2019 15:47:47 [INFO] Installing /opt/bamboo-home/xml-data/build-dir/GRECLIPSE-E410-JOB1/extras/Feature-org.codehaus.groovy.m2eclipse/target/p2artifacts.xml to /home/bamboo/.m2/repository/org/codehaus/groovy/eclipse/org.codehaus.groovy.m2eclipse.feature/3.6.0-SNAPSHOT/org.codehaus.groovy.m2eclipse.feature-3.6.0-SNAPSHOT-p2artifacts.xml
06-Oct-2019 15:47:47 [INFO]
06-Oct-2019 15:47:47 [INFO] --- tycho-p2-plugin:1.4.0:update-local-index (default-update-local-index) @ org.codehaus.groovy.m2eclipse.feature ---
06-Oct-2019 15:47:47 [INFO]
06-Oct-2019 15:47:47 [INFO] --- maven-deploy-plugin:2.8.2:deploy (default-deploy) @ org.codehaus.groovy.m2eclipse.feature ---
06-Oct-2019 15:47:47 [INFO] Skipping artifact deployment
06-Oct-2019 15:47:47 [INFO]                                                                         
06-Oct-2019 15:47:47 [INFO] ------------------------------------------------------------------------
06-Oct-2019 15:47:47 [INFO] Building org.codehaus.groovy.eclipse.site 3.6.0-SNAPSHOT
06-Oct-2019 15:47:47 [INFO] ------------------------------------------------------------------------
06-Oct-2019 15:47:47 [INFO]
06-Oct-2019 15:47:47 [INFO] --- maven-clean-plugin:2.5:clean (default-clean) @ org.codehaus.groovy.eclipse.site ---
06-Oct-2019 15:47:47 [INFO]
06-Oct-2019 15:47:47 [INFO] --- tycho-packaging-plugin:1.4.0:build-qualifier (default-build-qualifier) @ org.codehaus.groovy.eclipse.site ---
06-Oct-2019 15:47:47 [INFO] The project's OSGi version is 3.6.0.v201910061416-e1812
06-Oct-2019 15:47:47 [INFO]
06-Oct-2019 15:47:47 [INFO] --- properties-maven-plugin:1.0.0:read-project-properties (default) @ org.codehaus.groovy.eclipse.site ---
06-Oct-2019 15:47:47 [INFO]
06-Oct-2019 15:47:47 [INFO] --- tycho-source-plugin:1.4.0:plugin-source (plugin-source) @ org.codehaus.groovy.eclipse.site ---
06-Oct-2019 15:47:47 [INFO]
06-Oct-2019 15:47:47 [INFO] --- tycho-packaging-plugin:1.4.0:update-site (default-update-site) @ org.codehaus.groovy.eclipse.site ---
06-Oct-2019 15:47:48 [INFO]
06-Oct-2019 15:47:48 [INFO] --- tycho-p2-plugin:1.4.0:update-site-p2-metadata (default-update-site-p2-metadata) @ org.codehaus.groovy.eclipse.site ---
06-Oct-2019 15:47:48 [INFO] Command line:
06-Oct-2019 15:47:48         [/opt/jdk8u212-b03/jre/bin/java, -jar, /opt/users/bamboo/.m2/repository/org/eclipse/tycho/tycho-bundles-external/1.4.0/eclipse/plugins/org.eclipse.equinox.launcher_1.5.300.v20190213-1655.jar, -configuration, /tmp/GRECLIPSE-E410-JOB1/tycho-p2-runtime4325391753470260395.tmp/configuration, -nosplash, -application, org.eclipse.equinox.p2.publisher.UpdateSitePublisher, -source, /opt/bamboo-home/xml-data/build-dir/GRECLIPSE-E410-JOB1/Site-org.codehaus.groovy.eclipse/target/site, -metadataRepository, file:/opt/bamboo-home/xml-data/build-dir/GRECLIPSE-E410-JOB1/Site-org.codehaus.groovy.eclipse/target/site/, -metadataRepositoryName, org.codehaus.groovy.eclipse.site, -artifactRepository, file:/opt/bamboo-home/xml-data/build-dir/GRECLIPSE-E410-JOB1/Site-org.codehaus.groovy.eclipse/target/site/, -artifactRepositoryName, org.codehaus.groovy.eclipse.site Artifacts, -noDefaultIUs, -compress]
06-Oct-2019 15:47:49 Generating metadata for ..
06-Oct-2019 15:47:50 Generation completed with success [1 seconds].
06-Oct-2019 15:47:51 [INFO]
06-Oct-2019 15:47:51 [INFO] --- tycho-packaging-plugin:1.4.0:update-site-packaging (default-update-site-packaging) @ org.codehaus.groovy.eclipse.site ---
06-Oct-2019 15:47:51 [INFO] Building zip: /opt/bamboo-home/xml-data/build-dir/GRECLIPSE-E410-JOB1/Site-org.codehaus.groovy.eclipse/target/site.zip
06-Oct-2019 15:47:51 [INFO]
06-Oct-2019 15:47:51 [INFO] --- maven-jarsigner-plugin:1.4:sign (sign) @ org.codehaus.groovy.eclipse.site ---
06-Oct-2019 15:47:51 [INFO] 1 archive(s) processed
06-Oct-2019 15:47:51 [INFO]
06-Oct-2019 15:47:51 [INFO] --- tycho-source-feature-plugin:1.4.0:source-feature (source-feature) @ org.codehaus.groovy.eclipse.site ---
06-Oct-2019 15:47:51 [INFO]
06-Oct-2019 15:47:51 [INFO] --- tycho-p2-plugin:1.4.0:p2-metadata (attach-p2-metadata) @ org.codehaus.groovy.eclipse.site ---
06-Oct-2019 15:47:51 [INFO]
06-Oct-2019 15:47:51 [INFO] --- maven-install-plugin:2.3.1:install (default-install) @ org.codehaus.groovy.eclipse.site ---
06-Oct-2019 15:47:51 [INFO] Installing /opt/bamboo-home/xml-data/build-dir/GRECLIPSE-E410-JOB1/Site-org.codehaus.groovy.eclipse/target/site.zip to /home/bamboo/.m2/repository/org/codehaus/groovy/eclipse/org.codehaus.groovy.eclipse.site/3.6.0-SNAPSHOT/org.codehaus.groovy.eclipse.site-3.6.0-SNAPSHOT.zip
06-Oct-2019 15:47:51 [INFO] Installing /opt/bamboo-home/xml-data/build-dir/GRECLIPSE-E410-JOB1/Site-org.codehaus.groovy.eclipse/pom.xml to /home/bamboo/.m2/repository/org/codehaus/groovy/eclipse/org.codehaus.groovy.eclipse.site/3.6.0-SNAPSHOT/org.codehaus.groovy.eclipse.site-3.6.0-SNAPSHOT.pom
06-Oct-2019 15:47:51 [INFO]
06-Oct-2019 15:47:51 [INFO] --- maven-deploy-plugin:2.8.2:deploy (default-deploy) @ org.codehaus.groovy.eclipse.site ---
06-Oct-2019 15:47:51 [INFO] Skipping artifact deployment
06-Oct-2019 15:47:51 [INFO]
06-Oct-2019 15:47:51 [INFO] --- maven-antrun-plugin:1.8:run (upload-dist) @ org.codehaus.groovy.eclipse.site ---
06-Oct-2019 15:47:51 [INFO] Executing tasks
06-Oct-2019 15:47:51
06-Oct-2019 15:47:51 main:
06-Oct-2019 15:47:51      [echo] Uploading main update site to s3..."
06-Oct-2019 15:47:51      [echo] == Are props set so we can deploy? ==
06-Oct-2019 15:47:51      [echo] dist_properties=/home/bamboo/tools/s3.properties
06-Oct-2019 15:47:51      [echo] bamboo_s3_properties=/home/bamboo/tools/s3.properties
06-Oct-2019 15:47:51      [echo] dist.full.version=3.6.0.v201910061416-e1812
06-Oct-2019 15:47:51      [echo] dist.file.name=org.codehaus.groovy-3.6.0.v201910061416-e1812-updatesite.zip
06-Oct-2019 15:47:51       [zip] Building zip: /opt/bamboo-home/xml-data/build-dir/GRECLIPSE-E410-JOB1/Site-org.codehaus.groovy.eclipse/target/org.codehaus.groovy-3.6.0.v201910061416-e1812-updatesite.zip
06-Oct-2019 15:47:55      [echo] Preparing for upload...
06-Oct-2019 15:47:55      [echo] Will Delete:
06-Oct-2019 15:47:55      [echo] dist.bucket=dist.springsource.org
06-Oct-2019 15:47:55      [echo] dist.path=snapshot/GRECLIPSE/e4.10
06-Oct-2019 15:47:55      [echo] Will Upload:
06-Oct-2019 15:47:55      [echo] dist.bucket=dist.springsource.org
06-Oct-2019 15:47:55      [echo] fromDir=/opt/bamboo-home/xml-data/build-dir/GRECLIPSE-E410-JOB1/Site-org.codehaus.groovy.eclipse/target/site
06-Oct-2019 15:47:55      [echo] toDir=snapshot/GRECLIPSE/e4.10
06-Oct-2019 15:47:55      [echo] Will Upload:
06-Oct-2019 15:47:55      [echo] dist.bucket=dist.springsource.org
06-Oct-2019 15:47:55      [echo] fromFile=/opt/bamboo-home/xml-data/build-dir/GRECLIPSE-E410-JOB1/Site-org.codehaus.groovy.eclipse/target/org.codehaus.groovy-3.6.0.v201910061416-e1812-updatesite.zip
06-Oct-2019 15:47:55      [echo] toFile=snapshot/GRECLIPSE/e4.10/org.codehaus.groovy-3.6.0.v201910061416-e1812-updatesite.zip
06-Oct-2019 15:47:55      [echo] metadata bundle.version=3.6.0.v201910061416-e1812
06-Oct-2019 15:47:55      [echo] metadata package.file.name=org.codehaus.groovy-3.6.0.v201910061416-e1812-updatesite.zip
06-Oct-2019 15:47:55      [echo] metadata project.name=Groovy Eclipse
06-Oct-2019 15:47:55      [echo] metadata release.type=snapshot
06-Oct-2019 15:47:56 Deleted s3://dist.springsource.org/snapshot/GRECLIPSE/e4.10/artifacts.jar
06-Oct-2019 15:47:57 Deleted s3://dist.springsource.org/snapshot/GRECLIPSE/e4.10/content.jar
06-Oct-2019 15:47:57 Deleted s3://dist.springsource.org/snapshot/GRECLIPSE/e4.10/features/
06-Oct-2019 15:47:57 Deleted s3://dist.springsource.org/snapshot/GRECLIPSE/e4.10/features/org.codehaus.groovy.compilerless.feature_3.6.0.v201910061240-e1812.jar
06-Oct-2019 15:47:57 Deleted s3://dist.springsource.org/snapshot/GRECLIPSE/e4.10/features/org.codehaus.groovy.eclipse.feature_3.6.0.v201910061240-e1812.jar
06-Oct-2019 15:47:57 Deleted s3://dist.springsource.org/snapshot/GRECLIPSE/e4.10/features/org.codehaus.groovy.headless.feature_3.6.0.v201910061240-e1812.jar
06-Oct-2019 15:47:57 Deleted s3://dist.springsource.org/snapshot/GRECLIPSE/e4.10/features/org.codehaus.groovy.jdt.patch_3.6.0.v201910061240-e1812.jar
06-Oct-2019 15:47:57 Deleted s3://dist.springsource.org/snapshot/GRECLIPSE/e4.10/features/org.codehaus.groovy.m2eclipse.feature_3.6.0.v201910061240-e1812.jar
06-Oct-2019 15:47:57 Deleted s3://dist.springsource.org/snapshot/GRECLIPSE/e4.10/features/org.codehaus.groovy24.feature_3.6.0.v201910061240-e1812.jar
06-Oct-2019 15:47:58 Deleted s3://dist.springsource.org/snapshot/GRECLIPSE/e4.10/features/org.codehaus.groovy25.feature_3.6.0.v201910061240-e1812.jar
06-Oct-2019 15:47:58 Deleted s3://dist.springsource.org/snapshot/GRECLIPSE/e4.10/features/org.codehaus.groovy30.feature_3.6.0.v201910061240-e1812.jar
06-Oct-2019 15:47:58 Deleted s3://dist.springsource.org/snapshot/GRECLIPSE/e4.10/plugins/
06-Oct-2019 15:47:58 Deleted s3://dist.springsource.org/snapshot/GRECLIPSE/e4.10/plugins/org.codehaus.groovy.eclipse.ant_3.6.0.v201910061240-e1812.jar
06-Oct-2019 15:47:58 Deleted s3://dist.springsource.org/snapshot/GRECLIPSE/e4.10/plugins/org.codehaus.groovy.eclipse.astviews_3.6.0.v201910061240-e1812.jar
06-Oct-2019 15:47:58 Deleted s3://dist.springsource.org/snapshot/GRECLIPSE/e4.10/plugins/org.codehaus.groovy.eclipse.codeassist_3.6.0.v201910061240-e1812.jar
06-Oct-2019 15:47:58 Deleted s3://dist.springsource.org/snapshot/GRECLIPSE/e4.10/plugins/org.codehaus.groovy.eclipse.codebrowsing_3.6.0.v201910061240-e1812.jar
06-Oct-2019 15:47:58 Deleted s3://dist.springsource.org/snapshot/GRECLIPSE/e4.10/plugins/org.codehaus.groovy.eclipse.compilerResolver_3.6.0.v201910061240-e1812.jar
06-Oct-2019 15:47:58 Deleted s3://dist.springsource.org/snapshot/GRECLIPSE/e4.10/plugins/org.codehaus.groovy.eclipse.core_3.6.0.v201910061240-e1812.jar
06-Oct-2019 15:47:59 Deleted s3://dist.springsource.org/snapshot/GRECLIPSE/e4.10/plugins/org.codehaus.groovy.eclipse.dsl_3.6.0.v201910061240-e1812.jar
06-Oct-2019 15:47:59 Deleted s3://dist.springsource.org/snapshot/GRECLIPSE/e4.10/plugins/org.codehaus.groovy.eclipse.quickfix_3.6.0.v201910061240-e1812.jar
06-Oct-2019 15:47:59 Deleted s3://dist.springsource.org/snapshot/GRECLIPSE/e4.10/plugins/org.codehaus.groovy.eclipse.refactoring_3.6.0.v201910061240-e1812.jar
06-Oct-2019 15:47:59 Deleted s3://dist.springsource.org/snapshot/GRECLIPSE/e4.10/plugins/org.codehaus.groovy.eclipse.ui_3.6.0.v201910061240-e1812.jar
06-Oct-2019 15:47:59 Deleted s3://dist.springsource.org/snapshot/GRECLIPSE/e4.10/plugins/org.codehaus.groovy.eclipse_3.6.0.v201910061240-e1812.jar
06-Oct-2019 15:47:59 Deleted s3://dist.springsource.org/snapshot/GRECLIPSE/e4.10/plugins/org.codehaus.groovy.m2eclipse_3.6.0.v201910061240-e1812.jar
06-Oct-2019 15:47:59 Deleted s3://dist.springsource.org/snapshot/GRECLIPSE/e4.10/plugins/org.codehaus.groovy_2.4.17.v201910061240-e1812.jar
06-Oct-2019 15:47:59 Deleted s3://dist.springsource.org/snapshot/GRECLIPSE/e4.10/plugins/org.codehaus.groovy_2.5.8.v201910061240-e1812.jar
06-Oct-2019 15:48:00 Deleted s3://dist.springsource.org/snapshot/GRECLIPSE/e4.10/plugins/org.codehaus.groovy_3.0.0.v201910061240-e1812.jar
06-Oct-2019 15:48:00 Deleted s3://dist.springsource.org/snapshot/GRECLIPSE/e4.10/plugins/org.eclipse.jdt.core_3.16.0.v201910061240-e1812.jar
06-Oct-2019 15:48:00 Deleted s3://dist.springsource.org/snapshot/GRECLIPSE/e4.10/plugins/org.eclipse.jdt.groovy.core_3.6.0.v201910061240-e1812.jar
06-Oct-2019 15:48:00 Deleted s3://dist.springsource.org/snapshot/GRECLIPSE/e4.10/site.xml
06-Oct-2019 15:48:00 Uploading /opt/bamboo-home/xml-data/build-dir/GRECLIPSE-E410-JOB1/Site-org.codehaus.groovy.eclipse/target/site/artifacts.jar (2.8 KB) to s3://dist.springsource.org/snapshot/GRECLIPSE/e4.10/artifacts.jar
06-Oct-2019 15:48:00 Transfer Time: .2 s - Transfer Rate: 15.4 KB/s
06-Oct-2019 15:48:01 Uploading /opt/bamboo-home/xml-data/build-dir/GRECLIPSE-E410-JOB1/Site-org.codehaus.groovy.eclipse/target/site/content.jar (11.5 KB) to s3://dist.springsource.org/snapshot/GRECLIPSE/e4.10/content.jar
06-Oct-2019 15:48:01 Transfer Time: .2 s - Transfer Rate: 62.4 KB/s
06-Oct-2019 15:48:01 Uploading /opt/bamboo-home/xml-data/build-dir/GRECLIPSE-E410-JOB1/Site-org.codehaus.groovy.eclipse/target/site/features/org.codehaus.groovy.compilerless.feature_3.6.0.v201910061416-e1812.jar (15.0 KB) to s3://dist.springsource.org/snapshot/GRECLIPSE/e4.10/features/org.codehaus.groovy.compilerless.feature_3.6.0.v201910061416-e1812.jar
06-Oct-2019 15:48:02 Transfer Time: .2 s - Transfer Rate: 77.5 KB/s
06-Oct-2019 15:48:02 Uploading /opt/bamboo-home/xml-data/build-dir/GRECLIPSE-E410-JOB1/Site-org.codehaus.groovy.eclipse/target/site/features/org.codehaus.groovy.eclipse.feature_3.6.0.v201910061416-e1812.jar (14.9 KB) to s3://dist.springsource.org/snapshot/GRECLIPSE/e4.10/features/org.codehaus.groovy.eclipse.feature_3.6.0.v201910061416-e1812.jar
06-Oct-2019 15:48:02 Transfer Time: .2 s - Transfer Rate: 72.0 KB/s
06-Oct-2019 15:48:03 Uploading /opt/bamboo-home/xml-data/build-dir/GRECLIPSE-E410-JOB1/Site-org.codehaus.groovy.eclipse/target/site/features/org.codehaus.groovy.headless.feature_3.6.0.v201910061416-e1812.jar (14.9 KB) to s3://dist.springsource.org/snapshot/GRECLIPSE/e4.10/features/org.codehaus.groovy.headless.feature_3.6.0.v201910061416-e1812.jar
06-Oct-2019 15:48:03 Transfer Time: .2 s - Transfer Rate: 82.8 KB/s
06-Oct-2019 15:48:03 Uploading /opt/bamboo-home/xml-data/build-dir/GRECLIPSE-E410-JOB1/Site-org.codehaus.groovy.eclipse/target/site/features/org.codehaus.groovy.jdt.patch_3.6.0.v201910061416-e1812.jar (9.3 KB) to s3://dist.springsource.org/snapshot/GRECLIPSE/e4.10/features/org.codehaus.groovy.jdt.patch_3.6.0.v201910061416-e1812.jar
06-Oct-2019 15:48:03 Transfer Time: .2 s - Transfer Rate: 49.0 KB/s
06-Oct-2019 15:48:04 Uploading /opt/bamboo-home/xml-data/build-dir/GRECLIPSE-E410-JOB1/Site-org.codehaus.groovy.eclipse/target/site/features/org.codehaus.groovy.m2eclipse.feature_3.6.0.v201910061416-e1812.jar (14.9 KB) to s3://dist.springsource.org/snapshot/GRECLIPSE/e4.10/features/org.codehaus.groovy.m2eclipse.feature_3.6.0.v201910061416-e1812.jar
06-Oct-2019 15:48:04 Transfer Time: .2 s - Transfer Rate: 78.0 KB/s
06-Oct-2019 15:48:05 Uploading /opt/bamboo-home/xml-data/build-dir/GRECLIPSE-E410-JOB1/Site-org.codehaus.groovy.eclipse/target/site/features/org.codehaus.groovy24.feature_3.6.0.v201910061416-e1812.jar (14.8 KB) to s3://dist.springsource.org/snapshot/GRECLIPSE/e4.10/features/org.codehaus.groovy24.feature_3.6.0.v201910061416-e1812.jar
06-Oct-2019 15:48:05 Transfer Time: .2 s - Transfer Rate: 74.9 KB/s
06-Oct-2019 15:48:05 Uploading /opt/bamboo-home/xml-data/build-dir/GRECLIPSE-E410-JOB1/Site-org.codehaus.groovy.eclipse/target/site/features/org.codehaus.groovy25.feature_3.6.0.v201910061416-e1812.jar (14.8 KB) to s3://dist.springsource.org/snapshot/GRECLIPSE/e4.10/features/org.codehaus.groovy25.feature_3.6.0.v201910061416-e1812.jar
06-Oct-2019 15:48:05 Transfer Time: .2 s - Transfer Rate: 82.4 KB/s
06-Oct-2019 15:48:06 Uploading /opt/bamboo-home/xml-data/build-dir/GRECLIPSE-E410-JOB1/Site-org.codehaus.groovy.eclipse/target/site/features/org.codehaus.groovy30.feature_3.6.0.v201910061416-e1812.jar (14.8 KB) to s3://dist.springsource.org/snapshot/GRECLIPSE/e4.10/features/org.codehaus.groovy30.feature_3.6.0.v201910061416-e1812.jar
06-Oct-2019 15:48:06 Transfer Time: .2 s - Transfer Rate: 75.7 KB/s
06-Oct-2019 15:48:07 Uploading /opt/bamboo-home/xml-data/build-dir/GRECLIPSE-E410-JOB1/Site-org.codehaus.groovy.eclipse/target/site/plugins/org.codehaus.groovy.eclipse.ant_3.6.0.v201910061416-e1812.jar (11.5 KB) to s3://dist.springsource.org/snapshot/GRECLIPSE/e4.10/plugins/org.codehaus.groovy.eclipse.ant_3.6.0.v201910061416-e1812.jar
06-Oct-2019 15:48:07 Transfer Time: .2 s - Transfer Rate: 57.0 KB/s
06-Oct-2019 15:48:07 Uploading /opt/bamboo-home/xml-data/build-dir/GRECLIPSE-E410-JOB1/Site-org.codehaus.groovy.eclipse/target/site/plugins/org.codehaus.groovy.eclipse.astviews_3.6.0.v201910061416-e1812.jar (79.2 KB) to s3://dist.springsource.org/snapshot/GRECLIPSE/e4.10/plugins/org.codehaus.groovy.eclipse.astviews_3.6.0.v201910061416-e1812.jar
06-Oct-2019 15:48:08 Transfer Time: .3 s - Transfer Rate: 258.7 KB/s
06-Oct-2019 15:48:09 Uploading /opt/bamboo-home/xml-data/build-dir/GRECLIPSE-E410-JOB1/Site-org.codehaus.groovy.eclipse/target/site/plugins/org.codehaus.groovy.eclipse.codeassist_3.6.0.v201910061416-e1812.jar (273.6 KB) to s3://dist.springsource.org/snapshot/GRECLIPSE/e4.10/plugins/org.codehaus.groovy.eclipse.codeassist_3.6.0.v201910061416-e1812.jar
06-Oct-2019 15:48:09 Transfer Time: .5 s - Transfer Rate: 533.3 KB/s
06-Oct-2019 15:48:10 Uploading /opt/bamboo-home/xml-data/build-dir/GRECLIPSE-E410-JOB1/Site-org.codehaus.groovy.eclipse/target/site/plugins/org.codehaus.groovy.eclipse.codebrowsing_3.6.0.v201910061416-e1812.jar (86.8 KB) to s3://dist.springsource.org/snapshot/GRECLIPSE/e4.10/plugins/org.codehaus.groovy.eclipse.codebrowsing_3.6.0.v201910061416-e1812.jar
06-Oct-2019 15:48:10 Transfer Time: .2 s - Transfer Rate: 449.5 KB/s
06-Oct-2019 15:48:11 Uploading /opt/bamboo-home/xml-data/build-dir/GRECLIPSE-E410-JOB1/Site-org.codehaus.groovy.eclipse/target/site/plugins/org.codehaus.groovy.eclipse.compilerResolver_3.6.0.v201910061416-e1812.jar (20.4 KB) to s3://dist.springsource.org/snapshot/GRECLIPSE/e4.10/plugins/org.codehaus.groovy.eclipse.compilerResolver_3.6.0.v201910061416-e1812.jar
06-Oct-2019 15:48:11 Transfer Time: .2 s - Transfer Rate: 82.4 KB/s
06-Oct-2019 15:48:11 Uploading /opt/bamboo-home/xml-data/build-dir/GRECLIPSE-E410-JOB1/Site-org.codehaus.groovy.eclipse/target/site/plugins/org.codehaus.groovy.eclipse.core_3.6.0.v201910061416-e1812.jar (83.3 KB) to s3://dist.springsource.org/snapshot/GRECLIPSE/e4.10/plugins/org.codehaus.groovy.eclipse.core_3.6.0.v201910061416-e1812.jar
06-Oct-2019 15:48:12 Transfer Time: .3 s - Transfer Rate: 303.9 KB/s
06-Oct-2019 15:48:12 Uploading /opt/bamboo-home/xml-data/build-dir/GRECLIPSE-E410-JOB1/Site-org.codehaus.groovy.eclipse/target/site/plugins/org.codehaus.groovy.eclipse.dsl_3.6.0.v201910061416-e1812.jar (395.7 KB) to s3://dist.springsource.org/snapshot/GRECLIPSE/e4.10/plugins/org.codehaus.groovy.eclipse.dsl_3.6.0.v201910061416-e1812.jar
06-Oct-2019 15:48:12 Transfer Time: .4 s - Transfer Rate: 1.1 MB/s
06-Oct-2019 15:48:13 Uploading /opt/bamboo-home/xml-data/build-dir/GRECLIPSE-E410-JOB1/Site-org.codehaus.groovy.eclipse/target/site/plugins/org.codehaus.groovy.eclipse.quickfix_3.6.0.v201910061416-e1812.jar (110.1 KB) to s3://dist.springsource.org/snapshot/GRECLIPSE/e4.10/plugins/org.codehaus.groovy.eclipse.quickfix_3.6.0.v201910061416-e1812.jar
06-Oct-2019 15:48:13 Transfer Time: .2 s - Transfer Rate: 598.5 KB/s
06-Oct-2019 15:48:14 Uploading /opt/bamboo-home/xml-data/build-dir/GRECLIPSE-E410-JOB1/Site-org.codehaus.groovy.eclipse/target/site/plugins/org.codehaus.groovy.eclipse.refactoring_3.6.0.v201910061416-e1812.jar (271.8 KB) to s3://dist.springsource.org/snapshot/GRECLIPSE/e4.10/plugins/org.codehaus.groovy.eclipse.refactoring_3.6.0.v201910061416-e1812.jar
06-Oct-2019 15:48:14 Transfer Time: .2 s - Transfer Rate: 1.2 MB/s
06-Oct-2019 15:48:14 Uploading /opt/bamboo-home/xml-data/build-dir/GRECLIPSE-E410-JOB1/Site-org.codehaus.groovy.eclipse/target/site/plugins/org.codehaus.groovy.eclipse.ui_3.6.0.v201910061416-e1812.jar (552.1 KB) to s3://dist.springsource.org/snapshot/GRECLIPSE/e4.10/plugins/org.codehaus.groovy.eclipse.ui_3.6.0.v201910061416-e1812.jar
06-Oct-2019 15:48:15 Transfer Time: .4 s - Transfer Rate: 1.5 MB/s
06-Oct-2019 15:48:15 Uploading /opt/bamboo-home/xml-data/build-dir/GRECLIPSE-E410-JOB1/Site-org.codehaus.groovy.eclipse/target/site/plugins/org.codehaus.groovy.eclipse_3.6.0.v201910061416-e1812.jar (16.7 KB) to s3://dist.springsource.org/snapshot/GRECLIPSE/e4.10/plugins/org.codehaus.groovy.eclipse_3.6.0.v201910061416-e1812.jar
06-Oct-2019 15:48:15 Transfer Time: .2 s - Transfer Rate: 89.2 KB/s
06-Oct-2019 15:48:16 Uploading /opt/bamboo-home/xml-data/build-dir/GRECLIPSE-E410-JOB1/Site-org.codehaus.groovy.eclipse/target/site/plugins/org.codehaus.groovy.m2eclipse_3.6.0.v201910061416-e1812.jar (17.9 KB) to s3://dist.springsource.org/snapshot/GRECLIPSE/e4.10/plugins/org.codehaus.groovy.m2eclipse_3.6.0.v201910061416-e1812.jar
06-Oct-2019 15:48:16 Transfer Time: .2 s - Transfer Rate: 102.2 KB/s
06-Oct-2019 15:48:16 Uploading /opt/bamboo-home/xml-data/build-dir/GRECLIPSE-E410-JOB1/Site-org.codehaus.groovy.eclipse/target/site/plugins/org.codehaus.groovy_2.4.17.v201910061416-e1812.jar (18.8 MB) to s3://dist.springsource.org/snapshot/GRECLIPSE/e4.10/plugins/org.codehaus.groovy_2.4.17.v201910061416-e1812.jar
06-Oct-2019 15:48:19 Transfer Time: 2.9 s - Transfer Rate: 6.5 MB/s
06-Oct-2019 15:48:20 Uploading /opt/bamboo-home/xml-data/build-dir/GRECLIPSE-E410-JOB1/Site-org.codehaus.groovy.eclipse/target/site/plugins/org.codehaus.groovy_2.5.8.v201910061416-e1812.jar (17.7 MB) to s3://dist.springsource.org/snapshot/GRECLIPSE/e4.10/plugins/org.codehaus.groovy_2.5.8.v201910061416-e1812.jar
06-Oct-2019 15:48:24 Transfer Time: 4.7 s - Transfer Rate: 3.7 MB/s
06-Oct-2019 15:48:25 Uploading /opt/bamboo-home/xml-data/build-dir/GRECLIPSE-E410-JOB1/Site-org.codehaus.groovy.eclipse/target/site/plugins/org.codehaus.groovy_3.0.0.v201910061416-e1812.jar (21.6 MB) to s3://dist.springsource.org/snapshot/GRECLIPSE/e4.10/plugins/org.codehaus.groovy_3.0.0.v201910061416-e1812.jar
06-Oct-2019 15:48:31 Transfer Time: 6.1 s - Transfer Rate: 3.5 MB/s
06-Oct-2019 15:48:32 Uploading /opt/bamboo-home/xml-data/build-dir/GRECLIPSE-E410-JOB1/Site-org.codehaus.groovy.eclipse/target/site/plugins/org.eclipse.jdt.core_3.16.0.v201910061416-e1812.jar (6.6 MB) to s3://dist.springsource.org/snapshot/GRECLIPSE/e4.10/plugins/org.eclipse.jdt.core_3.16.0.v201910061416-e1812.jar
06-Oct-2019 15:48:33 Transfer Time: 1.8 s - Transfer Rate: 3.6 MB/s
06-Oct-2019 15:48:34 Uploading /opt/bamboo-home/xml-data/build-dir/GRECLIPSE-E410-JOB1/Site-org.codehaus.groovy.eclipse/target/site/plugins/org.eclipse.jdt.groovy.core_3.6.0.v201910061416-e1812.jar (458.5 KB) to s3://dist.springsource.org/snapshot/GRECLIPSE/e4.10/plugins/org.eclipse.jdt.groovy.core_3.6.0.v201910061416-e1812.jar
06-Oct-2019 15:48:34 Transfer Time: .3 s - Transfer Rate: 1.5 MB/s
06-Oct-2019 15:48:35 Uploading /opt/bamboo-home/xml-data/build-dir/GRECLIPSE-E410-JOB1/Site-org.codehaus.groovy.eclipse/target/site/site.xml (2.8 KB) to s3://dist.springsource.org/snapshot/GRECLIPSE/e4.10/site.xml
06-Oct-2019 15:48:35 Transfer Time: .2 s - Transfer Rate: 14.9 KB/s
06-Oct-2019 15:48:35 Uploading /opt/bamboo-home/xml-data/build-dir/GRECLIPSE-E410-JOB1/Site-org.codehaus.groovy.eclipse/target/org.codehaus.groovy-3.6.0.v201910061416-e1812-updatesite.zip (66.7 MB) to s3://dist.springsource.org/snapshot/GRECLIPSE/e4.10/org.codehaus.groovy-3.6.0.v201910061416-e1812-updatesite.zip
06-Oct-2019 15:48:45 Transfer Time: 9.6 s - Transfer Rate: 6.9 MB/s
06-Oct-2019 15:48:45 Uploading /opt/bamboo-home/xml-data/build-dir/GRECLIPSE-E410-JOB1/Site-org.codehaus.groovy.eclipse/target/org.codehaus.groovy-3.6.0.v201910061416-e1812-updatesite.zip.md5 (.0 KB) to s3://dist.springsource.org/snapshot/GRECLIPSE/e4.10/org.codehaus.groovy-3.6.0.v201910061416-e1812-updatesite.zip.md5
06-Oct-2019 15:48:45 Transfer Time: .2 s - Transfer Rate: .2 KB/s
06-Oct-2019 15:48:45 Uploading /opt/bamboo-home/xml-data/build-dir/GRECLIPSE-E410-JOB1/Site-org.codehaus.groovy.eclipse/target/org.codehaus.groovy-3.6.0.v201910061416-e1812-updatesite.zip.sha1 (.0 KB) to s3://dist.springsource.org/snapshot/GRECLIPSE/e4.10/org.codehaus.groovy-3.6.0.v201910061416-e1812-updatesite.zip.sha1
06-Oct-2019 15:48:46 Transfer Time: .2 s - Transfer Rate: .2 KB/s
06-Oct-2019 15:48:46 [INFO] Executed tasks
06-Oct-2019 15:48:46 [INFO] ------------------------------------------------------------------------
06-Oct-2019 15:48:46 [INFO] Reactor Summary:
06-Oct-2019 15:48:46 [INFO]
06-Oct-2019 15:48:46 [INFO] org.codehaus.groovy.eclipse.parent ................. SUCCESS [  0.204 s]
06-Oct-2019 15:48:46 [INFO] org.codehaus.groovy ................................ SUCCESS [  5.994 s]
06-Oct-2019 15:48:46 [INFO] org.codehaus.groovy ................................ SUCCESS [  3.579 s]
06-Oct-2019 15:48:46 [INFO] org.codehaus.groovy ................................ SUCCESS [  4.284 s]
06-Oct-2019 15:48:46 [INFO] org.codehaus.groovy.eclipse.compilerResolver ....... SUCCESS [  0.754 s]
06-Oct-2019 15:48:46 [INFO] org.eclipse.jdt.core ............................... SUCCESS [  9.870 s]
06-Oct-2019 15:48:46 [INFO] org.eclipse.jdt.groovy.core ........................ SUCCESS [  1.590 s]
06-Oct-2019 15:48:46 [INFO] org.codehaus.groovy.eclipse ........................ SUCCESS [  0.371 s]
06-Oct-2019 15:48:46 [INFO] org.codehaus.groovy.eclipse.core ................... SUCCESS [  1.126 s]
06-Oct-2019 15:48:46 [INFO] org.codehaus.groovy.eclipse.ant .................... SUCCESS [  0.793 s]
06-Oct-2019 15:48:46 [INFO] org.codehaus.groovy.eclipse.codebrowsing ........... SUCCESS [  1.041 s]
06-Oct-2019 15:48:46 [INFO] org.codehaus.groovy.eclipse.refactoring ............ SUCCESS [  1.416 s]
06-Oct-2019 15:48:46 [INFO] org.codehaus.groovy.eclipse.ui ..................... SUCCESS [  1.934 s]
06-Oct-2019 15:48:46 [INFO] org.codehaus.groovy.eclipse.astviews ............... SUCCESS [  2.622 s]
06-Oct-2019 15:48:46 [INFO] org.codehaus.groovy.eclipse.codeassist ............. SUCCESS [  1.333 s]
06-Oct-2019 15:48:46 [INFO] org.codehaus.groovy.eclipse.dsl .................... SUCCESS [  1.499 s]
06-Oct-2019 15:48:46 [INFO] org.codehaus.groovy.eclipse.quickfix ............... SUCCESS [  1.202 s]
06-Oct-2019 15:48:46 [INFO] org.codehaus.groovy24.feature ...................... SUCCESS [  0.575 s]
06-Oct-2019 15:48:46 [INFO] org.codehaus.groovy25.feature ...................... SUCCESS [  0.446 s]
06-Oct-2019 15:48:46 [INFO] org.codehaus.groovy30.feature ...................... SUCCESS [  0.428 s]
06-Oct-2019 15:48:46 [INFO] org.codehaus.groovy.jdt.patch ...................... SUCCESS [  0.401 s]
06-Oct-2019 15:48:46 [INFO] org.codehaus.groovy.headless.feature ............... SUCCESS [  0.552 s]
06-Oct-2019 15:48:46 [INFO] org.codehaus.groovy.compilerless.feature ........... SUCCESS [  0.678 s]
06-Oct-2019 15:48:46 [INFO] org.codehaus.groovy.eclipse.feature ................ SUCCESS [  0.440 s]
06-Oct-2019 15:48:46 [INFO] org.eclipse.jdt.core.tests.compiler ................ SUCCESS [  4.316 s]
06-Oct-2019 15:48:46 [INFO] org.eclipse.jdt.core.tests.builder ................. SUCCESS [  0.974 s]
06-Oct-2019 15:48:46 [INFO] org.eclipse.jdt.groovy.core.tests.compiler ......... SUCCESS [  0.927 s]
06-Oct-2019 15:48:46 [INFO] org.eclipse.jdt.groovy.core.tests.builder .......... SUCCESS [  1.261 s]
06-Oct-2019 15:48:46 [INFO] org.codehaus.groovy.eclipse.tests .................. SUCCESS [  2.540 s]
06-Oct-2019 15:48:46 [INFO] org.codehaus.groovy.eclipse.codeassist.test ........ SUCCESS [  1.859 s]
06-Oct-2019 15:48:46 [INFO] org.codehaus.groovy.eclipse.codebrowsing.test ...... SUCCESS [  1.540 s]
06-Oct-2019 15:48:46 [INFO] org.codehaus.groovy.eclipse.core.test .............. SUCCESS [  1.184 s]
06-Oct-2019 15:48:46 [INFO] org.codehaus.groovy.eclipse.dsl.tests .............. SUCCESS [  1.600 s]
06-Oct-2019 15:48:46 [INFO] org.codehaus.groovy.eclipse.junit.test ............. SUCCESS [  1.099 s]
06-Oct-2019 15:48:46 [INFO] org.codehaus.groovy.eclipse.refactoring.test ....... SUCCESS [  2.005 s]
06-Oct-2019 15:48:46 [INFO] org.codehaus.groovy.eclipse.quickfix.test .......... SUCCESS [  1.340 s]
06-Oct-2019 15:48:46 [INFO] org.codehaus.groovy.alltests ....................... SUCCESS [  01:29 h]
06-Oct-2019 15:48:46 [INFO] org.codehaus.groovy.m2eclipse ...................... SUCCESS [  0.820 s]
06-Oct-2019 15:48:46 [INFO] org.codehaus.groovy.m2eclipse.feature .............. SUCCESS [  0.430 s]
06-Oct-2019 15:48:46 [INFO] org.codehaus.groovy.eclipse.site ................... SUCCESS [ 58.389 s]
06-Oct-2019 15:48:46 [INFO] ------------------------------------------------------------------------
06-Oct-2019 15:48:46 [INFO] BUILD SUCCESS
06-Oct-2019 15:48:46 [INFO] ------------------------------------------------------------------------
06-Oct-2019 15:48:46 [INFO] Total time: 01:32 h
06-Oct-2019 15:48:46 [INFO] Finished at: 2019-10-06T15:48:46+00:00
06-Oct-2019 15:48:46 [INFO] Final Memory: 195M/1580M
06-Oct-2019 15:48:46 [INFO] ------------------------------------------------------------------------
06-Oct-2019 15:48:46 [WARNING] The requested profile "snapshot" could not be activated because it does not exist.
06-Oct-2019 15:48:47 Parsing test results under /opt/bamboo-home/xml-data/build-dir/GRECLIPSE-E410-JOB1...
06-Oct-2019 15:48:47 Failing task since 10 failing test cases were found.
06-Oct-2019 15:48:47 Finished task 'Maven 3.x' with result: Failed
06-Oct-2019 15:48:47 Running post build plugin 'Docker Container Cleanup'
06-Oct-2019 15:48:47 Running post build plugin 'NCover Results Collector'
06-Oct-2019 15:48:47 Running post build plugin 'Artifactory Release Management Staging'
06-Oct-2019 15:48:47 Running post build plugin 'Artifactory Build Info Copier'
06-Oct-2019 15:48:47 Running post build plugin 'Artifactory Gradle Properties Info Copier'
06-Oct-2019 15:48:47 Running post build plugin 'Clover Results Collector'
06-Oct-2019 15:48:47 Running post build plugin 'npm Cache Cleanup'
06-Oct-2019 15:48:47 Running post build plugin 'Artifact Copier'
06-Oct-2019 15:48:47 Publishing an artifact: surefire-reports
06-Oct-2019 15:48:48 Finished publishing of artifact Non required job artifact: [surefire-reports], pattern: [**/target/TEST-*.xml] in 636.9 ms
06-Oct-2019 15:48:48 Publishing an artifact: Zipped Update Site
06-Oct-2019 15:48:48 Finished publishing of artifact Non required job artifact: [Zipped Update Site], pattern: [**/*updatesite.zip] anchored at: [Site-org.codehaus.groovy.eclipse/target/site] in 5.010 ms
06-Oct-2019 15:48:48 Successfully removed working directory at '/opt/bamboo-home/xml-data/build-dir/GRECLIPSE-E410-JOB1'
06-Oct-2019 15:48:48 Finalising the build...
06-Oct-2019 15:48:48 Stopping timer.
06-Oct-2019 15:48:48 Build GRECLIPSE-E410-JOB1-378 completed.
06-Oct-2019 15:48:49 Running on server: post build plugin 'NCover Results Collector'
06-Oct-2019 15:48:49 Running on server: post build plugin 'Build Hanging Detection Configuration'
06-Oct-2019 15:48:49 Running on server: post build plugin 'Bamboo project link creator'
06-Oct-2019 15:48:49 Running on server: post build plugin 'Clover Delta Calculator'
06-Oct-2019 15:48:49 Running on server: post build plugin 'Maven Dependencies Postprocessor'
06-Oct-2019 15:48:49 All post build plugins have finished
06-Oct-2019 15:48:49 Generating build results summary...
06-Oct-2019 15:48:50 Saving build results to disk...
06-Oct-2019 15:48:50 Logging substituted variables...
06-Oct-2019 15:48:50 Indexing build results...
06-Oct-2019 15:48:50 Finished building GRECLIPSE-E410-JOB1-378.