Build: #464 failed

Job: Default Job failed

Stages & jobs

  1. Default Stage

Job result summary

Completed
Duration
96 minutes
Agent
bamboo-19.af.pivotal.io
Revision
1fb9a4a4b8496f91f8b78265265325fe24add049 1fb9a4a4b8496f91f8b78265265325fe24add049
Total tests
6230
Failing since
#449 (Code changes detected – )
Fixed in
#498 (Code changes detected)

Tests

  • 6,230 tests in total
  • 10 tests failed
  • 9 failures are new
  • 126 tests were quarantined / skipped
  • 91 minutes taken in total.
New test failures 9
Status Test Duration
Collapse Failed SyntheticMemberSearchTests testSearchInGroovy1 History
1 sec
java.lang.AssertionError: Wrong number of matches found in:
 expected:<3> but was:<0>
java.lang.AssertionError: 
Wrong number of matches found in:
 expected:<3> but was:<0>
	at org.codehaus.groovy.eclipse.core.test.SyntheticMemberSearchTests.assertCount(SyntheticMemberSearchTests.groovy:259)
	at org.codehaus.groovy.eclipse.core.test.SyntheticMemberSearchTests.testSearchInGroovy1(SyntheticMemberSearchTests.groovy:57)
Collapse Failed SyntheticMemberSearchTests testSearchInGroovy5 History
1 sec
java.lang.AssertionError: Wrong number of matches found in:
 expected:<1> but was:<0>
java.lang.AssertionError: 
Wrong number of matches found in:
 expected:<1> but was:<0>
	at org.codehaus.groovy.eclipse.core.test.SyntheticMemberSearchTests.assertCount(SyntheticMemberSearchTests.groovy:259)
	at org.codehaus.groovy.eclipse.core.test.SyntheticMemberSearchTests.testSearchInGroovy5(SyntheticMemberSearchTests.groovy:129)
Collapse Failed SyntheticMemberSearchTests testSearchInJava1 History
4 secs
java.lang.AssertionError: Wrong number of matches found in:
 expected:<3> but was:<0>
java.lang.AssertionError: 
Wrong number of matches found in:
 expected:<3> but was:<0>
	at org.codehaus.groovy.eclipse.core.test.SyntheticMemberSearchTests.assertCount(SyntheticMemberSearchTests.groovy:259)
	at org.codehaus.groovy.eclipse.core.test.SyntheticMemberSearchTests.testSearchInJava1(SyntheticMemberSearchTests.groovy:173)
Collapse Failed SyntheticMemberSearchTests testSearchInJava2 History
1 sec
java.lang.AssertionError: Wrong number of matches found in:
 expected:<1> but was:<0>
java.lang.AssertionError: 
Wrong number of matches found in:
 expected:<1> but was:<0>
	at org.codehaus.groovy.eclipse.core.test.SyntheticMemberSearchTests.assertCount(SyntheticMemberSearchTests.groovy:259)
	at org.codehaus.groovy.eclipse.core.test.SyntheticMemberSearchTests.testSearchInJava2(SyntheticMemberSearchTests.groovy:195)
Collapse Failed SyntheticMemberSearchTests testSearchInJava3 History
1 sec
java.lang.AssertionError: Wrong number of matches found in:
 expected:<1> but was:<0>
java.lang.AssertionError: 
Wrong number of matches found in:
 expected:<1> but was:<0>
	at org.codehaus.groovy.eclipse.core.test.SyntheticMemberSearchTests.assertCount(SyntheticMemberSearchTests.groovy:259)
	at org.codehaus.groovy.eclipse.core.test.SyntheticMemberSearchTests.testSearchInJava3(SyntheticMemberSearchTests.groovy:217)
Collapse Failed SyntheticMemberSearchTests testSearchInJava4 History
1 sec
java.lang.AssertionError: Wrong number of matches found in:
 expected:<1> but was:<0>
java.lang.AssertionError: 
Wrong number of matches found in:
 expected:<1> but was:<0>
	at org.codehaus.groovy.eclipse.core.test.SyntheticMemberSearchTests.assertCount(SyntheticMemberSearchTests.groovy:259)
	at org.codehaus.groovy.eclipse.core.test.SyntheticMemberSearchTests.testSearchInJava4(SyntheticMemberSearchTests.groovy:239)
Collapse Failed GroovyProjectGroovyQuickFixTests testRaiseVisibilityModifier2 History
1 sec
org.junit.ComparisonFailure: expected:<...z extends Bar {
  pr[otected] void meth() {} // a...> but was:<...z extends Bar {
  pr[ivate] void meth() {} // a...>
org.junit.ComparisonFailure: 
expected:<...z extends Bar {
  pr[otected] void meth() {} // a...> but was:<...z extends Bar {
  pr[ivate] void meth() {} // a...>
	at org.codehaus.groovy.eclipse.quickfix.test.resolvers.GroovyProjectGroovyQuickFixTests.testRaiseVisibilityModifier2(GroovyProjectGroovyQuickFixTests.groovy:444)
Collapse Failed ConstructorReferenceSearchTests testNewifyConstructorReferences3 History
< 1 sec
java.lang.AssertionError: expected:<2> but was:<0>
	at org.eclipse.jdt.core.groovy.tests.search.ConstructorReferenceSearchTests.testNewifyConstructorReferences3(ConstructorReferenceSearchTests.java:429)
Collapse Failed OperatorOverloadingInferencingTests testGetAt1 History
< 1 sec
java.lang.AssertionError: Expected type not found.
Expected: java.lang.Object
Found: Foo
Declaring type: Search
ASTNode: org.codehaus.groovy.ast.expr.VariableExpression@10d63a[variable: xxx]
Confidence: INFERRED

java.lang.AssertionError: 
(8 more lines...)
Existing test failures 1
Status Test Failing since Duration
junit.framework.ComparisonFailure: 
----------- Expected ------------

------------ but was ------------
Problem : The import util.MyException is never used [ resource : </Project/src/p/Test.java> range : <18,34> category : <120> severity : <1>]

--------- Difference is ----------
 expected:<[]> but was:<[Problem : The import util.MyException is never used [ resource : </Project/src/p/Test.java> range : <18,34> category : <120> severity : <1>]
(12 more lines...)

Error summary

The build generated some errors. See the full build log for more details.

Dec 14, 2019 12:40:55 AM org.apache.http.impl.execchain.RetryExec execute
INFO: I/O exception (org.apache.http.NoHttpResponseException) caught when processing request to {s}->https://download.eclipse.org:443: The target server failed to respond
Dec 14, 2019 12:40:55 AM org.apache.http.impl.execchain.RetryExec execute
INFO: Retrying request to {s}->https://download.eclipse.org:443

(SWT:15186): Gtk-WARNING **: 00:42:19.956: gtk_widget_size_allocate(): attempt to allocate widget with width -3 and height -3

(SWT:15186): Gtk-CRITICAL **: 00:42:22.717: gtk_box_gadget_distribute: assertion 'size >= 0' failed in GtkScrollbar
TypeInferencingVisitorWithRequestor.findMethodNode: no match found for Main.main([Qjava.lang.String;)
TypeInferencingVisitorWithRequestor.findMethodNode: no match found for Main.main([Qjava.lang.String;)
CodeSelectRequestor: Could not proceed due to null declaring type for org.codehaus.groovy.ast.expr.BinaryExpression@ecbea[org.codehaus.groovy.ast.expr.VariableExpression@ecbe3[variable: it]("in" at 1:20:  "in" )org.codehaus.groovy.ast.expr.ListExpression@ee270[]]
CodeSelectRequestor: Could not proceed due to null declaring type for org.codehaus.groovy.ast.expr.RangeExpression@ebcdd
CodeSelectRequestor: Could not proceed due to null declaring type for org.codehaus.groovy.ast.expr.RangeExpression@ebcde
TypeInferencingVisitorWithRequestor.findMethodNode: no match found for Type.x(QList<Qjava.util.Date;>;)
TypeInferencingVisitorWithRequestor.findMethodNode: no match found for Type.x(QList<Qjava.lang.Number;>;)
TypeInferencingVisitorWithRequestor.findMethodNode: no match found for Type.x(QList<Qjava.lang.Number;>;)
TypeInferencingVisitorWithRequestor.findMethodNode: no match found for Type.x(QList<Qjava.util.Date;>;)
TypeInferencingVisitorWithRequestor.findMethodNode: no match found for Type.x(QList<Qjava.lang.Number;>;)
TypeInferencingVisitorWithRequestor.findMethodNode: no match found for Type.x(QList<Qjava.lang.Number;>;)
CodeSelectRequestor: Could not proceed due to null declaring type for org.codehaus.groovy.ast.expr.ConstantExpression@e8fc6[fff]
CodeSelectRequestor: Could not proceed due to null declaring type for org.codehaus.groovy.ast.expr.ConstantExpression@e8fca[fff]
CodeSelectRequestor: Could not proceed due to null declaring type for org.codehaus.groovy.ast.expr.ConstantExpression@e8fca[fff]
Waiting for: Java indexing... 3 files to index (/Project)
Waiting for: Java indexing... 22 files to index (/Project)
Waiting for: Java indexing... 22 files to index (/Project)
Waiting for: Java indexing... 22 files to index (/Project)
Waiting for: Java indexing... 4 files to index (/opt/bamboo-home/xml-data/build-dir/GRECLIPSE-E410-JOB1/ide-test/org.codehaus.groovy.alltests/target/work/plugins/org.eclipse.jdt.groovy.core.tests.builder_3.6.0.v201912140040-e1812/lib/binGroovySearch.jar)
Waiting for: Java indexing... 22 files to index (/Project)
Waiting for: Java indexing... 22 files to index (/Project)
Waiting for: Java indexing... 6 files to index (/Project)
Waiting for: Java indexing... 21 files to index (/Project)
Waiting for: Flushing content description cache.
Waiting for: Java indexing... 21 files to index (/Project)
Waiting for: Building workspace
Waiting for: Flushing content description cache.
Waiting for: Java indexing... 16 files to index (/opt/jdk8u232-b09/jre/lib/rt.jar)