Build: #500 failed

Job: Default Job failed

Stages & jobs

  1. Default Stage

Job result summary

Completed
Duration
96 minutes
Agent
bamboo-24.af.pivotal.io
Revision
4b073317f52844414e2c02dfdc1cbadd02e06611 4b073317f52844414e2c02dfdc1cbadd02e06611
Total tests
6285

Tests

  • 6,285 tests in total
  • 2 tests failed
  • 2 failures are new
  • 140 tests were quarantined / skipped
  • 91 minutes taken in total.
New test failures 2
Status Test Duration
Collapse Failed ArrayInferencingTests testArrayProperty10 History
< 1 sec
java.lang.AssertionError: Expected type not found.
Expected: XX[]
Found: java.lang.String
Declaring type: java.lang.String
ASTNode: org.codehaus.groovy.ast.expr.ConstantExpression@10c36f[xx]
Confidence: UNKNOWN

java.lang.AssertionError: 
(8 more lines...)
Collapse Failed DGMInferencingTests testDGM32 History
< 1 sec
java.lang.AssertionError: Expected type not found.
Expected: java.io.BufferedReader
Found: java.lang.Object
Declaring type: groovy.lang.Closure<V extends java.lang.Object>
ASTNode: org.codehaus.groovy.ast.expr.VariableExpression@f007f[variable: it]
Confidence: INFERRED

java.lang.AssertionError: 
(9 more lines...)

Error summary

The build generated some errors. See the full build log for more details.

Jan 21, 2020 11:02:11 PM org.apache.http.impl.execchain.RetryExec execute
INFO: I/O exception (org.apache.http.NoHttpResponseException) caught when processing request to {s}->https://download.eclipse.org:443: The target server failed to respond
Jan 21, 2020 11:02:11 PM org.apache.http.impl.execchain.RetryExec execute
INFO: Retrying request to {s}->https://download.eclipse.org:443

(SWT:8186): Gtk-WARNING **: 23:03:34.208: gtk_widget_size_allocate(): attempt to allocate widget with width -3 and height -3

(SWT:8186): Gtk-CRITICAL **: 23:03:36.887: gtk_box_gadget_distribute: assertion 'size >= 0' failed in GtkScrollbar
TypeInferencingVisitorWithRequestor.findMethodNode: no match found for Main.main([Qjava.lang.String;)
TypeInferencingVisitorWithRequestor.findMethodNode: no match found for Main.main([Qjava.lang.String;)
CodeSelectRequestor: Could not proceed due to null declaring type for org.codehaus.groovy.ast.expr.BinaryExpression@ecbea[org.codehaus.groovy.ast.expr.VariableExpression@ecbe3[variable: it]("in" at 1:20:  "in" )org.codehaus.groovy.ast.expr.ListExpression@ee270[]]
CodeSelectRequestor: Could not proceed due to null declaring type for org.codehaus.groovy.ast.expr.RangeExpression@ebcdd
CodeSelectRequestor: Could not proceed due to null declaring type for org.codehaus.groovy.ast.expr.RangeExpression@ebcde
TypeInferencingVisitorWithRequestor.findMethodNode: no match found for Type.x(QList<Qjava.util.Date;>;)
TypeInferencingVisitorWithRequestor.findMethodNode: no match found for Type.x(QList<Qjava.lang.Number;>;)
TypeInferencingVisitorWithRequestor.findMethodNode: no match found for Type.x(QList<Qjava.lang.Number;>;)
TypeInferencingVisitorWithRequestor.findMethodNode: no match found for Type.x(QList<Qjava.util.Date;>;)
TypeInferencingVisitorWithRequestor.findMethodNode: no match found for Type.x(QList<Qjava.lang.Number;>;)
TypeInferencingVisitorWithRequestor.findMethodNode: no match found for Type.x(QList<Qjava.lang.Number;>;)
CodeSelectRequestor: Could not proceed due to null declaring type for org.codehaus.groovy.ast.expr.ConstantExpression@e8fc6[fff]
CodeSelectRequestor: Could not proceed due to null declaring type for org.codehaus.groovy.ast.expr.ConstantExpression@e8fca[fff]
CodeSelectRequestor: Could not proceed due to null declaring type for org.codehaus.groovy.ast.expr.ConstantExpression@e8fca[fff]
Waiting for: Java indexing... 3 files to index (/Project)
Waiting for: Java indexing... 22 files to index (/Project)
Waiting for: Java indexing... 4 files to index (/opt/bamboo-home/xml-data/build-dir/GRECLIPSE-E410-JOB1/ide-test/org.codehaus.groovy.alltests/target/work/plugins/org.eclipse.jdt.groovy.core.tests.builder_3.7.0.v202001212302-e1812/lib/binGroovySearch.jar)
Waiting for: Java indexing... 22 files to index (/Project)
Waiting for: Java indexing... 22 files to index (/Project)
Waiting for: Java indexing... 22 files to index (/Project)
Waiting for: Java indexing... 22 files to index (/Project)
Waiting for: Java indexing... 21 files to index (/Project)
Waiting for: Java indexing... 21 files to index (/Project)
Waiting for: Java indexing... 15 files to index (/opt/jdk8u232-b09/jre/lib/jsse.jar)