Build: #537 failed

Job: Default Job failed

Stages & jobs

  1. Default Stage

Job result summary

Completed
Duration
98 minutes
Agent
bamboo-14.af.pivotal.io
Revision
6effbf75085f86e2fd9efa01a3519bea51c41195 6effbf75085f86e2fd9efa01a3519bea51c41195
Total tests
6310
Failing since
#535 (Code changes detected – )
Fixed in
#541 (Code changes detected)

Tests

  • 6,310 tests in total
  • 7 tests failed
  • 7 failures are new
  • 1 test was fixed
  • 136 tests were quarantined / skipped
  • 93 minutes taken in total.
New test failures 7
Status Test Duration
Collapse Failed JUnit3TestFinderTests testFindAllTestSuites History
1 sec
org.eclipse.jdt.core.JavaModelException: /TestProject/src/p/script.groovy already exists in target
	at org.codehaus.groovy.eclipse.junit.test.JUnit3TestFinderTests.testFindAllTestSuites(JUnit3TestFinderTests.groovy:82)
Collapse Failed JUnit3TestFinderTests testFinderOfNonPublicSubclass History
4 secs
org.eclipse.jdt.core.JavaModelException: /TestProject/src/p/script.groovy already exists in target
	at org.codehaus.groovy.eclipse.junit.test.JUnit3TestFinderTests.testFinderOfNonPublicSubclass(JUnit3TestFinderTests.groovy:66)
Collapse Failed JUnit3TestFinderTests testFinderOfSubclass History
2 secs
org.eclipse.jdt.core.JavaModelException: /TestProject/src/p/script.groovy already exists in target
	at org.codehaus.groovy.eclipse.junit.test.JUnit3TestFinderTests.testFinderOfSubclass(JUnit3TestFinderTests.groovy:50)
Collapse Failed JUnit4TestFinderTests testFindAllTestSuites History
1 sec
org.eclipse.jdt.core.JavaModelException: /TestProject/src/p/script.groovy already exists in target
	at org.codehaus.groovy.eclipse.junit.test.JUnit4TestFinderTests.testFindAllTestSuites(JUnit4TestFinderTests.groovy:123)
Collapse Failed JUnit4TestFinderTests testFinderOfNonPublicSubclass History
5 secs
org.eclipse.jdt.core.JavaModelException: /TestProject/src/p/script.groovy already exists in target
	at org.codehaus.groovy.eclipse.junit.test.JUnit4TestFinderTests.testFinderOfNonPublicSubclass(JUnit4TestFinderTests.groovy:67)
Collapse Failed JUnit4TestFinderTests testFinderOfSubclass History
1 sec
org.eclipse.jdt.core.JavaModelException: /TestProject/src/p/script.groovy already exists in target
	at org.codehaus.groovy.eclipse.junit.test.JUnit4TestFinderTests.testFinderOfSubclass(JUnit4TestFinderTests.groovy:51)
Collapse Failed DGMInferencingTests testDGM35 History
< 1 sec
java.lang.AssertionError: Expected type not found.
Expected: java.io.InputStream
Found: java.lang.Object
Declaring type: groovy.lang.Closure<V extends java.lang.Object>
ASTNode: org.codehaus.groovy.ast.expr.VariableExpression@f1349[variable: it]
Confidence: INFERRED

java.lang.AssertionError: 
(9 more lines...)
Fixed tests 1
Status Test Failing since Duration
Successful DGMInferencingTests testDGM36 History
Failing since build #536 (Code changes detected) < 1 sec

Error summary

The build generated some errors. See the full build log for more details.


(SWT:1766): Gtk-CRITICAL **: 23:07:55.236: gtk_box_gadget_distribute: assertion 'size >= 0' failed in GtkScrollbar
TypeInferencingVisitorWithRequestor.findMethodNode: no match found for Main.main([Qjava.lang.String;)
TypeInferencingVisitorWithRequestor.findMethodNode: no match found for Main.main([Qjava.lang.String;)
CodeSelectRequestor: Could not proceed due to null declaring type for org.codehaus.groovy.ast.expr.BinaryExpression@ecbea[org.codehaus.groovy.ast.expr.VariableExpression@ecbe3[variable: it]("in" at 1:20:  "in" )org.codehaus.groovy.ast.expr.ListExpression@ee270[]]
CodeSelectRequestor: Could not proceed due to null declaring type for org.codehaus.groovy.ast.expr.RangeExpression@ebcdd
CodeSelectRequestor: Could not proceed due to null declaring type for org.codehaus.groovy.ast.expr.RangeExpression@ebcde
TypeInferencingVisitorWithRequestor.findMethodNode: no match found for Type.x(QList<Qjava.util.Date;>;)
TypeInferencingVisitorWithRequestor.findMethodNode: no match found for Type.x(QList<Qjava.lang.Number;>;)
TypeInferencingVisitorWithRequestor.findMethodNode: no match found for Type.x(QList<Qjava.util.Date;>;)
TypeInferencingVisitorWithRequestor.findMethodNode: no match found for Type.x(QList<Qjava.lang.Number;>;)
CodeSelectRequestor: Could not proceed due to null declaring type for org.codehaus.groovy.ast.expr.ConstantExpression@e8fc6[fff]
CodeSelectRequestor: Could not proceed due to null declaring type for org.codehaus.groovy.ast.expr.ConstantExpression@e8fca[fff]
CodeSelectRequestor: Could not proceed due to null declaring type for org.codehaus.groovy.ast.expr.ConstantExpression@e8fca[fff]
Waiting for: Java indexing... 22 files to index (/Project)
Waiting for: Java indexing... 4 files to index (/opt/bamboo-home/xml-data/build-dir/GRECLIPSE-E410-JOB1/ide-test/org.codehaus.groovy.alltests/target/work/plugins/org.eclipse.jdt.groovy.core.tests.builder_3.7.0.v202002262306-e1812/lib/binGroovySearch.jar)
Waiting for: Java indexing... 22 files to index (/Project)
Waiting for: Java indexing... 22 files to index (/Project)
Waiting for: Java indexing... 22 files to index (/Project)
Waiting for: Java indexing... 22 files to index (/Project)
Waiting for: Java indexing... 22 files to index (/Project)
Waiting for: Java indexing... 21 files to index (/Project)
Waiting for: Java indexing... 21 files to index (/Project)
Waiting for: Flushing content description cache.
Waiting for: Java indexing... 21 files to index (/Project)
Waiting for: Java indexing... 16 files to index (/opt/jdk8u232-b09/jre/lib/rt.jar)