Build: #694 failed

Job: Default Job failed

Stages & jobs

  1. Default Stage

Job result summary

Completed
Duration
103 minutes
Agent
bamboo-11.af.pivotal.io
Revision
f34b8cd30df86b18e7ca29a0096e6821ac3a35d9 f34b8cd30df86b18e7ca29a0096e6821ac3a35d9
Total tests
6591
Fixed in
#695 (Code changes detected)

Tests

  • 6,591 tests in total
  • 2 tests failed
  • 2 failures are new
  • 141 tests were quarantined / skipped
  • 98 minutes taken in total.
New test failures 2
Status Test Duration
Collapse Failed BinarySearchTests testMethodRefInInitializer History
1 sec
java.lang.AssertionError: Expecting 2 matches, but found 0

java.lang.AssertionError: 
Expecting 2 matches, but found 0

	at org.eclipse.jdt.core.groovy.tests.search.BinarySearchTests.assertMatches(BinarySearchTests.java:139)
	at org.eclipse.jdt.core.groovy.tests.search.BinarySearchTests.testMethodRefInInitializer(BinarySearchTests.java:217)
Collapse Failed DGMInferencingTests testDGM50 History
< 1 sec
java.lang.AssertionError: Expected type not found.
Expected: java.lang.Long
Found: java.lang.Object
Declaring type: java.lang.Long
ASTNode: org.codehaus.groovy.ast.expr.ConstantExpression@edeae[abs]
Confidence: UNKNOWN

java.lang.AssertionError: 
(9 more lines...)

Error summary

The build generated some errors. See the full build log for more details.

Jul 03, 2020 5:41:37 PM org.apache.http.impl.execchain.RetryExec execute
INFO: I/O exception (org.apache.http.NoHttpResponseException) caught when processing request to {s}->https://download.eclipse.org:443: The target server failed to respond
Jul 03, 2020 5:41:37 PM org.apache.http.impl.execchain.RetryExec execute
INFO: Retrying request to {s}->https://download.eclipse.org:443

(SWT:17863): Gtk-CRITICAL **: 17:43:19.050: gtk_box_gadget_distribute: assertion 'size >= 0' failed in GtkScrollbar
TypeInferencingVisitorWithRequestor.findMethodNode: no match found for Main.main([Qjava.lang.String;)
TypeInferencingVisitorWithRequestor.findMethodNode: no match found for Main.main([Qjava.lang.String;)
CodeSelectRequestor: Could not proceed due to null declaring type for org.codehaus.groovy.ast.expr.BinaryExpression@ecbea[org.codehaus.groovy.ast.expr.VariableExpression@ecbe3[variable: it]("in" at 1:20:  "in" )org.codehaus.groovy.ast.expr.ListExpression@ee270[]]
CodeSelectRequestor: Could not proceed due to null declaring type for org.codehaus.groovy.ast.expr.RangeExpression@ebcdd
CodeSelectRequestor: Could not proceed due to null declaring type for org.codehaus.groovy.ast.expr.RangeExpression@ebcde
CodeSelectRequestor: Could not proceed due to null declaring type for org.codehaus.groovy.ast.expr.ClosureExpression@ec463null{ org.codehaus.groovy.ast.stmt.BlockStatement@ec463[] }
CodeSelectRequestor: Could not proceed due to null declaring type for org.codehaus.groovy.ast.expr.ClosureExpression@ec46fnull{ org.codehaus.groovy.ast.stmt.BlockStatement@ec46f[org.codehaus.groovy.ast.stmt.ReturnStatement@ed732[expression:org.codehaus.groovy.ast.expr.ConstantExpression@ef179[null]]] }
CodeSelectRequestor: Could not proceed due to null declaring type for org.codehaus.groovy.ast.expr.ClosureExpression@ec47c[org.codehaus.groovy.ast.Parameter@ecbed[name:param type: java.lang.String, hasDefaultValue: false]]{ org.codehaus.groovy.ast.stmt.BlockStatement@ec47c[org.codehaus.groovy.ast.stmt.ReturnStatement@f080c[expression:org.codehaus.groovy.ast.expr.ConstantExpression@f2253[null]]] }
TypeInferencingVisitorWithRequestor.findMethodNode: no match found for Type.x(QList<Qjava.util.Date;>;)
TypeInferencingVisitorWithRequestor.findMethodNode: no match found for Type.x(QList<Qjava.lang.Number;>;)
TypeInferencingVisitorWithRequestor.findMethodNode: no match found for Type.x(QList<Qjava.util.Date;>;)
TypeInferencingVisitorWithRequestor.findMethodNode: no match found for Type.x(QList<Qjava.lang.Number;>;)
TypeInferencingVisitorWithRequestor.findMethodNode: no match found for Type.x(QList<Qjava.lang.Number;>;)
CodeSelectRequestor: Could not proceed due to null declaring type for org.codehaus.groovy.ast.expr.ConstantExpression@e8fc6[fff]
CodeSelectRequestor: Could not proceed due to null declaring type for org.codehaus.groovy.ast.expr.ConstantExpression@e8fca[fff]
CodeSelectRequestor: Could not proceed due to null declaring type for org.codehaus.groovy.ast.expr.ConstantExpression@e8fca[fff]
Waiting for: Java indexing... 24 files to index (/Project)
Waiting for: Flushing content description cache.
Waiting for: Java indexing... 24 files to index (/Project)
Waiting for: Java indexing... 24 files to index (/Project)
Waiting for: Java indexing... 24 files to index (/Project)
Waiting for: Java indexing... 24 files to index (/Project)
Waiting for: Java indexing... 24 files to index (/Project)
Waiting for: Java indexing... 24 files to index (/Project)
Waiting for: Java indexing... 23 files to index (/Project)
Waiting for: Java indexing... 23 files to index (/Project)
Waiting for: Java indexing... 23 files to index (/Project)
Waiting for: Flushing content description cache.
Waiting for: Java indexing... 4 files to index (/Project)