Build: #738 failed Changes by Eric Milles

Build result summary

Details

Completed
Duration
105 minutes
Labels
None
Agent
bamboo-21.af.pivotal.io
Revision
25de4ee90e719a7dff6d30369d028ae54b91c6e8 25de4ee90e719a7dff6d30369d028ae54b91c6e8
Total tests
6807
Failing since
#731 (Changes by Eric Milles)

Responsible

Code commits

Author Commit Message Commit date
Eric Milles Eric Milles 25de4ee90e719a7dff6d30369d028ae54b91c6e8 25de4ee90e719a7dff6d30369d028ae54b91c6e8 Eclipse 4.17 JDT Patch for Groovy-Eclipse: JDT commit 8d0952b
#1139
Eric Milles Eric Milles 16aeea7156ce400c6ded228bcd637779f0c1d790 16aeea7156ce400c6ded228bcd637779f0c1d790 Fix for #1160: Object and Object[] get same distance in fallback
Eric Milles Eric Milles 287738640c293817663aea7cacd91d26a876bcef 287738640c293817663aea7cacd91d26a876bcef GROOVY-8961, GROOVY-9734

Tests

New test failures 6
Status Test View job Duration
Collapse Failed BasicGroovyBuildTests testClosureIncremental History
Default Job < 1 sec
org.junit.ComparisonFailure: unexpected recompiled units. lenExpected=5 lenActual=10 expected:<{Launch,[OtherGroovy,OtherGroovy$_iterate_closure1,Runner],Runner$_run_closure...> but was:<{Launch,[Launch,OtherGroovy,OtherGroovy,OtherGroovy$_iterate_closure1,OtherGroovy$_iterate_closure1,Runner,Runner,Runner$_run_closure1],Runner$_run_closure...>
	at org.eclipse.jdt.core.groovy.tests.builder.BasicGroovyBuildTests.testClosureIncremental(BasicGroovyBuildTests.java:1874)
Collapse Failed DGMInferencingTests testDGM42 History
Default Job < 1 sec
java.lang.AssertionError: Expected type not found.
Expected: java.lang.String
Found: java.lang.Object
Declaring type: groovy.lang.Closure<V extends java.lang.Object>
ASTNode: org.codehaus.groovy.ast.expr.VariableExpression@217b3bb[variable: it]
Confidence: INFERRED

java.lang.AssertionError: 
(9 more lines...)
Collapse Failed DGMInferencingTests testDGMDeclaring4 History
Default Job < 1 sec
java.lang.AssertionError: Expected declaring type not found.
 Expected: org.codehaus.groovy.runtime.dgmimpl.NumberNumberMinus
 Found type: java.lang.Object
 Found declaring type: java.lang.Integer
 ASTNode: org.codehaus.groovy.ast.expr.ConstantExpression@4e762587[minus]
java.lang.AssertionError: 
Expected declaring type not found.
	Expected: org.codehaus.groovy.runtime.dgmimpl.NumberNumberMinus
(5 more lines...)
Collapse Failed DGMInferencingTests testDGM15 History
Default Job < 1 sec
java.lang.AssertionError: Expected type not found.
Expected: java.util.Map$Entry<java.lang.String,java.lang.Integer>
Found: java.lang.Object
Declaring type: groovy.lang.Closure<V extends java.lang.Object>
ASTNode: org.codehaus.groovy.ast.expr.VariableExpression@5c621999[variable: it]
Confidence: INFERRED

java.lang.AssertionError: 
(9 more lines...)
Collapse Failed InferencingTests testSpread9 History
Default Job < 1 sec
java.lang.AssertionError: Expected type not found.
Expected: java.lang.Integer
Found: java.lang.Object
Declaring type: java.util.List<java.lang.Integer>
ASTNode: org.codehaus.groovy.ast.expr.ConstantExpression@44da0359[intValue]
Confidence: UNKNOWN

java.lang.AssertionError: 
(8 more lines...)
Collapse Failed InferencingTests testSpread10 History
Default Job < 1 sec
java.lang.AssertionError: Expected type not found.
Expected: java.lang.Integer
Found: java.lang.Object
Declaring type: java.util.List<java.lang.Integer>
ASTNode: org.codehaus.groovy.ast.expr.ConstantExpression@404c5ea4[value]
Confidence: UNKNOWN

java.lang.AssertionError: 
(8 more lines...)
Fixed tests 2
Status Test Failing since View job Duration
Successful BasicGroovyBuildTests testProjectCompilerConfigScript1 History
Failing since build #737 (Changes by Eric Milles) Default Job < 1 sec
Successful BuildAccessRulesTests testAccessForExtendsGenerics History
Failing since build #737 (Changes by Eric Milles) Default Job < 1 sec

Jira issues

IssueDescriptionStatus
Unknown Issue TypeGROOVY-8961Could not obtain issue details from Jira
Unknown Issue TypeGROOVY-9734Could not obtain issue details from Jira