Build: #144 failed Changes by Eric Milles

Build result summary

Details

Completed
Duration
105 minutes
Labels
None
Revision
90a6b3059f84741867bf5997d08fa2d26b636166 90a6b3059f84741867bf5997d08fa2d26b636166
Total tests
5713
Failing since
#134 (Changes by Eric Milles)
Fixed in
#146 (Changes by Eric Milles)

Responsible

Code commits

Author Commit Message Commit date
Eric Milles Eric Milles 90a6b3059f84741867bf5997d08fa2d26b636166 90a6b3059f84741867bf5997d08fa2d26b636166 add @Generated annotation to default constructor for incremental compile
Eric Milles Eric Milles cd898e78d0e5489e2b46eb9cf0191df087d0bcc5 cd898e78d0e5489e2b46eb9cf0191df087d0bcc5 minor fix-ups

Tests

New test failures 2
Status Test View job Duration
Collapse Failed ArrayInferencingTests testArray4 History
Default Job < 1 sec
java.lang.AssertionError: Expected type not found.
Expected: java.lang.CharSequence
Found: java.lang.CharSequence[]
Declaring type: null
ASTNode: org.codehaus.groovy.ast.expr.BinaryExpression@f1e91[org.codehaus.groovy.ast.expr.VariableExpression@f1e8e[variable: x]("[" at 1:40:  "[" )org.codehaus.groovy.ast.expr.ConstantExpression@f2612[0]]
Confidence: EXACT

java.lang.AssertionError: 
(9 more lines...)
Collapse Failed BinarySearchTests testMethodDecl History
Default Job < 1 sec
java.lang.AssertionError: Expecting 4 matches, but found 0

java.lang.AssertionError: 
Expecting 4 matches, but found 0

	at org.eclipse.jdt.core.groovy.tests.search.BinarySearchTests.assertMatches(BinarySearchTests.java:135)
	at org.eclipse.jdt.core.groovy.tests.search.BinarySearchTests.testMethodDecl(BinarySearchTests.java:195)
Fixed tests 2
Status Test Failing since View job Duration
Successful BasicGroovyBuildTests testGRE1773 History
Failing since build #139 (Changes by Eric Milles) Default Job < 1 sec
Successful ConstructorReferenceSearchTests testConstructorReferences2 History
Failing since build #143 (Changes by Eric Milles) Default Job < 1 sec