Build: #331 failed Changes by Eric Milles

Build result summary

Details

Completed
Duration
93 minutes
Labels
None
Agent
bamboo-18.af.pivotal.io
Revision
f40793f60ca401f0751b6f298cca3f16e09d6d96 f40793f60ca401f0751b6f298cca3f16e09d6d96
Total tests
6156
Failing since
#265 (Changes by Eric Milles)

Responsible

Code commits

Author Commit Message Commit date
Eric Milles Eric Milles f40793f60ca401f0751b6f298cca3f16e09d6d96 f40793f60ca401f0751b6f298cca3f16e09d6d96 GROOVY-8686

Configuration changes

Plan configuration has changed since the last successful build. See the plan audit log for more details.

Tests

New test failures 9
Status Test View job Duration
Collapse Failed BinarySearchTests testFieldDecl1 History
Default Job 1 sec
java.lang.AssertionError: Expecting 2 matches, but found 0

java.lang.AssertionError: 
Expecting 2 matches, but found 0

	at org.eclipse.jdt.core.groovy.tests.search.BinarySearchTests.assertMatches(BinarySearchTests.java:139)
	at org.eclipse.jdt.core.groovy.tests.search.BinarySearchTests.testFieldDecl1(BinarySearchTests.java:181)
Collapse Failed ConstructorReferenceSearchTests testNewifyConstructorReferences4 History
Default Job < 1 sec
java.lang.AssertionError: expected:<2> but was:<0>
	at org.eclipse.jdt.core.groovy.tests.search.ConstructorReferenceSearchTests.testNewifyConstructorReferences4(ConstructorReferenceSearchTests.java:450)
Collapse Failed ConstructorReferenceSearchTests testNewifyConstructorReferences3 History
Default Job < 1 sec
java.lang.AssertionError: expected:<2> but was:<0>
	at org.eclipse.jdt.core.groovy.tests.search.ConstructorReferenceSearchTests.testNewifyConstructorReferences3(ConstructorReferenceSearchTests.java:429)
Collapse Failed ConstructorReferenceSearchTests testNewifyConstructorReferences1 History
Default Job < 1 sec
java.lang.AssertionError: expected:<2> but was:<0>
	at org.eclipse.jdt.core.groovy.tests.search.ConstructorReferenceSearchTests.testNewifyConstructorReferences1(ConstructorReferenceSearchTests.java:387)
Collapse Failed ConstructorReferenceSearchTests testConstructorReferences8 History
Default Job < 1 sec
java.lang.AssertionError: expected:<1> but was:<0>
	at org.eclipse.jdt.core.groovy.tests.search.ConstructorReferenceSearchTests.testConstructorReferences8(ConstructorReferenceSearchTests.java:218)
Collapse Failed DGMInferencingTests testDGM33 History
Default Job < 1 sec
java.lang.AssertionError: Expected type not found.
Expected: java.lang.String
Found: java.lang.Object
Declaring type: groovy.lang.Closure<V extends java.lang.Object>
ASTNode: org.codehaus.groovy.ast.expr.VariableExpression@fbc63[variable: it]
Confidence: INFERRED

java.lang.AssertionError: 
(9 more lines...)
Collapse Failed DGMInferencingTests testDGM22 History
Default Job < 1 sec
java.lang.AssertionError: Expected type not found.
Expected: java.lang.Integer
Found: java.lang.Object
Declaring type: groovy.lang.Closure<V extends java.lang.Object>
ASTNode: org.codehaus.groovy.ast.expr.VariableExpression@ecbe3[variable: it]
Confidence: INFERRED

java.lang.AssertionError: 
(9 more lines...)
Collapse Failed MethodReferenceSearchTests testExplicitPropertyGetterSearch2 History
Default Job < 1 sec
java.lang.AssertionError: expected:<4> but was:<0>
	at org.eclipse.jdt.core.groovy.tests.search.MethodReferenceSearchTests.testExplicitPropertyGetterSearch2(MethodReferenceSearchTests.java:526)
Collapse Failed MethodReferenceSearchTests testMethodWithDefaultParameters3 History
Default Job < 1 sec
java.lang.AssertionError: expected:<2> but was:<0>
	at org.eclipse.jdt.core.groovy.tests.search.MethodReferenceSearchTests.testMethodWithDefaultParameters3(MethodReferenceSearchTests.java:389)
Existing test failures 1
Status Test Failing since View job Duration
junit.framework.ComparisonFailure: 
----------- Expected ------------

------------ but was ------------
Problem : The import util.MyException is never used [ resource : </Project/src/p/Test.java> range : <18,34> category : <120> severity : <1>]

--------- Difference is ----------
 expected:<[]> but was:<[Problem : The import util.MyException is never used [ resource : </Project/src/p/Test.java> range : <18,34> category : <120> severity : <1>]
(12 more lines...)
Fixed tests 1
Status Test Failing since View job Duration
Successful BasicGroovyBuildTests testSimpleTaskMarkerInSingleLineComment History
Failing since build #330 (Changes by Eric Milles) Default Job < 1 sec

Jira issues

IssueDescriptionStatus
Unknown Issue TypeGROOVY-8686Could not obtain issue details from Jira