Build: #344 failed Changes by Eric Milles

Build result summary

Details

Completed
Duration
93 minutes
Labels
None
Agent
bamboo-19.af.pivotal.io
Revision
8590c03d9a08b5473d56cb04ae0d002351685ed2 8590c03d9a08b5473d56cb04ae0d002351685ed2
Total tests
6181
Failing since
#265 (Changes by Eric Milles)

Responsible

Code commits

Author Commit Message Commit date
Eric Milles Eric Milles 8590c03d9a08b5473d56cb04ae0d002351685ed2 8590c03d9a08b5473d56cb04ae0d002351685ed2 minor fix-ups

Configuration changes

Plan configuration has changed since the last successful build. See the plan audit log for more details.

Tests

New test failures 5
Status Test View job Duration
Collapse Failed BasicGroovyBuildTests testBuildClash History
Default Job < 1 sec
org.junit.ComparisonFailure: unexpected recompiled units. lenExpected=1 lenActual=2 expected:<{StackTester[]}> but was:<{StackTester[,StackTester]}>
	at org.eclipse.jdt.core.groovy.tests.builder.BasicGroovyBuildTests.testBuildClash(BasicGroovyBuildTests.java:3421)
Collapse Failed BuildAccessRulesTests testAccessForLocalVariable History
Default Job < 1 sec
junit.framework.ComparisonFailure: 
----------- Expected ------------
Problem : Access restriction: The type 'BeanInfo' is not API (restriction on required library '##') [ resource : </Project/src/Foo.groovy> range : <51,59> category : <150> severity : <2>]

------------ but was ------------

--------- Difference is ----------
 expected:<[Problem : Access restriction: The type 'BeanInfo' is not API (restriction on required library '##') [ resource : </Project/src/Foo.groovy> range : <51,59> category : <150> severity : <2>]
(13 more lines...)
Collapse Failed BinarySearchTests testMethodRefInInitializer History
Default Job 1 sec
java.lang.AssertionError: Expecting 2 matches, but found 0

java.lang.AssertionError: 
Expecting 2 matches, but found 0

	at org.eclipse.jdt.core.groovy.tests.search.BinarySearchTests.assertMatches(BinarySearchTests.java:139)
	at org.eclipse.jdt.core.groovy.tests.search.BinarySearchTests.testMethodRefInInitializer(BinarySearchTests.java:217)
Collapse Failed ConstructorReferenceSearchTests testConstructorReferences10 History
Default Job < 1 sec
java.lang.AssertionError: expected:<1> but was:<0>
	at org.eclipse.jdt.core.groovy.tests.search.ConstructorReferenceSearchTests.testConstructorReferences10(ConstructorReferenceSearchTests.java:258)
Collapse Failed MethodReferenceSearchTests testExplicitPropertySetterSearch1 History
Default Job 1 sec
java.lang.AssertionError: expected:<5> but was:<0>
	at org.eclipse.jdt.core.groovy.tests.search.MethodReferenceSearchTests.testExplicitPropertySetterSearch1(MethodReferenceSearchTests.java:623)
Existing test failures 1
Status Test Failing since View job Duration
junit.framework.ComparisonFailure: 
----------- Expected ------------

------------ but was ------------
Problem : The import util.MyException is never used [ resource : </Project/src/p/Test.java> range : <18,34> category : <120> severity : <1>]

--------- Difference is ----------
 expected:<[]> but was:<[Problem : The import util.MyException is never used [ resource : </Project/src/p/Test.java> range : <18,34> category : <120> severity : <1>]
(12 more lines...)
Fixed tests 3
Status Test Failing since View job Duration
Successful CodeSelectImportsTests testCodeSelectOnImportPackage3 History
Failing since build #343 (Changes by Eric Milles) Default Job 1 sec
Successful BinarySearchTests testClassDecl1 History
Failing since build #343 (Changes by Eric Milles) Default Job 1 sec
Successful TypeReferenceSearchTests testFindClassDeclarationWithPattern History
Failing since build #343 (Changes by Eric Milles) Default Job < 1 sec