Build: #345 failed Changes by Eric Milles

Build result summary

Details

Completed
Duration
94 minutes
Labels
None
Agent
bamboo-18.af.pivotal.io
Revision
1780c16c2593ecdbf3d2cbcce3335e9b6f0a29e2 1780c16c2593ecdbf3d2cbcce3335e9b6f0a29e2
Total tests
6184
Failing since
#265 (Changes by Eric Milles)

Responsible

Code commits

Author Commit Message Commit date
Eric Milles Eric Milles 1780c16c2593ecdbf3d2cbcce3335e9b6f0a29e2 1780c16c2593ecdbf3d2cbcce3335e9b6f0a29e2 Fix for #959: check aliased annotations for attribute methods

Configuration changes

Plan configuration has changed since the last successful build. See the plan audit log for more details.

Tests

New test failures 4
Status Test View job Duration
Collapse Failed BasicGroovyBuildTests testTraitIncremental History
Default Job < 1 sec
org.junit.ComparisonFailure: unexpected recompiled units. lenExpected=4 lenActual=8 expected:<{Runner,[p.Named,p.Named$Trait$Helper],q.NamedClass}> but was:<{Runner,[Runner,p.Named,p.Named,p.Named$Trait$Helper,p.Named$Trait$Helper,q.NamedClass],q.NamedClass}>
	at org.eclipse.jdt.core.groovy.tests.builder.BasicGroovyBuildTests.testTraitIncremental(BasicGroovyBuildTests.java:2887)
Collapse Failed ConstructorReferenceSearchTests testConstructorReferences6 History
Default Job < 1 sec
java.lang.AssertionError: expected:<2> but was:<0>
	at org.eclipse.jdt.core.groovy.tests.search.ConstructorReferenceSearchTests.testConstructorReferences6(ConstructorReferenceSearchTests.java:180)
Collapse Failed DGMInferencingTests testDGMDeclaring1 History
Default Job < 1 sec
java.lang.AssertionError: Expected declaring type not found.
 Expected: org.codehaus.groovy.runtime.StringGroovyMethods
 Found type: java.lang.String
 Found declaring type: java.lang.String
 ASTNode: org.codehaus.groovy.ast.expr.ConstantExpression@e9b0f[eachLine]
java.lang.AssertionError: 
Expected declaring type not found.
	Expected: org.codehaus.groovy.runtime.StringGroovyMethods
(5 more lines...)
Collapse Failed InferencingTests testSpread3 History
Default Job < 1 sec
java.lang.AssertionError: Expected type not found.
Expected: java.lang.Integer
Found: java.lang.String
Declaring type: java.util.List<java.lang.Integer>
ASTNode: org.codehaus.groovy.ast.expr.ConstantExpression@ee634[value]
Confidence: UNKNOWN

java.lang.AssertionError: 
(8 more lines...)
Existing test failures 1
Status Test Failing since View job Duration
junit.framework.ComparisonFailure: 
----------- Expected ------------

------------ but was ------------
Problem : The import util.MyException is never used [ resource : </Project/src/p/Test.java> range : <18,34> category : <120> severity : <1>]

--------- Difference is ----------
 expected:<[]> but was:<[Problem : The import util.MyException is never used [ resource : </Project/src/p/Test.java> range : <18,34> category : <120> severity : <1>]
(12 more lines...)
Fixed tests 5
Status Test Failing since View job Duration
Successful BasicGroovyBuildTests testBuildClash History
Failing since build #344 (Changes by Eric Milles) Default Job 1 sec
Successful BuildAccessRulesTests testAccessForLocalVariable History
Failing since build #344 (Changes by Eric Milles) Default Job < 1 sec
Successful BinarySearchTests testMethodRefInInitializer History
Failing since build #344 (Changes by Eric Milles) Default Job 1 sec
Successful ConstructorReferenceSearchTests testConstructorReferences10 History
Failing since build #344 (Changes by Eric Milles) Default Job < 1 sec
Successful MethodReferenceSearchTests testExplicitPropertySetterSearch1 History
Failing since build #344 (Changes by Eric Milles) Default Job < 1 sec