Build: #351 failed Changes by Eric Milles

Build result summary

Details

Completed
Duration
93 minutes
Labels
None
Agent
bamboo-17.af.pivotal.io
Revision
fa80d42e631db1c8971b1d724531910312b73bc7 fa80d42e631db1c8971b1d724531910312b73bc7
Total tests
6189
Fixed in
#409 (Changes by Eric Milles)

Responsible

Code commits

Author Commit Message Commit date
Eric Milles Eric Milles fa80d42e631db1c8971b1d724531910312b73bc7 fa80d42e631db1c8971b1d724531910312b73bc7 fix test case
#999

Tests

New test failures 4
Status Test View job Duration
Collapse Failed ConstructorReferenceSearchTests testConstructorReferences2 History
Default Job < 1 sec
java.lang.AssertionError: Incorrect number of matches; expected:<1> but was:<0>
	at org.eclipse.jdt.core.groovy.tests.search.ConstructorReferenceSearchTests.testConstructorReferences2(ConstructorReferenceSearchTests.java:96)
Collapse Failed ConstructorReferenceSearchTests testConstructorReferences11 History
Default Job < 1 sec
java.lang.AssertionError: expected:<2> but was:<0>
	at org.eclipse.jdt.core.groovy.tests.search.ConstructorReferenceSearchTests.testConstructorReferences11(ConstructorReferenceSearchTests.java:276)
Collapse Failed ConstructorReferenceSearchTests testConstructorReferences12a History
Default Job < 1 sec
java.lang.AssertionError: expected:<3> but was:<0>
	at org.eclipse.jdt.core.groovy.tests.search.ConstructorReferenceSearchTests.testConstructorReferences12a(ConstructorReferenceSearchTests.java:332)
Collapse Failed MethodReferenceSearchTests testGenericsMethodReferenceSearch History
Default Job < 1 sec
java.lang.AssertionError: expected:<1> but was:<0>
	at org.eclipse.jdt.core.groovy.tests.search.MethodReferenceSearchTests.testGenericsMethodReferenceSearch(MethodReferenceSearchTests.java:710)
Existing test failures 1
Status Test Failing since View job Duration
junit.framework.ComparisonFailure: 
----------- Expected ------------

------------ but was ------------
Problem : The import util.MyException is never used [ resource : </Project/src/p/Test.java> range : <18,34> category : <120> severity : <1>]

--------- Difference is ----------
 expected:<[]> but was:<[Problem : The import util.MyException is never used [ resource : </Project/src/p/Test.java> range : <18,34> category : <120> severity : <1>]
(12 more lines...)
Fixed tests 37
Status Test Failing since View job Duration
Successful SyntheticAccessorRenamingTests testSetterOnly2 History
Default Job 1 sec
Successful SyntheticAccessorRenamingTests testSetterOnly1 History
Default Job 1 sec
Successful SyntheticAccessorRenamingTests testIsserOnly History
Default Job 1 sec
Successful SyntheticAccessorRenamingTests testJavaRename2 History
Default Job 1 sec
Successful SyntheticAccessorRenamingTests testJavaRename1 History
Default Job 1 sec
Successful SyntheticAccessorRenamingTests testStaticSetterOnly4a History
Default Job 1 sec
Successful SyntheticAccessorRenamingTests testMultiFileRename1 History
Default Job 1 sec
Successful SyntheticAccessorRenamingTests testMultiFileRename2 History
Default Job 1 sec
Successful SyntheticAccessorRenamingTests testMultiFileRename5 History
Default Job 1 sec
Successful SyntheticAccessorRenamingTests testMultiFileRename6 History
Default Job 1 sec
Successful SyntheticAccessorRenamingTests testMultiFileRename7 History
Default Job 1 sec
Successful SyntheticAccessorRenamingTests testStaticIsserOnly2 History
Default Job 1 sec
Successful SyntheticAccessorRenamingTests testStaticIsserOnly1 History
Default Job 1 sec
Successful SyntheticAccessorRenamingTests testAliasedAccess History
Default Job 1 sec
Successful SyntheticAccessorRenamingTests testStaticGetterOnly2 History
Default Job 1 sec
Successful SyntheticAccessorRenamingTests testStaticGetterOnly1 History
Default Job 1 sec
Successful SyntheticAccessorRenamingTests testStaticSetterOnly4 History
Default Job < 1 sec
Successful SyntheticAccessorRenamingTests testStaticSetterOnly2 History
Default Job 1 sec
Successful SyntheticAccessorRenamingTests testStaticSetterOnly1 History
Default Job 1 sec
Successful SyntheticAccessorRenamingTests testConstructorAccess History
Default Job 1 sec
Successful SyntheticAccessorRenamingTests testFieldAndGetterAndSetter1 History
Default Job 1 sec
Successful SyntheticAccessorRenamingTests testFieldAndGetterAndSetter4 History
Default Job 1 sec
Successful SyntheticAccessorRenamingTests testFieldAndGetterAndSetter2 History
Default Job 1 sec
Successful SyntheticAccessorRenamingTests testFieldAndGetterAndSetter3 History
Default Job 1 sec
Successful SyntheticAccessorRenamingTests testGetterOnly History
Default Job 1 sec
Successful SyntheticAccessorRenamingTests testSingleFileRename1 History
Default Job 1 sec
Successful SyntheticAccessorRenamingTests testSingleFileRename3 History
Default Job 1 sec
Successful SyntheticAccessorRenamingTests testSingleFileRename2 History
Default Job 1 sec
Successful SyntheticAccessorRenamingTests testSingleFileRename4 History
Default Job 1 sec
Successful SyntheticAccessorRenamingTests testSubclassAccess2 History
Default Job 1 sec
Successful SyntheticAccessorRenamingTests testSubclassAccess1 History
Default Job 4 secs
Successful SyntheticAccessorRenamingTests testSetterOnly2a History
Default Job 1 sec
Successful OutlineExtenderTests testOutlineTreeConsistency2 History
Default Job 1 sec
Successful BasicGroovyBuildTests testClosureIncremental History
Default Job 2 secs
Successful ArrayInferencingTests testArrayProperty2 History
Default Job < 1 sec
Successful BinarySearchTests testMethodDecl History
Default Job 1 sec
Successful ConstructorReferenceSearchTests testConstructorReferences8 History
Default Job < 1 sec