Build: #372 failed Changes by Eric Milles

Build result summary

Details

Completed
Duration
95 minutes
Labels
None
Agent
bamboo-17.af.pivotal.io
Revision
b221e6ca7178568111c0523642eb0cb05d3ada3e b221e6ca7178568111c0523642eb0cb05d3ada3e
Total tests
6264
Failing since
#351 (Changes by Eric Milles)
Fixed in
#409 (Changes by Eric Milles)

Responsible

Code commits

Author Commit Message Commit date
Eric Milles Eric Milles b221e6ca7178568111c0523642eb0cb05d3ada3e b221e6ca7178568111c0523642eb0cb05d3ada3e GROOVY-9327

Tests

New test failures 8
Status Test View job Duration
Collapse Failed BasicGroovyBuildTests testUpdateProjectPreferences History
Default Job < 1 sec
junit.framework.ComparisonFailure: 
----------- Expected ------------

------------ but was ------------
Problem : The import util.MyException is never used [ resource : </Project/src/p/Test.java> range : <18,34> category : <120> severity : <1>]

--------- Difference is ----------
 expected:<[]> but was:<[Problem : The import util.MyException is never used [ resource : </Project/src/p/Test.java> range : <18,34> category : <120> severity : <1>]
(12 more lines...)
Collapse Failed BasicGroovyBuildTests testIncrementalGenericsAndBinaryTypeBindings_GRE566 History
Default Job < 1 sec
org.junit.ComparisonFailure: unexpected recompiled units. lenExpected=5 lenActual=4 expected:<{pkg.Event[,pkg.Event]Impl,pkg.Face,pkg.Gr...> but was:<{pkg.Event[]Impl,pkg.Face,pkg.Gr...>
	at org.eclipse.jdt.core.groovy.tests.builder.BasicGroovyBuildTests.testIncrementalGenericsAndBinaryTypeBindings_GRE566(BasicGroovyBuildTests.java:2198)
Collapse Failed BasicGroovyBuildTests testNoDoubleResolve History
Default Job < 1 sec
java.lang.AssertionError
	at org.eclipse.jdt.core.groovy.tests.builder.BasicGroovyBuildTests.testNoDoubleResolve(BasicGroovyBuildTests.java:2726)
Collapse Failed GroovyContentTypeTests testJavaThenGroovyProject History
Default Job < 1 sec
java.lang.AssertionError: L/Project/bin/p1/HelloJava.class should exist
	at org.eclipse.jdt.core.groovy.tests.model.GroovyContentTypeTests.checkJavaProject(GroovyContentTypeTests.java:152)
	at org.eclipse.jdt.core.groovy.tests.model.GroovyContentTypeTests.testJavaThenGroovyProject(GroovyContentTypeTests.java:98)
Collapse Failed ClosureInferencingTests testNestedClosure16 History
Default Job < 1 sec
java.lang.AssertionError: Expected type not found.
Expected: java.lang.Boolean
Found: java.lang.Object
Declaring type: groovy.lang.Closure
ASTNode: org.codehaus.groovy.ast.expr.ConstantExpression@12c643[meth]
Confidence: UNKNOWN

java.lang.AssertionError: 
(8 more lines...)
Collapse Failed ConstructorReferenceSearchTests testConstructorReferences5 History
Default Job < 1 sec
java.lang.AssertionError: expected:<1> but was:<0>
	at org.eclipse.jdt.core.groovy.tests.search.ConstructorReferenceSearchTests.testConstructorReferences5(ConstructorReferenceSearchTests.java:162)
Collapse Failed ConstructorReferenceSearchTests testConstructorReferences10 History
Default Job < 1 sec
java.lang.AssertionError: expected:<1> but was:<0>
	at org.eclipse.jdt.core.groovy.tests.search.ConstructorReferenceSearchTests.testConstructorReferences10(ConstructorReferenceSearchTests.java:258)
Collapse Failed MethodReferenceSearchTests testExplicitPropertyGetterSearch3 History
Default Job < 1 sec
java.lang.AssertionError: expected:<3> but was:<0>
	at org.eclipse.jdt.core.groovy.tests.search.MethodReferenceSearchTests.testExplicitPropertyGetterSearch3(MethodReferenceSearchTests.java:575)
Fixed tests 1
Status Test Failing since View job Duration
Successful BinarySearchTests testFieldDecl2 History
Failing since build #371 (Changes by Eric Milles) Default Job 1 sec

Jira issues

IssueDescriptionStatus
Unknown Issue TypeGROOVY-9327Could not obtain issue details from Jira