Build: #420 failed Changes by Eric Milles

Build result summary

Details

Completed
Duration
101 minutes
Labels
None
Agent
bamboo-13.af.pivotal.io
Revision
4d51fed4eeb9ac11df868fbfe059c05c085dadaa 4d51fed4eeb9ac11df868fbfe059c05c085dadaa
Total tests
6302
Failing since
#418 (Changes by Eric Milles)
Fixed in
#423 (Changes by Eric Milles)

Responsible

Code commits

Author Commit Message Commit date
Eric Milles Eric Milles 4d51fed4eeb9ac11df868fbfe059c05c085dadaa 4d51fed4eeb9ac11df868fbfe059c05c085dadaa fix style issues

Configuration changes

Plan configuration has changed since the last successful build. See the plan audit log for more details.

Tests

New test failures 1
Status Test View job Duration
Collapse Failed DGMInferencingTests testDGM36 History
Default Job < 1 sec
java.lang.AssertionError: Expected type not found.
Expected: java.io.DataOutputStream
Found: java.lang.Object
Declaring type: groovy.lang.Closure<V extends java.lang.Object>
ASTNode: org.codehaus.groovy.ast.expr.VariableExpression@f2613[variable: it]
Confidence: INFERRED

java.lang.AssertionError: 
(9 more lines...)
Existing test failures 10
Status Test Failing since View job Duration
java.lang.AssertionError: Expecting normal exit, but found invalid exit value expected:<0> but was:<1>
	at org.codehaus.groovy.eclipse.test.launch.GroovyScriptLaunchShortcutTests.launchScriptAndAssertExitValue(GroovyScriptLaunchShortcutTests.groovy:328)
	at org.codehaus.groovy.eclipse.test.launch.GroovyScriptLaunchShortcutTests.launchScriptAndAssertExitValue(GroovyScriptLaunchShortcutTests.groovy)
	at org.codehaus.groovy.eclipse.test.launch.GroovyScriptLaunchShortcutTests.testScriptLaunch5(GroovyScriptLaunchShortcutTests.groovy:185)
java.lang.AssertionError: Expecting normal exit, but found invalid exit value expected:<0> but was:<1>
	at org.codehaus.groovy.eclipse.test.launch.GroovyScriptLaunchShortcutTests.launchScriptAndAssertExitValue(GroovyScriptLaunchShortcutTests.groovy:328)
	at org.codehaus.groovy.eclipse.test.launch.GroovyScriptLaunchShortcutTests.launchScriptAndAssertExitValue(GroovyScriptLaunchShortcutTests.groovy)
	at org.codehaus.groovy.eclipse.test.launch.GroovyScriptLaunchShortcutTests.testScriptLaunch4(GroovyScriptLaunchShortcutTests.groovy:176)
java.lang.AssertionError: Expecting normal exit, but found invalid exit value expected:<0> but was:<1>
	at org.codehaus.groovy.eclipse.test.launch.GroovyScriptLaunchShortcutTests.launchScriptAndAssertExitValue(GroovyScriptLaunchShortcutTests.groovy:328)
	at org.codehaus.groovy.eclipse.test.launch.GroovyScriptLaunchShortcutTests.launchScriptAndAssertExitValue(GroovyScriptLaunchShortcutTests.groovy)
	at org.codehaus.groovy.eclipse.test.launch.GroovyScriptLaunchShortcutTests.testScriptLaunch7(GroovyScriptLaunchShortcutTests.groovy:203)
java.lang.AssertionError: Expecting normal exit, but found invalid exit value expected:<0> but was:<1>
	at org.codehaus.groovy.eclipse.test.launch.GroovyScriptLaunchShortcutTests.launchScriptAndAssertExitValue(GroovyScriptLaunchShortcutTests.groovy:328)
	at org.codehaus.groovy.eclipse.test.launch.GroovyScriptLaunchShortcutTests.launchScriptAndAssertExitValue(GroovyScriptLaunchShortcutTests.groovy)
	at org.codehaus.groovy.eclipse.test.launch.GroovyScriptLaunchShortcutTests.testScriptLaunch6(GroovyScriptLaunchShortcutTests.groovy:194)
java.lang.AssertionError: Expecting normal exit, but found invalid exit value expected:<0> but was:<1>
	at org.codehaus.groovy.eclipse.test.launch.GroovyScriptLaunchShortcutTests.launchScriptAndAssertExitValue(GroovyScriptLaunchShortcutTests.groovy:328)
	at org.codehaus.groovy.eclipse.test.launch.GroovyScriptLaunchShortcutTests.launchScriptAndAssertExitValue(GroovyScriptLaunchShortcutTests.groovy)
	at org.codehaus.groovy.eclipse.test.launch.GroovyScriptLaunchShortcutTests.testScriptLaunch10(GroovyScriptLaunchShortcutTests.groovy:245)
java.lang.AssertionError: Expecting normal exit, but found invalid exit value expected:<0> but was:<1>
	at org.codehaus.groovy.eclipse.test.launch.GroovyScriptLaunchShortcutTests.launchScriptAndAssertExitValue(GroovyScriptLaunchShortcutTests.groovy:328)
	at org.codehaus.groovy.eclipse.test.launch.GroovyScriptLaunchShortcutTests.launchScriptAndAssertExitValue(GroovyScriptLaunchShortcutTests.groovy)
	at org.codehaus.groovy.eclipse.test.launch.GroovyScriptLaunchShortcutTests.testScriptLaunch1(GroovyScriptLaunchShortcutTests.groovy:149)
java.lang.AssertionError: Expecting normal exit, but found invalid exit value expected:<0> but was:<1>
	at org.codehaus.groovy.eclipse.test.launch.GroovyScriptLaunchShortcutTests.launchScriptAndAssertExitValue(GroovyScriptLaunchShortcutTests.groovy:328)
	at org.codehaus.groovy.eclipse.test.launch.GroovyScriptLaunchShortcutTests.launchScriptAndAssertExitValue(GroovyScriptLaunchShortcutTests.groovy)
	at org.codehaus.groovy.eclipse.test.launch.GroovyScriptLaunchShortcutTests.testScriptLaunch9(GroovyScriptLaunchShortcutTests.groovy:224)
java.lang.AssertionError: Expecting normal exit, but found invalid exit value expected:<0> but was:<1>
	at org.codehaus.groovy.eclipse.test.launch.GroovyScriptLaunchShortcutTests.launchScriptAndAssertExitValue(GroovyScriptLaunchShortcutTests.groovy:328)
	at org.codehaus.groovy.eclipse.test.launch.GroovyScriptLaunchShortcutTests.launchScriptAndAssertExitValue(GroovyScriptLaunchShortcutTests.groovy)
	at org.codehaus.groovy.eclipse.test.launch.GroovyScriptLaunchShortcutTests.testScriptLaunch8(GroovyScriptLaunchShortcutTests.groovy:212)
java.lang.AssertionError: Expecting normal exit, but found invalid exit value expected:<0> but was:<1>
	at org.codehaus.groovy.eclipse.test.launch.GroovyScriptLaunchShortcutTests.launchScriptAndAssertExitValue(GroovyScriptLaunchShortcutTests.groovy:328)
	at org.codehaus.groovy.eclipse.test.launch.GroovyScriptLaunchShortcutTests.launchScriptAndAssertExitValue(GroovyScriptLaunchShortcutTests.groovy)
	at org.codehaus.groovy.eclipse.test.launch.GroovyScriptLaunchShortcutTests.testScriptLaunch2(GroovyScriptLaunchShortcutTests.groovy:158)
java.lang.AssertionError: Expecting normal exit, but found invalid exit value expected:<0> but was:<1>
	at org.codehaus.groovy.eclipse.test.launch.GroovyScriptLaunchShortcutTests.launchScriptAndAssertExitValue(GroovyScriptLaunchShortcutTests.groovy:328)
	at org.codehaus.groovy.eclipse.test.launch.GroovyScriptLaunchShortcutTests.launchScriptAndAssertExitValue(GroovyScriptLaunchShortcutTests.groovy)
	at org.codehaus.groovy.eclipse.test.launch.GroovyScriptLaunchShortcutTests.testScriptLaunch3(GroovyScriptLaunchShortcutTests.groovy:167)
Fixed tests 2
Status Test Failing since View job Duration
Successful BasicGroovyBuildTests testTags4 History
Failing since build #419 (Changes by Eric Milles) Default Job < 1 sec
Successful ConstructorReferenceSearchTests testConstructorReferences11a History
Failing since build #419 (Changes by Eric Milles) Default Job < 1 sec