Build: #741 failed Changes by Eric Milles

Build result summary

Details

Completed
Duration
73 minutes
Labels
None
Agent
bamboo-10.af.pivotal.io
Revision
d486c94ba0fcbca71390446c095fab34c2560948 d486c94ba0fcbca71390446c095fab34c2560948
Total tests
6012
Failing since
#740 (Changes by Eric Milles)
Fixed in
#742 (Changes by Eric Milles)

Tests

Responsible

Code commits

Author Commit Message Commit date
Eric Milles Eric Milles d486c94ba0fcbca71390446c095fab34c2560948 d486c94ba0fcbca71390446c095fab34c2560948 Fix for #1240: check "use" call for "this" object expression

Tests

New test failures 2
Status Test View job Duration
Collapse Failed ConstructorReferenceSearchTests testConstructorReferences7 History
Default Job < 1 sec
java.lang.AssertionError: expected:<1> but was:<0>
	at org.eclipse.jdt.core.groovy.tests.search.ConstructorReferenceSearchTests.testConstructorReferences7(ConstructorReferenceSearchTests.java:196)
Collapse Failed StaticInferencingTests testStaticImport6 History
Default Job < 1 sec
java.lang.AssertionError: Expected type not found.
Expected: java.lang.Boolean
Found: java.lang.Object
Declaring type: p.Other
ASTNode: org.codehaus.groovy.ast.expr.ConstantExpression@7647aa3f[BAR]
Confidence: UNKNOWN

java.lang.AssertionError: 
(8 more lines...)