Build: #153 failed

Job: Default Job failed

Stages & jobs

  1. Default Stage

Job result summary

Completed
Duration
106 minutes
Revision
e2e08dccc9adfc6afc759f3a0ef5178a549ca32a e2e08dccc9adfc6afc759f3a0ef5178a549ca32a
Total tests
5714
Fixed in
#170 (Code changes detected)

Tests

  • 5,714 tests in total
  • 7 tests failed
  • 7 failures are new
  • 102 tests were quarantined / skipped
  • 100 minutes taken in total.
New test failures 7
Status Test Duration
Collapse Failed SyntheticMemberSearchTests testSearchInGroovy1 History
1 sec
java.lang.AssertionError: Wrong number of matches found in:
 expected:<3> but was:<0>
java.lang.AssertionError: 
Wrong number of matches found in:
 expected:<3> but was:<0>
	at org.codehaus.groovy.eclipse.core.test.SyntheticMemberSearchTests.assertNumMatch(SyntheticMemberSearchTests.groovy:291)
	at org.codehaus.groovy.eclipse.core.test.SyntheticMemberSearchTests.testSearchInGroovy1(SyntheticMemberSearchTests.groovy:72)
Collapse Failed SyntheticMemberSearchTests testSearchInJava1 History
5 secs
java.lang.AssertionError: Wrong number of matches found in:
 expected:<3> but was:<0>
java.lang.AssertionError: 
Wrong number of matches found in:
 expected:<3> but was:<0>
	at org.codehaus.groovy.eclipse.core.test.SyntheticMemberSearchTests.assertNumMatch(SyntheticMemberSearchTests.groovy:291)
	at org.codehaus.groovy.eclipse.core.test.SyntheticMemberSearchTests.testSearchInJava1(SyntheticMemberSearchTests.groovy:171)
Collapse Failed SyntheticMemberSearchTests testSearchInJava2 History
1 sec
java.lang.AssertionError: Wrong number of matches found in:
 expected:<1> but was:<0>
java.lang.AssertionError: 
Wrong number of matches found in:
 expected:<1> but was:<0>
	at org.codehaus.groovy.eclipse.core.test.SyntheticMemberSearchTests.assertNumMatch(SyntheticMemberSearchTests.groovy:291)
	at org.codehaus.groovy.eclipse.core.test.SyntheticMemberSearchTests.testSearchInJava2(SyntheticMemberSearchTests.groovy:193)
Collapse Failed SyntheticMemberSearchTests testSearchInJava3 History
1 sec
java.lang.AssertionError: Wrong number of matches found in:
 expected:<1> but was:<0>
java.lang.AssertionError: 
Wrong number of matches found in:
 expected:<1> but was:<0>
	at org.codehaus.groovy.eclipse.core.test.SyntheticMemberSearchTests.assertNumMatch(SyntheticMemberSearchTests.groovy:291)
	at org.codehaus.groovy.eclipse.core.test.SyntheticMemberSearchTests.testSearchInJava3(SyntheticMemberSearchTests.groovy:215)
Collapse Failed SyntheticMemberSearchTests testSearchInJava4 History
1 sec
java.lang.AssertionError: Wrong number of matches found in:
 expected:<1> but was:<0>
java.lang.AssertionError: 
Wrong number of matches found in:
 expected:<1> but was:<0>
	at org.codehaus.groovy.eclipse.core.test.SyntheticMemberSearchTests.assertNumMatch(SyntheticMemberSearchTests.groovy:291)
	at org.codehaus.groovy.eclipse.core.test.SyntheticMemberSearchTests.testSearchInJava4(SyntheticMemberSearchTests.groovy:237)
Collapse Failed BuildAccessRulesTests testAccessForMethodParameterGenerics History
< 1 sec
junit.framework.ComparisonFailure: 
----------- Expected ------------
Problem : Access restriction: The type 'BeanInfo' is not API (restriction on required library '##') [ resource : </Project/src/Foo.groovy> range : <48,56> category : <150> severity : <2>]

------------ but was ------------

--------- Difference is ----------
 expected:<[Problem : Access restriction: The type 'BeanInfo' is not API (restriction on required library '##') [ resource : </Project/src/Foo.groovy> range : <48,56> category : <150> severity : <2>]
(13 more lines...)
Collapse Failed BuildAccessRulesTests testAccessForMethodReturnType History
< 1 sec
junit.framework.ComparisonFailure: 
----------- Expected ------------
Problem : Access restriction: The type 'BeanInfo' is not API (restriction on required library '##') [ resource : </Project/src/Foo.groovy> range : <34,42> category : <150> severity : <2>]

------------ but was ------------

--------- Difference is ----------
 expected:<[Problem : Access restriction: The type 'BeanInfo' is not API (restriction on required library '##') [ resource : </Project/src/Foo.groovy> range : <34,42> category : <150> severity : <2>]
(13 more lines...)

Error summary

The build generated some errors. See the full build log for more details.

*** BUG ***
In pixman_region32_init_rect: Invalid rectangle passed
Set a breakpoint on '_pixman_log_error' to debug

*** BUG ***
In pixman_region32_init_rect: Invalid rectangle passed
Set a breakpoint on '_pixman_log_error' to debug

*** BUG ***
In pixman_region32_init_rect: Invalid rectangle passed
Set a breakpoint on '_pixman_log_error' to debug

*** BUG ***
In pixman_region32_init_rect: Invalid rectangle passed
Set a breakpoint on '_pixman_log_error' to debug

*** BUG ***
In pixman_region32_init_rect: Invalid rectangle passed
Set a breakpoint on '_pixman_log_error' to debug

TypeInferencingVisitorWithRequestor.findMethodNode: no match found for Foo(QMap.Entry;, Qjava.lang.Object;)
TypeInferencingVisitorWithRequestor.findMethodNode: no match found for Foo(QMap.Entry;)
TypeInferencingVisitorWithRequestor.findMethodNode: no match found for Foo(QDictionary;)
TypeInferencingVisitorWithRequestor.findMethodNode: no match found for TestUnit575454.y(QOuter.Inner;)
TypeInferencingVisitorWithRequestor.findMethodNode: no match found for TestUnit575454.y(QOuter.Inner;)
TypeInferencingVisitorWithRequestor.findMethodNode: no match found for TestUnit722793.y(QOuter.Inner;)
TypeInferencingVisitorWithRequestor.findMethodNode: no match found for TestUnit722793.y(QOuter.Inner;)
TypeInferencingVisitorWithRequestor.findMethodNode: no match found for Main.main([Qjava.lang.String;)
TypeInferencingVisitorWithRequestor.findMethodNode: no match found for Main.main([Qjava.lang.String;)
CodeSelectRequestor: Could not proceed due to null declaring type for org.codehaus.groovy.ast.expr.BinaryExpression@ecbea[org.codehaus.groovy.ast.expr.VariableExpression@ecbe3[variable: it]("in" at 1:20:  "in" )org.codehaus.groovy.ast.expr.ListExpression@ee270[]]
CodeSelectRequestor: Could not proceed due to null declaring type for org.codehaus.groovy.ast.expr.RangeExpression@ebcdd
CodeSelectRequestor: Could not proceed due to null declaring type for org.codehaus.groovy.ast.expr.RangeExpression@ebcde
TypeInferencingVisitorWithRequestor.findMethodNode: no match found for Type.x(QList<Qjava.util.Date;>;)
TypeInferencingVisitorWithRequestor.findMethodNode: no match found for Type.x(QList<Qjava.lang.Number;>;)
TypeInferencingVisitorWithRequestor.findMethodNode: no match found for Type.x(QList<Qjava.util.Date;>;)
TypeInferencingVisitorWithRequestor.findMethodNode: no match found for Type.x(QList<Qjava.lang.Number;>;)
CodeSelectRequestor: Could not proceed due to null declaring type for org.codehaus.groovy.ast.expr.ConstantExpression@e8fc6[fff]
CodeSelectRequestor: Could not proceed due to null declaring type for org.codehaus.groovy.ast.expr.ConstantExpression@e8fca[fff]
CodeSelectRequestor: Could not proceed due to null declaring type for org.codehaus.groovy.ast.expr.ConstantExpression@e8fca[fff]
Waiting for: Java indexing... 4 files to index (/opt/jdk1.8.0_201/jre/lib/ext/zipfs.jar)
Waiting for: Java indexing... 24 files to index (/Project)
Waiting for: Java indexing... 4 files to index (/opt/bamboo-home/xml-data/build-dir/GRECLIPSE-E411-JOB1/ide-test/org.codehaus.groovy.alltests/target/work/plugins/org.eclipse.jdt.groovy.core.tests.builder_3.4.0.v201905200334-e1903/lib/binGroovySearch.jar)
Waiting for: Java indexing... 24 files to index (/Project)
Waiting for: Java indexing... 24 files to index (/Project)
Waiting for: Java indexing... 24 files to index (/Project)
Waiting for: Java indexing... 18 files to index (/opt/jdk1.8.0_201/jre/lib/resources.jar)
Waiting for: Java indexing... 23 files to index (/Project)
Waiting for: Java indexing... 23 files to index (/Project)
Waiting for: Java indexing... 16 files to index (/opt/jdk1.8.0_201/jre/lib/ext/zipfs.jar)