Build: #252 failed

Job: Default Job failed

Stages & jobs

  1. Default Stage

Job result summary

Completed
Duration
106 minutes
Agent
bamboo-19.af.pivotal.io
Revision
64f3ae0a3c620bb54b1af1db5974d12a1ce2decd 64f3ae0a3c620bb54b1af1db5974d12a1ce2decd
Total tests
5991
Failing since
#220 (Code changes detected – )
Fixed in
#253 (Code changes detected)

Tests

  • 5,991 tests in total
  • 36 tests failed
  • 36 failures are new
  • 34 tests were fixed
  • 117 tests were quarantined / skipped
  • 101 minutes taken in total.
New test failures 36
Status Test Duration
Collapse Failed RenameTypeTests test1 History
1 sec
org.junit.ComparisonFailure: invalid renaming expected:<...
class B{
   void m([B] a){};
}> but was:<...
class B{
   void m([A] a){};
}>
org.junit.ComparisonFailure: 
(11 more lines...)
Collapse Failed RenameTypeTests test10 History
1 sec
org.junit.ComparisonFailure: invalid renaming expected:<...her {
    def x = { [B] a ->
              ...> but was:<...her {
    def x = { [A] a ->
              ...>
org.junit.ComparisonFailure: 
invalid renaming expected:<...her {
    def x = { [B] a ->
(7 more lines...)
Collapse Failed RenameTypeTests test11 History
1 sec
org.junit.ComparisonFailure: invalid renaming expected:<...tatic x() {
        [B]
    }
}> but was:<...tatic x() {
        [A]
    }
}>
org.junit.ComparisonFailure: 
(11 more lines...)
Collapse Failed RenameTypeTests test12 History
1 sec
org.junit.ComparisonFailure: invalid renaming expected:<...  def x() {
        [B]
    }
}> but was:<...  def x() {
        [A]
    }
}>
org.junit.ComparisonFailure: 
(11 more lines...)
Collapse Failed RenameTypeTests test13 History
1 sec
org.junit.ComparisonFailure: invalid renaming expected:<...lic class B {
    B([B a){}
    B a(B a){
        a= new B(new B](a));
        return...> but was:<...lic class B {
    B([A a){}
    A a(A a){
        a= new A(new A](a));
(15 more lines...)
Collapse Failed RenameTypeTests test2 History
1 sec
org.junit.ComparisonFailure: invalid renaming expected:<...
class B{
   void m([B a){};
}

class Sub extends B {
    void m(B] a){}
}> but was:<...
(27 more lines...)
Collapse Failed RenameTypeTests test3 History
1 sec
org.junit.ComparisonFailure: invalid renaming expected:<...erface B{
   void m([B a);
}

class Sub implements B {
    void m(B] a){}
}> but was:<...erface B{
   void m([A a);
(23 more lines...)
Collapse Failed RenameTypeTests test4 History
1 sec
org.junit.ComparisonFailure: invalid renaming expected:<...kage p;
class B{
   [B] m(a) {}
}> but was:<...kage p;
class B{
   [A] m(a) {}
}>
org.junit.ComparisonFailure: 
(11 more lines...)
Collapse Failed RenameTypeTests test5 History
1 sec
org.junit.ComparisonFailure: invalid renaming expected:<...  def x() {
        [B x = new B]()
    }
}> but was:<...  def x() {
        [A x = new A]()
    }
}>
org.junit.ComparisonFailure: 
(11 more lines...)
Collapse Failed RenameTypeTests test6 History
1 sec
org.junit.ComparisonFailure: invalid renaming expected:<...

class Other {
    [B x = new B]()
}> but was:<...

class Other {
    [A x = new A]()
(15 more lines...)
Collapse Failed RenameTypeTests test7 History
1 sec
org.junit.ComparisonFailure: invalid renaming expected:<...

class Other {
    [B x() {
        def x = {
                B a = new B]()
        }
    }
(31 more lines...)
Collapse Failed RenameTypeTests test8 History
1 sec
org.junit.ComparisonFailure: invalid renaming expected:<...

class Other {
    [B x() {
        def x = { B] a ->
              ...> but was:<...

class Other {
(19 more lines...)
Collapse Failed RenameTypeTests test9 History
1 sec
org.junit.ComparisonFailure: invalid renaming expected:<...f x = {
            [B a = new B]()
    }
}> but was:<...f x = {
            [A a = new A]()
    }
}>
org.junit.ComparisonFailure: 
(11 more lines...)
Collapse Failed RenameTypeTests testAlias1 History
1 sec
org.junit.ComparisonFailure: invalid renaming in p2.A expected:<...ckage p2;

import p.[B] as Other;

class C ...> but was:<...ckage p2;

import p.[A] as Other;

(12 more lines...)
Collapse Failed RenameTypeTests testAnnotation1 History
1 sec
org.junit.ComparisonFailure: invalid renaming expected:<...
@interface B { }

@[B
class Client {
    @Deprecated @B]() void bad() { }
}> but was:<...
@interface B { }
(23 more lines...)
Collapse Failed RenameTypeTests testAnnotation2 History
1 sec
org.junit.ComparisonFailure: invalid renaming expected:<...interface Main {
   [B child() default @B("Void");
}

@Main(child=@/*test*/B(""))
@B("")
class Client {
    @Deprecated
(47 more lines...)
Collapse Failed RenameTypeTests testAnnotation3 History
1 sec
org.junit.ComparisonFailure: invalid renaming expected:<... default "NULL";
}
@[B("")
class Test {
    
    @B("A and p.Test.A and p.A and q.Test.A")
    void test () {
        ArrayList<String> list= new ArrayList<String>() {
(39 more lines...)
Collapse Failed RenameTypeTests testEnum1 History
1 sec
org.junit.ComparisonFailure: invalid renaming in p2.A expected:<...ckage p2;

import p.[B;

class C {
    p.B a= p.B.ONE;
    p.B b= p.B].ONE;
    C a2= new ...> but was:<...ckage p2;
(24 more lines...)
Collapse Failed RenameTypeTests testEnum2 History
1 sec
org.junit.ComparisonFailure: invalid renaming expected:<...ONE ,
    BIG ;
    [B longerNameThan(B] a) { a }
}
> but was:<...ONE ,
    BIG ;
    [A longerNameThan(A] a) { a }
}
(15 more lines...)
Collapse Failed RenameTypeTests testGenerics1 History
1 sec
org.junit.ComparisonFailure: invalid renaming expected:<...X x) {}

    void m([B a) {
        new B<T>();
        new B<T>(null, "y");
    };
}

(59 more lines...)
Collapse Failed RenameTypeTests testGenerics2 History
1 sec
org.junit.ComparisonFailure: invalid renaming expected:<...A> {
    A a;
    p.[B pa= new p.B]();
}
> but was:<...A> {
    A a;
    p.[A pa= new p.A]();
}
(15 more lines...)
Collapse Failed RenameTypeTests testGenerics3 History
1 sec
org.junit.ComparisonFailure: invalid renaming expected:<...  ArrayList<? super [B> fSink;
}

class U extends ArrayList<B> {
    public boolean add(B arg0) {
        return false;
    }
}
(35 more lines...)
Collapse Failed RenameTypeTests testGenerics4 History
1 sec
org.junit.ComparisonFailure: invalid renaming expected:<...    Class<? extends [B> class1= this.getClass();
    Class<? extends B> class2= B.class;
    Class<B> class3= (Class<B>) this.getClass();
    X<B> getX() {
        X<B> x= new X<B>();
        x.t= (new ArrayList<B>() as B[]);
        return x;
    }
(51 more lines...)
Collapse Failed RenameTypeTests testGenerics5 History
1 sec
org.junit.ComparisonFailure: expected:<...p

class C {
  List<[B> list1
  List<? super B> list2
  List<? extends B> list3
  List<Collection<B>> list4

(36 more lines...)
Collapse Failed RenameTypeTests testInner1 History
1 sec
org.junit.ComparisonFailure: invalid renaming expected:<...e p

import p.Outer.[B
import p.Outer.AZ

class Outer {
  class B {
  }
(85 more lines...)
Collapse Failed RenameTypeTests testInner2 History
1 sec
org.junit.ComparisonFailure: invalid renaming expected:<...n.*
import static p.[Wrapper.Inner.*
import p.OuterAgain.InnerAgain
import p.Wrapper.Inner
import p.OuterAgain.*
import p.Wrapper.*

class Wrapper {
(85 more lines...)
Collapse Failed RenameTypeTests testInner3 History
1 sec
org.junit.ComparisonFailure: expected:<...n.*
import static p.[Wrapper.Inner.*
import p.OuterAgain.InnerAgain
import p.Wrapper.Inner
import p.OuterAgain.*
import p.Wrapper.*

val = OuterAgain.InnerAgain.thing
(36 more lines...)
Collapse Failed RenameTypeTests testJavadoc1 History
1 sec
org.junit.ComparisonFailure: invalid renaming expected:<package p;
/**
 * [B
 */
class B{ }

class Other {
    def x = {
(37 more lines...)
Collapse Failed BasicGroovyBuildTests testCompileStatic_FileAddAll History
< 1 sec
org.junit.ComparisonFailure: unexpected recompiled units. lenExpected=1 lenActual=2 expected:<{Foo[]}> but was:<{Foo[,Foo]}>
	at org.eclipse.jdt.core.groovy.tests.builder.BasicGroovyBuildTests.testCompileStatic_FileAddAll(BasicGroovyBuildTests.java:753)
Collapse Failed BasicGroovyBuildTests testProjectBasedirAsOutputLocation History
< 1 sec
org.junit.ComparisonFailure: unexpected recompiled units. lenExpected=1 lenActual=2 expected:<{p.Script[]}> but was:<{p.Script[,p.Script]}>
	at org.eclipse.jdt.core.groovy.tests.builder.BasicGroovyBuildTests.testProjectBasedirAsOutputLocation(BasicGroovyBuildTests.java:316)
Collapse Failed BinarySearchTests testClassDecl2 History
1 sec
java.lang.AssertionError: Expecting 4 matches, but found 0

java.lang.AssertionError: 
Expecting 4 matches, but found 0

	at org.eclipse.jdt.core.groovy.tests.search.BinarySearchTests.assertMatches(BinarySearchTests.java:135)
	at org.eclipse.jdt.core.groovy.tests.search.BinarySearchTests.testClassDecl2(BinarySearchTests.java:168)
Collapse Failed BinarySearchTests testMethodRefInInitializer History
1 sec
java.lang.AssertionError: Expecting 2 matches, but found 0

java.lang.AssertionError: 
Expecting 2 matches, but found 0

	at org.eclipse.jdt.core.groovy.tests.search.BinarySearchTests.assertMatches(BinarySearchTests.java:135)
	at org.eclipse.jdt.core.groovy.tests.search.BinarySearchTests.testMethodRefInInitializer(BinarySearchTests.java:213)
Collapse Failed ConstructorReferenceSearchTests testConstructorReferences11 History
< 1 sec
java.lang.AssertionError: expected:<2> but was:<0>
	at org.eclipse.jdt.core.groovy.tests.search.ConstructorReferenceSearchTests.testConstructorReferences11(ConstructorReferenceSearchTests.java:276)
Collapse Failed ConstructorReferenceSearchTests testConstructorReferences2 History
< 1 sec
java.lang.AssertionError: Incorrect number of matches; expected:<1> but was:<0>
	at org.eclipse.jdt.core.groovy.tests.search.ConstructorReferenceSearchTests.testConstructorReferences2(ConstructorReferenceSearchTests.java:96)
Collapse Failed ConstructorReferenceSearchTests testNewifyConstructorReferences4 History
< 1 sec
java.lang.AssertionError: expected:<2> but was:<0>
	at org.eclipse.jdt.core.groovy.tests.search.ConstructorReferenceSearchTests.testNewifyConstructorReferences4(ConstructorReferenceSearchTests.java:450)
Collapse Failed DGMInferencingTests testDGM51 History
< 1 sec
java.lang.AssertionError: Expected type not found.
Expected: java.lang.Integer
Found: java.lang.String
Declaring type: java.lang.Integer
ASTNode: org.codehaus.groovy.ast.expr.ConstantExpression@edaec[abs]
Confidence: UNKNOWN

java.lang.AssertionError: 
(9 more lines...)
Fixed tests 34
Status Test Failing since Duration
Successful SyntheticAccessorRenamingTests testAliasedAccess History
Failing since build #251 (Code changes detected) 1 sec
Successful SyntheticAccessorRenamingTests testConstructorAccess History
Failing since build #251 (Code changes detected) 1 sec
Successful SyntheticAccessorRenamingTests testFieldAndGetterAndSetter1 History
Failing since build #251 (Code changes detected) 1 sec
Successful SyntheticAccessorRenamingTests testFieldAndGetterAndSetter2 History
Failing since build #251 (Code changes detected) 2 secs
Successful SyntheticAccessorRenamingTests testFieldAndGetterAndSetter3 History
Failing since build #251 (Code changes detected) 2 secs
Successful SyntheticAccessorRenamingTests testFieldAndGetterAndSetter4 History
Failing since build #251 (Code changes detected) 2 secs
Successful SyntheticAccessorRenamingTests testGetterOnly History
Failing since build #251 (Code changes detected) 2 secs
Successful SyntheticAccessorRenamingTests testIsserOnly History
Failing since build #251 (Code changes detected) 2 secs
Successful SyntheticAccessorRenamingTests testJavaRename1 History
Failing since build #251 (Code changes detected) 1 sec
Successful SyntheticAccessorRenamingTests testJavaRename2 History
Failing since build #251 (Code changes detected) 1 sec
Successful SyntheticAccessorRenamingTests testMultiFileRename1 History
Failing since build #251 (Code changes detected) 2 secs
Successful SyntheticAccessorRenamingTests testMultiFileRename2 History
Failing since build #251 (Code changes detected) 1 sec
Successful SyntheticAccessorRenamingTests testMultiFileRename5 History
Failing since build #251 (Code changes detected) 2 secs
Successful SyntheticAccessorRenamingTests testMultiFileRename6 History
Failing since build #251 (Code changes detected) 1 sec
Successful SyntheticAccessorRenamingTests testMultiFileRename7 History
Failing since build #251 (Code changes detected) 2 secs
Successful SyntheticAccessorRenamingTests testSetterOnly1 History
Failing since build #251 (Code changes detected) 1 sec
Successful SyntheticAccessorRenamingTests testSetterOnly2 History
Failing since build #251 (Code changes detected) 2 secs
Successful SyntheticAccessorRenamingTests testSingleFileRename1 History
Failing since build #251 (Code changes detected) 2 secs
Successful SyntheticAccessorRenamingTests testSingleFileRename2 History
Failing since build #251 (Code changes detected) 2 secs
Successful SyntheticAccessorRenamingTests testSingleFileRename3 History
Failing since build #251 (Code changes detected) 1 sec
Successful SyntheticAccessorRenamingTests testSingleFileRename4 History
Failing since build #251 (Code changes detected) 1 sec
Successful SyntheticAccessorRenamingTests testStaticGetterOnly1 History
Failing since build #251 (Code changes detected) 2 secs
Successful SyntheticAccessorRenamingTests testStaticGetterOnly2 History
Failing since build #251 (Code changes detected) 1 sec
Successful SyntheticAccessorRenamingTests testStaticIsserOnly1 History
Failing since build #251 (Code changes detected) 1 sec
Successful SyntheticAccessorRenamingTests testStaticIsserOnly2 History
Failing since build #251 (Code changes detected) 1 sec
Successful SyntheticAccessorRenamingTests testStaticSetterOnly1 History
Failing since build #251 (Code changes detected) 1 sec
Successful SyntheticAccessorRenamingTests testStaticSetterOnly2 History
Failing since build #251 (Code changes detected) 2 secs
Successful SyntheticAccessorRenamingTests testStaticSetterOnly4 History
Failing since build #251 (Code changes detected) 2 secs
Successful SyntheticAccessorRenamingTests testSubclassAccess1 History
Failing since build #251 (Code changes detected) 5 secs
Successful SyntheticAccessorRenamingTests testSubclassAccess2 History
Failing since build #251 (Code changes detected) 1 sec
Successful BuildAccessRulesTests testAccessForPropertyGenerics History
Failing since build #251 (Code changes detected) < 1 sec
Successful BinarySearchTests testFieldDecl1 History
Failing since build #250 (Code changes detected) 1 sec
Successful DGMInferencingTests testDGM18 History
Failing since build #251 (Code changes detected) < 1 sec
Successful MethodReferenceSearchTests testMethodWithDefaultParameters3 History
Failing since build #250 (Code changes detected) < 1 sec

Error summary

The build generated some errors. See the full build log for more details.


(SWT:26259): Gtk-WARNING **: 02:41:08.910: gtk_widget_size_allocate(): attempt to allocate widget with width -3 and height -3

(SWT:26259): Gtk-CRITICAL **: 02:41:11.374: gtk_box_gadget_distribute: assertion 'size >= 0' failed in GtkScrollbar
TypeInferencingVisitorWithRequestor.findMethodNode: no match found for Main.main([Qjava.lang.String;)
TypeInferencingVisitorWithRequestor.findMethodNode: no match found for Main.main([Qjava.lang.String;)
TypeInferencingVisitorWithRequestor.findMethodNode: no match found for Outer$Bar.meth(QFoo;)
TypeInferencingVisitorWithRequestor.findMethodNode: no match found for Outer$Bar.meth(QFoo;)
CodeSelectRequestor: Could not proceed due to null declaring type for org.codehaus.groovy.ast.expr.BinaryExpression@ecbea[org.codehaus.groovy.ast.expr.VariableExpression@ecbe3[variable: it]("in" at 1:20:  "in" )org.codehaus.groovy.ast.expr.ListExpression@ee270[]]
CodeSelectRequestor: Could not proceed due to null declaring type for org.codehaus.groovy.ast.expr.RangeExpression@ebcdd
CodeSelectRequestor: Could not proceed due to null declaring type for org.codehaus.groovy.ast.expr.RangeExpression@ebcde
TypeInferencingVisitorWithRequestor.findMethodNode: no match found for Type.x(QList<Qjava.util.Date;>;)
TypeInferencingVisitorWithRequestor.findMethodNode: no match found for Type.x(QList<Qjava.lang.Number;>;)
TypeInferencingVisitorWithRequestor.findMethodNode: no match found for Type.x(QList<Qjava.lang.Number;>;)
TypeInferencingVisitorWithRequestor.findMethodNode: no match found for Type.x(QList<Qjava.util.Date;>;)
TypeInferencingVisitorWithRequestor.findMethodNode: no match found for Type.x(QList<Qjava.lang.Number;>;)
TypeInferencingVisitorWithRequestor.findMethodNode: no match found for Type.x(QList<Qjava.lang.Number;>;)
CodeSelectRequestor: Could not proceed due to null declaring type for org.codehaus.groovy.ast.expr.ConstantExpression@e8fc6[fff]
CodeSelectRequestor: Could not proceed due to null declaring type for org.codehaus.groovy.ast.expr.ConstantExpression@e8fca[fff]
CodeSelectRequestor: Could not proceed due to null declaring type for org.codehaus.groovy.ast.expr.ConstantExpression@e8fca[fff]
Waiting for: Java indexing... 18 files to index (/opt/jdk8u212-b03/jre/lib/rt.jar)
Waiting for: Building workspace
Waiting for: Java indexing... 22 files to index (/Project)
Waiting for: Java indexing... 22 files to index (/Project)
Waiting for: Java indexing... 4 files to index (/opt/bamboo-home/xml-data/build-dir/GRECLIPSE-E411-JOB1/ide-test/org.codehaus.groovy.alltests/target/work/plugins/org.eclipse.jdt.groovy.core.tests.builder_3.5.0.v201909150239-e1903/lib/binGroovySearch.jar)
Waiting for: Java indexing... 22 files to index (/Project)
Waiting for: Java indexing... 22 files to index (/Project)
Waiting for: Java indexing... 22 files to index (/Project)
TypeInferencingVisitorWithRequestor.findMethodNode: no match found for Outer$Inner2.meth(QInner1;)
TypeInferencingVisitorWithRequestor.findMethodNode: no match found for Outer$Inner2.meth(QInner1;)
TypeInferencingVisitorWithRequestor.findMethodNode: no match found for Groovy20.bug(QLetter;)
Waiting for: Java indexing... 21 files to index (/Project)
Waiting for: Java indexing... 21 files to index (/Project)
Waiting for: Flushing content description cache.
Waiting for: Java indexing... 21 files to index (/Project)
Waiting for: Java indexing... 3 files to index (/Project)