Build: #389 failed

Job: Default Job failed

Stages & jobs

  1. Default Stage

Job result summary

Completed
Duration
97 minutes
Agent
bamboo-16.af.pivotal.io
Revision
c73fca8f7f1595a01fcaa6b189ba0536572d674f c73fca8f7f1595a01fcaa6b189ba0536572d674f
Total tests
6284
Failing since
#351 (Code changes detected – )
Fixed in
#409 (Code changes detected)

Tests

  • 6,284 tests in total
  • 14 tests failed
  • 13 failures are new
  • 1 test was fixed
  • 140 tests were quarantined / skipped
  • 92 minutes taken in total.
New test failures 13
Status Test Duration
Collapse Failed MoveCURefactoringTests testMoveBack History
1 sec
org.junit.ComparisonFailure: Refactoring produced unexpected results: expected:<package p2
[]
public class Groovy...> but was:<package p2
[import p1.Groovy
]
public class Groovy...>
org.junit.ComparisonFailure: 
Refactoring produced unexpected results: expected:<package p2
(7 more lines...)
Collapse Failed MoveCURefactoringTests testNonPrimaryMove History
1 sec
org.junit.ComparisonFailure: Refactoring produced unexpected results: expected:<package p2
import [NEW].Groovy
public class...> but was:<package p2
import [p1].Groovy
public class...>
org.junit.ComparisonFailure: 
Refactoring produced unexpected results: expected:<package p2
import [NEW].Groovy
(5 more lines...)
Collapse Failed MoveCURefactoringTests testNonPrimaryQualifiedMove History
1 sec
org.junit.ComparisonFailure: Refactoring produced unexpected results: expected:<...ass Groovy2 extends [NEW].Groovy { }> but was:<...ass Groovy2 extends [p1].Groovy { }>
	at org.codehaus.groovy.eclipse.refactoring.test.rename.MoveCURefactoringTests.performRefactoringAndUndo(MoveCURefactoringTests.groovy:67)
	at org.codehaus.groovy.eclipse.refactoring.test.rename.MoveCURefactoringTests.testNonPrimaryQualifiedMove(MoveCURefactoringTests.groovy:235)
Collapse Failed MoveCURefactoringTests testQualifiedMove1 History
1 sec
org.junit.ComparisonFailure: Refactoring produced unexpected results: expected:<...lass Groovy extends [NEW].Java { }> but was:<...lass Groovy extends [p].Java { }>
	at org.codehaus.groovy.eclipse.refactoring.test.rename.MoveCURefactoringTests.performRefactoringAndUndo(MoveCURefactoringTests.groovy:67)
	at org.codehaus.groovy.eclipse.refactoring.test.rename.MoveCURefactoringTests.testQualifiedMove1(MoveCURefactoringTests.groovy:144)
Collapse Failed MoveCURefactoringTests testQualifiedMove2 History
1 sec
org.junit.ComparisonFailure: Refactoring produced unexpected results: expected:<...ass Groovy2 extends [NEW].Groovy { }> but was:<...ass Groovy2 extends [p1].Groovy { }>
	at org.codehaus.groovy.eclipse.refactoring.test.rename.MoveCURefactoringTests.performRefactoringAndUndo(MoveCURefactoringTests.groovy:67)
	at org.codehaus.groovy.eclipse.refactoring.test.rename.MoveCURefactoringTests.testQualifiedMove2(MoveCURefactoringTests.groovy:157)
Collapse Failed MoveCURefactoringTests testQualifiedMove3 History
< 1 sec
org.junit.ComparisonFailure: Refactoring produced unexpected results: expected:<... g1

import static j[2.Java.*
import j2.Java

class Groovy {
  def m1() {
    Java j = new j2].Java()
(33 more lines...)
Collapse Failed MoveCURefactoringTests testSimpleMove3 History
< 1 sec
org.junit.ComparisonFailure: Refactoring produced unexpected results: expected:<package p;
[
import NEW.Java

]public class Groovy ...> but was:<package p;
[]public class Groovy ...>
org.junit.ComparisonFailure: 
Refactoring produced unexpected results: expected:<package p;
(7 more lines...)
Collapse Failed MoveCURefactoringTests testSimpleMove4 History
1 sec
org.junit.ComparisonFailure: Refactoring produced unexpected results: expected:<package p2
import [NEW].Groovy
public class...> but was:<package p2
import [p1].Groovy
public class...>
org.junit.ComparisonFailure: 
Refactoring produced unexpected results: expected:<package p2
import [NEW].Groovy
(5 more lines...)
Collapse Failed BasicGroovyBuildTests testClosureIncremental History
< 1 sec
org.junit.ComparisonFailure: unexpected recompiled units. lenExpected=5 lenActual=4 expected:<{[Launch,]OtherGroovy,OtherGro...> but was:<{[]OtherGroovy,OtherGro...>
	at org.eclipse.jdt.core.groovy.tests.builder.BasicGroovyBuildTests.testClosureIncremental(BasicGroovyBuildTests.java:1751)
Collapse Failed BasicGroovyBuildTests testTraitBinary History
< 1 sec
org.junit.ComparisonFailure: unexpected recompiled units. lenExpected=5 lenActual=10 expected:<{Runner,[p.Named,p.Named$Trait$Helper,q.DefaultNamed],r.NamedClass}> but was:<{Runner,[Runner,p.Named,p.Named,p.Named$Trait$Helper,p.Named$Trait$Helper,q.DefaultNamed,q.DefaultNamed,r.NamedClass],r.NamedClass}>
	at org.eclipse.jdt.core.groovy.tests.builder.BasicGroovyBuildTests.testTraitBinary(BasicGroovyBuildTests.java:2970)
Collapse Failed BinarySearchTests testFieldDecl2 History
1 sec
java.lang.AssertionError: Expecting 2 matches, but found 0

java.lang.AssertionError: 
Expecting 2 matches, but found 0

	at org.eclipse.jdt.core.groovy.tests.search.BinarySearchTests.assertMatches(BinarySearchTests.java:139)
	at org.eclipse.jdt.core.groovy.tests.search.BinarySearchTests.testFieldDecl2(BinarySearchTests.java:190)
Collapse Failed MethodReferenceSearchTests testExplicitPropertySetterSearch1 History
< 1 sec
java.lang.AssertionError: expected:<5> but was:<0>
	at org.eclipse.jdt.core.groovy.tests.search.MethodReferenceSearchTests.testExplicitPropertySetterSearch1(MethodReferenceSearchTests.java:685)
Collapse Failed MethodReferenceSearchTests testGenericsMethodReferenceSearch History
< 1 sec
java.lang.AssertionError: expected:<1> but was:<0>
	at org.eclipse.jdt.core.groovy.tests.search.MethodReferenceSearchTests.testGenericsMethodReferenceSearch(MethodReferenceSearchTests.java:772)
Existing test failures 1
Status Test Failing since Duration
junit.framework.ComparisonFailure: 
----------- Expected ------------

------------ but was ------------
Problem : The import util.MyException is never used [ resource : </Project/src/p/Test.java> range : <18,34> category : <120> severity : <1>]

--------- Difference is ----------
 expected:<[]> but was:<[Problem : The import util.MyException is never used [ resource : </Project/src/p/Test.java> range : <18,34> category : <120> severity : <1>]
(12 more lines...)
Fixed tests 1
Status Test Failing since Duration
Successful DGMInferencingTests testDGM31 History
Failing since build #388 (Code changes detected) < 1 sec

Error summary

The build generated some errors. See the full build log for more details.

Jan 13, 2020 9:37:47 PM org.apache.http.impl.execchain.RetryExec execute
INFO: I/O exception (org.apache.http.NoHttpResponseException) caught when processing request to {s}->https://download.eclipse.org:443: The target server failed to respond
Jan 13, 2020 9:37:47 PM org.apache.http.impl.execchain.RetryExec execute
INFO: Retrying request to {s}->https://download.eclipse.org:443

(SWT:10237): Gtk-CRITICAL **: 21:39:15.366: gtk_box_gadget_distribute: assertion 'size >= 0' failed in GtkScrollbar
TypeInferencingVisitorWithRequestor.findMethodNode: no match found for Main.main([Qjava.lang.String;)
TypeInferencingVisitorWithRequestor.findMethodNode: no match found for Main.main([Qjava.lang.String;)
CodeSelectRequestor: Could not proceed due to null declaring type for org.codehaus.groovy.ast.expr.BinaryExpression@ecbea[org.codehaus.groovy.ast.expr.VariableExpression@ecbe3[variable: it]("in" at 1:20:  "in" )org.codehaus.groovy.ast.expr.ListExpression@ee270[]]
CodeSelectRequestor: Could not proceed due to null declaring type for org.codehaus.groovy.ast.expr.RangeExpression@ebcdd
CodeSelectRequestor: Could not proceed due to null declaring type for org.codehaus.groovy.ast.expr.RangeExpression@ebcde
TypeInferencingVisitorWithRequestor.findMethodNode: no match found for Type.x(QList<Qjava.util.Date;>;)
TypeInferencingVisitorWithRequestor.findMethodNode: no match found for Type.x(QList<Qjava.lang.Number;>;)
TypeInferencingVisitorWithRequestor.findMethodNode: no match found for Type.x(QList<Qjava.lang.Number;>;)
TypeInferencingVisitorWithRequestor.findMethodNode: no match found for Type.x(QList<Qjava.util.Date;>;)
TypeInferencingVisitorWithRequestor.findMethodNode: no match found for Type.x(QList<Qjava.lang.Number;>;)
CodeSelectRequestor: Could not proceed due to null declaring type for org.codehaus.groovy.ast.expr.ConstantExpression@e8fc6[fff]
CodeSelectRequestor: Could not proceed due to null declaring type for org.codehaus.groovy.ast.expr.ConstantExpression@e8fca[fff]
CodeSelectRequestor: Could not proceed due to null declaring type for org.codehaus.groovy.ast.expr.ConstantExpression@e8fca[fff]
Waiting for: Java indexing... 22 files to index (/Project)
Waiting for: Flushing content description cache.
Waiting for: Java indexing... 22 files to index (/Project)
Waiting for: Java indexing... 22 files to index (/Project)
Waiting for: Java indexing... 22 files to index (/Project)
Waiting for: Java indexing... 22 files to index (/Project)
Waiting for: Java indexing... 22 files to index (/Project)
Waiting for: Java indexing... 22 files to index (/Project)
Waiting for: Java indexing... 21 files to index (/Project)
Waiting for: Flushing content description cache.
Waiting for: Java indexing... 7 files to index (/Project)
Waiting for: Flushing content description cache.
Waiting for: Java indexing... 20 files to index (/Project)
Waiting for: Java indexing... 5 files to index (/Project)
Waiting for: Flushing content description cache.