Build: #366 failed Changes by Eric Milles

Build result summary

Details

Completed
Duration
119 minutes
Labels
None
Agent
bamboo-16.af.pivotal.io
Revision
1fb9a4a4b8496f91f8b78265265325fe24add049 1fb9a4a4b8496f91f8b78265265325fe24add049
Total tests
6230
Failing since
#265 (Changes by Eric Milles)

Responsible

Code commits

Author Commit Message Commit date
Eric Milles Eric Milles 1fb9a4a4b8496f91f8b78265265325fe24add049 1fb9a4a4b8496f91f8b78265265325fe24add049 GROOVY-7985

Configuration changes

Plan configuration has changed since the last successful build. See the plan audit log for more details.

Tests

New test failures 7
Status Test View job Duration
Collapse Failed SyntheticMemberSearchTests testSearchInJava4 History
Default Job < 1 sec
java.lang.AssertionError: Wrong number of matches found in:
 expected:<1> but was:<0>
java.lang.AssertionError: 
Wrong number of matches found in:
 expected:<1> but was:<0>
	at org.codehaus.groovy.eclipse.core.test.SyntheticMemberSearchTests.assertCount(SyntheticMemberSearchTests.groovy:259)
	at org.codehaus.groovy.eclipse.core.test.SyntheticMemberSearchTests.testSearchInJava4(SyntheticMemberSearchTests.groovy:239)
Collapse Failed SyntheticMemberSearchTests testSearchInGroovy1 History
Default Job 1 sec
java.lang.AssertionError: Wrong number of matches found in:
 expected:<3> but was:<0>
java.lang.AssertionError: 
Wrong number of matches found in:
 expected:<3> but was:<0>
	at org.codehaus.groovy.eclipse.core.test.SyntheticMemberSearchTests.assertCount(SyntheticMemberSearchTests.groovy:259)
	at org.codehaus.groovy.eclipse.core.test.SyntheticMemberSearchTests.testSearchInGroovy1(SyntheticMemberSearchTests.groovy:57)
Collapse Failed SyntheticMemberSearchTests testSearchInGroovy5 History
Default Job 1 sec
java.lang.AssertionError: Wrong number of matches found in:
 expected:<1> but was:<0>
java.lang.AssertionError: 
Wrong number of matches found in:
 expected:<1> but was:<0>
	at org.codehaus.groovy.eclipse.core.test.SyntheticMemberSearchTests.assertCount(SyntheticMemberSearchTests.groovy:259)
	at org.codehaus.groovy.eclipse.core.test.SyntheticMemberSearchTests.testSearchInGroovy5(SyntheticMemberSearchTests.groovy:129)
Collapse Failed SyntheticMemberSearchTests testSearchInJava1 History
Default Job 4 secs
java.lang.AssertionError: Wrong number of matches found in:
 expected:<3> but was:<0>
java.lang.AssertionError: 
Wrong number of matches found in:
 expected:<3> but was:<0>
	at org.codehaus.groovy.eclipse.core.test.SyntheticMemberSearchTests.assertCount(SyntheticMemberSearchTests.groovy:259)
	at org.codehaus.groovy.eclipse.core.test.SyntheticMemberSearchTests.testSearchInJava1(SyntheticMemberSearchTests.groovy:173)
Collapse Failed SyntheticMemberSearchTests testSearchInJava3 History
Default Job 1 sec
java.lang.AssertionError: Wrong number of matches found in:
 expected:<1> but was:<0>
java.lang.AssertionError: 
Wrong number of matches found in:
 expected:<1> but was:<0>
	at org.codehaus.groovy.eclipse.core.test.SyntheticMemberSearchTests.assertCount(SyntheticMemberSearchTests.groovy:259)
	at org.codehaus.groovy.eclipse.core.test.SyntheticMemberSearchTests.testSearchInJava3(SyntheticMemberSearchTests.groovy:217)
Collapse Failed SyntheticMemberSearchTests testSearchInJava2 History
Default Job 1 sec
java.lang.AssertionError: Wrong number of matches found in:
 expected:<1> but was:<0>
java.lang.AssertionError: 
Wrong number of matches found in:
 expected:<1> but was:<0>
	at org.codehaus.groovy.eclipse.core.test.SyntheticMemberSearchTests.assertCount(SyntheticMemberSearchTests.groovy:259)
	at org.codehaus.groovy.eclipse.core.test.SyntheticMemberSearchTests.testSearchInJava2(SyntheticMemberSearchTests.groovy:195)
Collapse Failed ConstructorReferenceSearchTests testConstructorReferences10 History
Default Job < 1 sec
java.lang.AssertionError: expected:<1> but was:<0>
	at org.eclipse.jdt.core.groovy.tests.search.ConstructorReferenceSearchTests.testConstructorReferences10(ConstructorReferenceSearchTests.java:258)
Existing test failures 1
Status Test Failing since View job Duration
junit.framework.ComparisonFailure: 
----------- Expected ------------

------------ but was ------------
Problem : The import util.MyException is never used [ resource : </Project/src/p/Test.java> range : <18,34> category : <120> severity : <1>]

--------- Difference is ----------
 expected:<[]> but was:<[Problem : The import util.MyException is never used [ resource : </Project/src/p/Test.java> range : <18,34> category : <120> severity : <1>]
(12 more lines...)
Fixed tests 10
Status Test Failing since View job Duration
Successful JUnit4TestFinderTests testFindAllTestSuites History
Failing since build #365 (Changes by Eric Milles) Default Job 7 secs
Successful MoveCURefactoringTests testNonPrimaryMove History
Failing since build #365 (Changes by Eric Milles) Default Job 1 sec
Successful MoveCURefactoringTests testNonPrimaryQualifiedMove History
Failing since build #365 (Changes by Eric Milles) Default Job 1 sec
Successful MoveCURefactoringTests testQualifiedMove2 History
Failing since build #365 (Changes by Eric Milles) Default Job 1 sec
Successful MoveCURefactoringTests testQualifiedMove1 History
Failing since build #365 (Changes by Eric Milles) Default Job 1 sec
Successful MoveCURefactoringTests testQualifiedMove3 History
Failing since build #365 (Changes by Eric Milles) Default Job 1 sec
Successful MoveCURefactoringTests testMoveBack History
Failing since build #365 (Changes by Eric Milles) Default Job < 1 sec
Successful MoveCURefactoringTests testSimpleMove4 History
Failing since build #365 (Changes by Eric Milles) Default Job 1 sec
Successful MoveCURefactoringTests testSimpleMove3 History
Failing since build #365 (Changes by Eric Milles) Default Job 1 sec
Successful DGMInferencingTests testDGMClosure16 History
Failing since build #365 (Changes by Eric Milles) Default Job < 1 sec

Jira issues

IssueDescriptionStatus
Unknown Issue TypeGROOVY-7985Could not obtain issue details from Jira