Build: #116 failed Changes by Eric Milles

Build result summary

Details

Completed
Duration
104 minutes
Labels
None
Agent
bamboo-21.af.pivotal.io
Revision
a082c78b063e6c6b6a2cbbafecd0cac8d3239c77 a082c78b063e6c6b6a2cbbafecd0cac8d3239c77
Total tests
5844
Fixed in
#118 (Changes by Eric Milles)

Tests

Responsible

Code commits

Author Commit Message Commit date
Eric Milles Eric Milles a082c78b063e6c6b6a2cbbafecd0cac8d3239c77 a082c78b063e6c6b6a2cbbafecd0cac8d3239c77 Eclipse 4.13 (M1) JDT Patch for Groovy-Eclipse: JDT commit 3122a06
#918
Eric Milles Eric Milles ffa0b1e74df213fe3f8d329635b785fb3a5f9d81 ffa0b1e74df213fe3f8d329635b785fb3a5f9d81 Fix for #924: check original method if AIC cannot be found in gen method

Tests

New test failures 4
Status Test View job Duration
Collapse Failed BasicGroovyBuildTests testCompileStatic_IterableParameter History
Default Job < 1 sec
org.junit.ComparisonFailure: unexpected recompiled units. lenExpected=1 lenActual=2 expected:<{Foo[]}> but was:<{Foo[,Foo]}>
	at org.eclipse.jdt.core.groovy.tests.builder.BasicGroovyBuildTests.testCompileStatic_IterableParameter(BasicGroovyBuildTests.java:799)
Collapse Failed BuildAccessRulesTests testAccessForPropertyGenerics History
Default Job < 1 sec
junit.framework.ComparisonFailure: 
----------- Expected ------------
Problem : Access restriction: The type 'BeanInfo' is not API (restriction on required library '##') [ resource : </Project/src/Foo.groovy> range : <39,47> category : <150> severity : <2>]

------------ but was ------------

--------- Difference is ----------
 expected:<[Problem : Access restriction: The type 'BeanInfo' is not API (restriction on required library '##') [ resource : </Project/src/Foo.groovy> range : <39,47> category : <150> severity : <2>]
(13 more lines...)
Collapse Failed DGMInferencingTests testDGM30 History
Default Job < 1 sec
java.lang.AssertionError: Expected type not found.
Expected: java.io.File
Found: java.lang.Object
Declaring type: groovy.lang.Closure<V extends java.lang.Object>
ASTNode: org.codehaus.groovy.ast.expr.VariableExpression@f532b[variable: it]
Confidence: INFERRED

java.lang.AssertionError: 
(9 more lines...)
Collapse Failed InferencingTests testSuperClassMethod4b History
Default Job < 1 sec
java.lang.NoClassDefFoundError: org/codehaus/groovy/runtime/DefaultGroovyMethodsSupport
	at org.eclipse.jdt.core.groovy.tests.search.InferencingTests.assertDeclType(InferencingTests.java:32)
	at org.eclipse.jdt.core.groovy.tests.search.InferencingTests.testSuperClassMethod4b(InferencingTests.java:1348)
Caused by: java.lang.ClassNotFoundException: org.codehaus.groovy.runtime.DefaultGroovyMethodsSupport
	at org.eclipse.jdt.core.groovy.tests.search.InferencingTests.assertDeclType(InferencingTests.java:32)
	at org.eclipse.jdt.core.groovy.tests.search.InferencingTests.testSuperClassMethod4b(InferencingTests.java:1348)