Build: #150 failed Changes by Eric Milles

Build result summary

Details

Completed
Duration
106 minutes
Labels
None
Agent
bamboo-23.af.pivotal.io
Revision
cf970743116b90c841de5c3f7cea450873092bc9 cf970743116b90c841de5c3f7cea450873092bc9
Total tests
5990
Failing since
#138 (Changes by Eric Milles)
Fixed in
#160 (Changes by Eric Milles)

Responsible

Code commits

Author Commit Message Commit date
Eric Milles Eric Milles cf970743116b90c841de5c3f7cea450873092bc9 cf970743116b90c841de5c3f7cea450873092bc9 GROOVY-8572

Tests

New test failures 1
Status Test View job Duration
Collapse Failed DGMInferencingTests testDGM15 History
Default Job < 1 sec
java.lang.AssertionError: Expected type not found.
Expected: java.util.Map$Entry<java.lang.String,java.lang.Integer>
Found: java.lang.Object
Declaring type: groovy.lang.Closure<V extends java.lang.Object>
ASTNode: org.codehaus.groovy.ast.expr.VariableExpression@f4ba7[variable: it]
Confidence: INFERRED

java.lang.AssertionError: 
(9 more lines...)
Existing test failures 1
Status Test Failing since View job Duration
java.lang.AssertionError: Expected type not found.
Expected: java.util.Date
Found: java.lang.Object
Declaring type: Search
ASTNode: org.codehaus.groovy.ast.expr.VariableExpression@f3ca0[variable: val]
Confidence: INFERRED

java.lang.AssertionError: 
(9 more lines...)
Fixed tests 1
Status Test Failing since View job Duration
Successful BasicGroovyBuildTests testSlowAnotherAttempt_GRE870 History
Failing since build #149 (Changes by Eric Milles) Default Job < 1 sec

Jira issues

IssueDescriptionStatus
Unknown Issue TypeGROOVY-8572Could not obtain issue details from Jira