Build: #188 failed Changes by Eric Milles

Build result summary

Details

Completed
Duration
91 minutes
Labels
None
Agent
bamboo-15.af.pivotal.io
Revision
c0610972bb06733a2529aa9c35c8715a716d9891 c0610972bb06733a2529aa9c35c8715a716d9891
Total tests
6057
Failing since
#167 (Changes by Eric Milles)

Responsible

Code commits

Author Commit Message Commit date
Eric Milles Eric Milles c0610972bb06733a2529aa9c35c8715a716d9891 c0610972bb06733a2529aa9c35c8715a716d9891 reduce conflicts and compilation

Tests

New test failures 5
Status Test View job Duration
Collapse Failed BinarySearchTests testFieldRefInInitializer History
Default Job 1 sec
java.lang.AssertionError: Expecting 1 matches, but found 0

java.lang.AssertionError: 
Expecting 1 matches, but found 0

	at org.eclipse.jdt.core.groovy.tests.search.BinarySearchTests.assertMatches(BinarySearchTests.java:139)
	at org.eclipse.jdt.core.groovy.tests.search.BinarySearchTests.testFieldRefInInitializer(BinarySearchTests.java:208)
Collapse Failed ClosureInferencingTests testNestedClosure4 History
Default Job < 1 sec
java.lang.AssertionError: Expected type not found.
Expected: java.lang.Integer
Found: java.lang.Object
Declaring type: groovy.lang.Closure
ASTNode: org.codehaus.groovy.ast.expr.ConstantExpression@fa99f[intValue]
Confidence: UNKNOWN

java.lang.AssertionError: 
(8 more lines...)
Collapse Failed DGMInferencingTests testDGM36 History
Default Job < 1 sec
java.lang.AssertionError: Expected type not found.
Expected: java.io.DataOutputStream
Found: java.lang.Object
Declaring type: groovy.lang.Closure<V extends java.lang.Object>
ASTNode: org.codehaus.groovy.ast.expr.VariableExpression@f2613[variable: it]
Confidence: INFERRED

java.lang.AssertionError: 
(9 more lines...)
Collapse Failed DGMInferencingTests testDGM17 History
Default Job < 1 sec
java.lang.AssertionError: Expected type not found.
Expected: java.lang.Integer
Found: java.lang.Object
Declaring type: Search
ASTNode: org.codehaus.groovy.ast.expr.VariableExpression@f6236[variable: value]
Confidence: INFERRED

java.lang.AssertionError: 
(9 more lines...)
Collapse Failed MethodReferenceSearchTests testGenericsMethodReferenceSearch History
Default Job < 1 sec
java.lang.AssertionError: expected:<0> but was:<1>
	at org.eclipse.jdt.core.groovy.tests.search.MethodReferenceSearchTests.testGenericsMethodReferenceSearch(MethodReferenceSearchTests.java:657)
Fixed tests 2
Status Test Failing since View job Duration
Successful BasicGroovyBuildTests testUpdateProjectPreferences History
Failing since build #178 (Changes by Eric Milles) Default Job < 1 sec
Successful BinarySearchTests testMethodRefInInitializer History
Failing since build #187 (Changes by Eric Milles) Default Job 1 sec