Build: #247 failed Changes by Eric Milles

Build result summary

Details

Completed
Duration
94 minutes
Labels
None
Agent
bamboo-16.af.pivotal.io
Revision
8590c03d9a08b5473d56cb04ae0d002351685ed2 8590c03d9a08b5473d56cb04ae0d002351685ed2
Total tests
6181
Failing since
#167 (Changes by Eric Milles)

Responsible

Code commits

Author Commit Message Commit date
Eric Milles Eric Milles 8590c03d9a08b5473d56cb04ae0d002351685ed2 8590c03d9a08b5473d56cb04ae0d002351685ed2 minor fix-ups

Configuration changes

Plan configuration has changed since the last successful build. See the plan audit log for more details.

Tests

New test failures 4
Status Test View job Duration
Collapse Failed BasicGroovyBuildTests testUpdateProjectPreferences History
Default Job < 1 sec
junit.framework.ComparisonFailure: 
----------- Expected ------------

------------ but was ------------
Problem : The import util.MyException is never used [ resource : </Project/src/p/Test.java> range : <18,34> category : <120> severity : <1>]

--------- Difference is ----------
 expected:<[]> but was:<[Problem : The import util.MyException is never used [ resource : </Project/src/p/Test.java> range : <18,34> category : <120> severity : <1>]
(12 more lines...)
Collapse Failed ArrayInferencingTests testArrayProperty4 History
Default Job < 1 sec
java.lang.AssertionError: Expected type not found.
Expected: XX
Found: java.lang.String
Declaring type: XX[]
ASTNode: org.codehaus.groovy.ast.expr.ConstantExpression@ec821[yy]
Confidence: UNKNOWN

java.lang.AssertionError: 
(8 more lines...)
Collapse Failed ClosureInferencingTests testClosure25 History
Default Job < 1 sec
java.lang.AssertionError: Expected type not found.
Expected: java.lang.Void
Found: java.lang.Long
Declaring type: Search
ASTNode: org.codehaus.groovy.ast.expr.VariableExpression@f0bc7[variable: time]
Confidence: INFERRED

java.lang.AssertionError: 
(8 more lines...)
Collapse Failed DGMInferencingTests testDGM27 History
Default Job < 1 sec
java.lang.AssertionError: Expected type not found.
Expected: java.lang.String
Found: java.lang.Object
Declaring type: Search
ASTNode: org.codehaus.groovy.ast.expr.VariableExpression@efcbe[variable: key]
Confidence: INFERRED

java.lang.AssertionError: 
(9 more lines...)
Fixed tests 6
Status Test Failing since View job Duration
Successful CodeSelectImportsTests testCodeSelectOnImportPackage3 History
Failing since build #246 (Changes by Eric Milles) Default Job 1 sec
Successful BasicGroovyBuildTests testAnnotationCollectorIncremental History
Failing since build #246 (Changes by Eric Milles) Default Job 1 sec
Successful BasicGroovyBuildTests testIncrementalCompilationTheBasics2_changingJavaDependedUponByGroovy History
Failing since build #246 (Changes by Eric Milles) Default Job < 1 sec
Successful BuildAccessRulesTests testAccessForPropertyGenerics History
Failing since build #246 (Changes by Eric Milles) Default Job < 1 sec
Successful DGMInferencingTests testDGM1 History
Failing since build #246 (Changes by Eric Milles) Default Job < 1 sec
Successful InferencingTests testSpread10 History
Failing since build #246 (Changes by Eric Milles) Default Job < 1 sec