Build: #341 failed Changes by Eric Milles

Build result summary

Details

Completed
Duration
98 minutes
Labels
None
Agent
bamboo-22.af.pivotal.io
Revision
6effbf75085f86e2fd9efa01a3519bea51c41195 6effbf75085f86e2fd9efa01a3519bea51c41195
Total tests
6310
Fixed in
#343 (Changes by Eric Milles)

Tests

Responsible

Code commits

Author Commit Message Commit date
Eric Milles Eric Milles 6effbf75085f86e2fd9efa01a3519bea51c41195 6effbf75085f86e2fd9efa01a3519bea51c41195 minor fix-ups

Tests

New test failures 6
Status Test View job Duration
Collapse Failed JUnit3TestFinderTests testFindAllTestSuites History
Default Job 1 sec
org.eclipse.jdt.core.JavaModelException: /TestProject/src/p/script.groovy already exists in target
	at org.codehaus.groovy.eclipse.junit.test.JUnit3TestFinderTests.testFindAllTestSuites(JUnit3TestFinderTests.groovy:82)
Collapse Failed JUnit3TestFinderTests testFinderOfNonPublicSubclass History
Default Job 5 secs
org.eclipse.jdt.core.JavaModelException: /TestProject/src/p/script.groovy already exists in target
	at org.codehaus.groovy.eclipse.junit.test.JUnit3TestFinderTests.testFinderOfNonPublicSubclass(JUnit3TestFinderTests.groovy:66)
Collapse Failed JUnit3TestFinderTests testFinderOfSubclass History
Default Job 2 secs
org.eclipse.jdt.core.JavaModelException: /TestProject/src/p/script.groovy already exists in target
	at org.codehaus.groovy.eclipse.junit.test.JUnit3TestFinderTests.testFinderOfSubclass(JUnit3TestFinderTests.groovy:50)
Collapse Failed JUnit4TestFinderTests testFinderOfNonPublicSubclass History
Default Job 4 secs
org.eclipse.jdt.core.JavaModelException: /TestProject/src/p/script.groovy already exists in target
	at org.codehaus.groovy.eclipse.junit.test.JUnit4TestFinderTests.testFinderOfNonPublicSubclass(JUnit4TestFinderTests.groovy:67)
Collapse Failed JUnit4TestFinderTests testFindAllTestSuites History
Default Job 1 sec
org.eclipse.jdt.core.JavaModelException: /TestProject/src/p/script.groovy already exists in target
	at org.codehaus.groovy.eclipse.junit.test.JUnit4TestFinderTests.testFindAllTestSuites(JUnit4TestFinderTests.groovy:123)
Collapse Failed JUnit4TestFinderTests testFinderOfSubclass History
Default Job 1 sec
org.eclipse.jdt.core.JavaModelException: /TestProject/src/p/script.groovy already exists in target
	at org.codehaus.groovy.eclipse.junit.test.JUnit4TestFinderTests.testFinderOfSubclass(JUnit4TestFinderTests.groovy:51)