Build: #599 failed Changes by Eric Milles

Build result summary

Details

Completed
Duration
75 minutes
Labels
None
Agent
bamboo-11.af.pivotal.io
Revision
a5172996a6b801570c310f438f995f54017383f3 a5172996a6b801570c310f438f995f54017383f3
Total tests
5892
Fixed in
#601 (Changes by Eric Milles)

Tests

Responsible

Code commits

Author Commit Message Commit date
Eric Milles Eric Milles a5172996a6b801570c310f438f995f54017383f3 a5172996a6b801570c310f438f995f54017383f3 happy new year!

Tests

New test failures 5
Status Test View job Duration
Collapse Failed BasicGroovyBuildTests testAnnotationCollectorIncremental History
Default Job < 1 sec
java.lang.AssertionError: array lengths differed, expected.length=5 actual.length=4
	at org.eclipse.jdt.core.groovy.tests.builder.BasicGroovyBuildTests.testAnnotationCollectorIncremental(BasicGroovyBuildTests.java:1798)
Collapse Failed BinarySearchTests testFieldDecl2 History
Default Job < 1 sec
java.lang.AssertionError: Expecting 2 matches, but found 0

java.lang.AssertionError: 
Expecting 2 matches, but found 0

	at org.eclipse.jdt.core.groovy.tests.search.BinarySearchTests.assertMatches(BinarySearchTests.java:122)
	at org.eclipse.jdt.core.groovy.tests.search.BinarySearchTests.testFieldDecl2(BinarySearchTests.java:169)
Collapse Failed ConstructorReferenceSearchTests testConstructorReferences3 History
Default Job < 1 sec
java.lang.AssertionError: expected:<3> but was:<0>
	at org.eclipse.jdt.core.groovy.tests.search.ConstructorReferenceSearchTests.testConstructorReferences3(ConstructorReferenceSearchTests.java:124)
Collapse Failed ConstructorReferenceSearchTests testNewifyConstructorReferences4 History
Default Job < 1 sec
java.lang.AssertionError: expected:<1> but was:<0>
	at org.eclipse.jdt.core.groovy.tests.search.ConstructorReferenceSearchTests.testNewifyConstructorReferences4(ConstructorReferenceSearchTests.java:512)
Collapse Failed TypeReferenceSearchTests testInnerTypes3 History
Default Job < 1 sec
java.lang.AssertionError: Wrong number of matches found:
[] expected:<4> but was:<0>
java.lang.AssertionError: 
Wrong number of matches found:
[] expected:<4> but was:<0>
	at org.eclipse.jdt.core.groovy.tests.search.TypeReferenceSearchTests.testInnerTypes3(TypeReferenceSearchTests.java:365)