Build: #84 failed Changes by Andy Clement

Build result summary

Details

Completed
Duration
109 minutes
Labels
None
Agent
bamboo-18.af.pivotal.io
Revision
b330a3ecf62e5e6f33e8ef5c637adc163e30a27a b330a3ecf62e5e6f33e8ef5c637adc163e30a27a
Total tests
5770
Failing since
#54 (Changes by Eric Milles)
Fixed in
#99 (Custom build by Eric Milles with revision v3.4.0)

Responsible

Code commits

Author Commit Message Commit date
Andy Clement Andy Clement b330a3ecf62e5e6f33e8ef5c637adc163e30a27a b330a3ecf62e5e6f33e8ef5c637adc163e30a27a Inlined repositories from 2019-06 composite site so can use https links

Configuration changes

Plan configuration has changed since the last successful build. See the plan audit log for more details.

Tests

New test failures 3
Status Test View job Duration
Collapse Failed ErrorLogTest testNoWarningsOnStartup History
Default Job < 1 sec
java.lang.AssertionError: There should be no unexpected entries in the error log. Found:
=================== Log entry 1 ===================
FrameworkEvent ERROR (org.eclipse.ecf.provider.filetransfer.httpclient45.win32)

java.lang.AssertionError: 
There should be no unexpected entries in the error log. Found:
=================== Log entry 1 ===================
FrameworkEvent ERROR (org.eclipse.ecf.provider.filetransfer.httpclient45.win32)
(2 more lines...)
Collapse Failed BasicGroovyBuildTests testTags3 History
Default Job < 1 sec
java.lang.ArrayIndexOutOfBoundsException: 0
	at org.eclipse.jdt.core.groovy.tests.builder.BasicGroovyBuildTests.testTags3(BasicGroovyBuildTests.java:3448)
Collapse Failed BasicGroovyBuildTests testTraitBinary History
Default Job < 1 sec
org.junit.ComparisonFailure: unexpected recompiled units. lenExpected=5 lenActual=10 expected:<{Runner,[p.Named,p.Named$Trait$Helper,q.DefaultNamed],r.NamedClass}> but was:<{Runner,[Runner,p.Named,p.Named,p.Named$Trait$Helper,p.Named$Trait$Helper,q.DefaultNamed,q.DefaultNamed,r.NamedClass],r.NamedClass}>
	at org.eclipse.jdt.core.groovy.tests.builder.BasicGroovyBuildTests.testTraitBinary(BasicGroovyBuildTests.java:3187)
Fixed tests 2
Status Test Failing since View job Duration
Successful BasicGroovyBuildTests testGRE1773 History
Failing since build #56 (Changes by Eric Milles) Default Job < 1 sec
Successful InferencingTests testStaticMethod9 History
Failing since build #56 (Changes by Eric Milles) Default Job < 1 sec