Build: #90 failed Changes by Eric Milles

Build result summary

Details

Completed
Duration
108 minutes
Labels
None
Agent
bamboo-18.af.pivotal.io
Revision
e3d49de543b863a05941b4918f69328df7b0c92b e3d49de543b863a05941b4918f69328df7b0c92b
Total tests
5781
Failing since
#54 (Changes by Eric Milles)
Fixed in
#99 (Custom build by Eric Milles with revision v3.4.0)

Responsible

Code commits

Author Commit Message Commit date
Eric Milles Eric Milles e3d49de543b863a05941b4918f69328df7b0c92b e3d49de543b863a05941b4918f69328df7b0c92b Enforce min Maven version and don't set source/target if release is set
#864 #896 #909

Configuration changes

Plan configuration has changed since the last successful build. See the plan audit log for more details.

Tests

New test failures 4
Status Test View job Duration
Collapse Failed BasicGroovyBuildTests test1167 History
Default Job < 1 sec
org.junit.ComparisonFailure: unexpected recompiled units. lenExpected=3 lenActual=6 expected:<...oklyn.event.adapter.[HttpSensorAdapt]er,brooklyn.event.ad...> but was:<...oklyn.event.adapter.[Foo,brooklyn.event.adapter.HttpSensorAdapter,brooklyn.event.adapter.HttpSensorAdapter,brooklyn.event.adapter.ValueProvid]er,brooklyn.event.ad...>
	at org.eclipse.jdt.core.groovy.tests.builder.BasicGroovyBuildTests.test1167(BasicGroovyBuildTests.java:882)
Collapse Failed BuildAccessRulesTests testAccessForLazyProperty History
Default Job < 1 sec
junit.framework.ComparisonFailure: 
----------- Expected ------------
Problem : Access restriction: The type 'BeanInfo' is not API (restriction on required library '##') [ resource : </Project/src/Foo.groovy> range : <49,57> category : <150> severity : <2>]

------------ but was ------------

--------- Difference is ----------
 expected:<[Problem : Access restriction: The type 'BeanInfo' is not API (restriction on required library '##') [ resource : </Project/src/Foo.groovy> range : <49,57> category : <150> severity : <2>]
(13 more lines...)
Collapse Failed ClosureInferencingTests testNestedClosure13 History
Default Job < 1 sec
java.lang.AssertionError: Expected type not found.
Expected: java.util.regex.Pattern
Found: Search
Declaring type: groovy.lang.Closure<V extends java.lang.Object>
ASTNode: org.codehaus.groovy.ast.expr.ConstantExpression@1030e7[delegate]
Confidence: INFERRED

java.lang.AssertionError: 
(9 more lines...)
Collapse Failed DGMInferencingTests testDGMDeclaring3 History
Default Job < 1 sec
java.lang.AssertionError: Expected declaring type not found.
 Expected: org.codehaus.groovy.runtime.IOGroovyMethods
 Found type: java.lang.String
 Found declaring type: java.io.Writer
 ASTNode: org.codehaus.groovy.ast.expr.ConstantExpression@ebce2[leftShift]
java.lang.AssertionError: 
Expected declaring type not found.
	Expected: org.codehaus.groovy.runtime.IOGroovyMethods
(5 more lines...)
Existing test failures 1
Status Test Failing since View job Duration
java.lang.AssertionError: There should be no unexpected entries in the error log. Found:
=================== Log entry 1 ===================
FrameworkEvent ERROR (org.eclipse.ecf.provider.filetransfer.httpclient45.win32)

java.lang.AssertionError: 
There should be no unexpected entries in the error log. Found:
=================== Log entry 1 ===================
FrameworkEvent ERROR (org.eclipse.ecf.provider.filetransfer.httpclient45.win32)
(2 more lines...)