Build: #228 failed

Job: Default Job failed

Stages & jobs

  1. Default Stage

Test results

  • 6,145 tests in total
  • 12 tests failed
  • 11 failures are new
  • 6 tests were fixed
  • 121 tests were quarantined / skipped
  • 88 minutes taken in total.

Build 228 has the following 12 errors: 11 new failure(s) occurred since the previous build.

New test failures 11
Status Test Duration
Collapse Failed MoveCURefactoringTests testMoveBack History
1 sec
org.junit.ComparisonFailure: Refactoring produced unexpected results: expected:<package p2
[]
public class Groovy...> but was:<package p2
[import p1.Groovy
]
public class Groovy...>
org.junit.ComparisonFailure: 
Refactoring produced unexpected results: expected:<package p2
(7 more lines...)
Collapse Failed MoveCURefactoringTests testNonPrimaryMove History
1 sec
org.junit.ComparisonFailure: Refactoring produced unexpected results: expected:<package p2
import [NEW].Groovy
public class...> but was:<package p2
import [p1].Groovy
public class...>
org.junit.ComparisonFailure: 
Refactoring produced unexpected results: expected:<package p2
import [NEW].Groovy
(5 more lines...)
Collapse Failed MoveCURefactoringTests testNonPrimaryQualifiedMove History
1 sec
org.junit.ComparisonFailure: Refactoring produced unexpected results: expected:<...ass Groovy2 extends [NEW].Groovy { }> but was:<...ass Groovy2 extends [p1].Groovy { }>
	at org.codehaus.groovy.eclipse.refactoring.test.rename.MoveCURefactoringTests.performRefactoringAndUndo(MoveCURefactoringTests.groovy:67)
	at org.codehaus.groovy.eclipse.refactoring.test.rename.MoveCURefactoringTests.testNonPrimaryQualifiedMove(MoveCURefactoringTests.groovy:235)
Collapse Failed MoveCURefactoringTests testQualifiedMove1 History
1 sec
org.junit.ComparisonFailure: Refactoring produced unexpected results: expected:<...lass Groovy extends [NEW].Java { }> but was:<...lass Groovy extends [p].Java { }>
	at org.codehaus.groovy.eclipse.refactoring.test.rename.MoveCURefactoringTests.performRefactoringAndUndo(MoveCURefactoringTests.groovy:67)
	at org.codehaus.groovy.eclipse.refactoring.test.rename.MoveCURefactoringTests.testQualifiedMove1(MoveCURefactoringTests.groovy:144)
Collapse Failed MoveCURefactoringTests testQualifiedMove2 History
1 sec
org.junit.ComparisonFailure: Refactoring produced unexpected results: expected:<...ass Groovy2 extends [NEW].Groovy { }> but was:<...ass Groovy2 extends [p1].Groovy { }>
	at org.codehaus.groovy.eclipse.refactoring.test.rename.MoveCURefactoringTests.performRefactoringAndUndo(MoveCURefactoringTests.groovy:67)
	at org.codehaus.groovy.eclipse.refactoring.test.rename.MoveCURefactoringTests.testQualifiedMove2(MoveCURefactoringTests.groovy:157)
Collapse Failed MoveCURefactoringTests testQualifiedMove3 History
1 sec
org.junit.ComparisonFailure: Refactoring produced unexpected results: expected:<... g1

import static j[2.Java.*
import j2.Java

class Groovy {
  def m1() {
    Java j = new j2].Java()
(33 more lines...)
Collapse Failed MoveCURefactoringTests testSimpleMove3 History
1 sec
org.junit.ComparisonFailure: Refactoring produced unexpected results: expected:<package p;
[
import NEW.Java

]public class Groovy ...> but was:<package p;
[]public class Groovy ...>
org.junit.ComparisonFailure: 
Refactoring produced unexpected results: expected:<package p;
(7 more lines...)
Collapse Failed MoveCURefactoringTests testSimpleMove4 History
1 sec
org.junit.ComparisonFailure: Refactoring produced unexpected results: expected:<package p2
import [NEW].Groovy
public class...> but was:<package p2
import [p1].Groovy
public class...>
org.junit.ComparisonFailure: 
Refactoring produced unexpected results: expected:<package p2
import [NEW].Groovy
(5 more lines...)
Collapse Failed ClosureInferencingTests testClosureReturnType3 History
< 1 sec
java.lang.AssertionError: Expected type not found.
Expected: Foo
Found: java.lang.String
Declaring type: Search
ASTNode: org.codehaus.groovy.ast.expr.VariableExpression@1070c4[variable: foo]
Confidence: INFERRED

java.lang.AssertionError: 
(8 more lines...)
Collapse Failed DGMInferencingTests testDGMDeclaring2 History
< 1 sec
java.lang.AssertionError: Expected declaring type not found.
 Expected: org.codehaus.groovy.runtime.ResourceGroovyMethods
 Found type: java.lang.String
 Found declaring type: java.io.File
 ASTNode: org.codehaus.groovy.ast.expr.ConstantExpression@eb91f[eachLine]
java.lang.AssertionError: 
Expected declaring type not found.
	Expected: org.codehaus.groovy.runtime.ResourceGroovyMethods
(5 more lines...)
Collapse Failed TypeReferenceSearchTests testFindClassDeclarationWithPattern History
< 1 sec
java.lang.AssertionError: Number of results found expected:<2> but was:<0>
	at org.eclipse.jdt.core.groovy.tests.search.TypeReferenceSearchTests.testFindClassDeclarationWithPattern(TypeReferenceSearchTests.java:220)
Existing test failures 1
Status Test Failing since Duration
junit.framework.ComparisonFailure: 
----------- Expected ------------

------------ but was ------------
Problem : The import util.MyException is never used [ resource : </Project/src/p/Test.java> range : <18,34> category : <120> severity : <1>]

--------- Difference is ----------
 expected:<[]> but was:<[Problem : The import util.MyException is never used [ resource : </Project/src/p/Test.java> range : <18,34> category : <120> severity : <1>]
(12 more lines...)