Build: #229 failed

Job: Default Job failed

Stages & jobs

  1. Default Stage

Test results

  • 6,149 tests in total
  • 4 tests failed
  • 3 failures are new
  • 11 tests were fixed
  • 121 tests were quarantined / skipped
  • 88 minutes taken in total.

Build 229 has the following 4 errors: 3 new failure(s) occurred since the previous build.

New test failures 3
Status Test Duration
Collapse Failed BasicGroovyBuildTests testBuildClash History
< 1 sec
org.junit.ComparisonFailure: unexpected recompiled units. lenExpected=1 lenActual=2 expected:<{StackTester[]}> but was:<{StackTester[,StackTester]}>
	at org.eclipse.jdt.core.groovy.tests.builder.BasicGroovyBuildTests.testBuildClash(BasicGroovyBuildTests.java:3421)
Collapse Failed BasicGroovyBuildTests testNoDoubleResolve History
< 1 sec
java.lang.AssertionError
	at org.eclipse.jdt.core.groovy.tests.builder.BasicGroovyBuildTests.testNoDoubleResolve(BasicGroovyBuildTests.java:2726)
Collapse Failed DGMInferencingTests testDGM19 History
< 1 sec
java.lang.AssertionError: Expected type not found.
Expected: java.lang.Integer
Found: java.lang.Object
Declaring type: Search
ASTNode: org.codehaus.groovy.ast.expr.VariableExpression@f532e[variable: value]
Confidence: INFERRED

java.lang.AssertionError: 
(9 more lines...)
Existing test failures 1
Status Test Failing since Duration
junit.framework.ComparisonFailure: 
----------- Expected ------------

------------ but was ------------
Problem : The import util.MyException is never used [ resource : </Project/src/p/Test.java> range : <18,34> category : <120> severity : <1>]

--------- Difference is ----------
 expected:<[]> but was:<[Problem : The import util.MyException is never used [ resource : </Project/src/p/Test.java> range : <18,34> category : <120> severity : <1>]
(12 more lines...)