Build: #235 failed

Job: Default Job failed

Stages & jobs

  1. Default Stage

Test results

  • 6,156 tests in total
  • 3 tests failed
  • 2 failures are new
  • 119 tests were quarantined / skipped
  • 88 minutes taken in total.

Build 235 has the following 3 errors: 2 new failure(s) occurred since the previous build.

New test failures 2
Status Test Duration
Collapse Failed BasicGroovyBuildTests testPackageNames1 History
< 1 sec
java.lang.AssertionError: missing expected problem: Problem : The declared package "q" does not match the expected package "p" [ resource : </Project/src/p/X.groovy> range : <8,9> category : <60> severity : <2>]
	at org.eclipse.jdt.core.groovy.tests.builder.BasicGroovyBuildTests.testPackageNames1(BasicGroovyBuildTests.java:1560)
Collapse Failed ClosureInferencingTests testWithAndClosure6 History
< 1 sec
java.lang.AssertionError: Expected declaring type not found.
 Expected: p.A
 Found type: java.lang.String
 Found declaring type: java.lang.Object
 ASTNode: org.codehaus.groovy.ast.expr.ConstantExpression@1146f6[foo]
java.lang.AssertionError: 
Expected declaring type not found.
	Expected: p.A
(4 more lines...)
Existing test failures 1
Status Test Failing since Duration
junit.framework.ComparisonFailure: 
----------- Expected ------------

------------ but was ------------
Problem : The import util.MyException is never used [ resource : </Project/src/p/Test.java> range : <18,34> category : <120> severity : <1>]

--------- Difference is ----------
 expected:<[]> but was:<[Problem : The import util.MyException is never used [ resource : </Project/src/p/Test.java> range : <18,34> category : <120> severity : <1>]
(12 more lines...)