Build: #293 failed

Job: Default Job failed

Stages & jobs

  1. Default Stage

Job result summary

Completed
Duration
96 minutes
Agent
bamboo-16.af.pivotal.io
Revision
0c3f594c187dbceede73273f7b7d5f52559639e0 0c3f594c187dbceede73273f7b7d5f52559639e0
Total tests
6284
Failing since
#254 (Code changes detected – )
Fixed in
#306 (Code changes detected)

Tests

  • 6,284 tests in total
  • 7 tests failed
  • 6 failures are new
  • 1 test was fixed
  • 140 tests were quarantined / skipped
  • 91 minutes taken in total.
New test failures 6
Status Test Duration
Collapse Failed BasicGroovyBuildTests testAnnotationCollectorIncremental History
< 1 sec
org.junit.ComparisonFailure: unexpected recompiled units. lenExpected=5 lenActual=1 expected:<{Book[,ISBN,ISBN$CollectorHelper,Length,NotNull]}> but was:<{Book[]}>
	at org.eclipse.jdt.core.groovy.tests.builder.BasicGroovyBuildTests.testAnnotationCollectorIncremental(BasicGroovyBuildTests.java:1690)
Collapse Failed BinarySearchTests testMethodDecl History
< 1 sec
java.lang.AssertionError: Expecting 4 matches, but found 0

java.lang.AssertionError: 
Expecting 4 matches, but found 0

	at org.eclipse.jdt.core.groovy.tests.search.BinarySearchTests.assertMatches(BinarySearchTests.java:139)
	at org.eclipse.jdt.core.groovy.tests.search.BinarySearchTests.testMethodDecl(BinarySearchTests.java:199)
Collapse Failed ClosureInferencingTests testClosure24 History
< 1 sec
java.lang.AssertionError: Expected type not found.
Expected: java.lang.Long
Found: java.lang.Object
Declaring type: Search
ASTNode: org.codehaus.groovy.ast.expr.VariableExpression@f29d7[variable: time]
Confidence: UNKNOWN

java.lang.AssertionError: 
(8 more lines...)
Collapse Failed DGMInferencingTests testDGM26 History
< 1 sec
java.lang.AssertionError: Expected type not found.
Expected: java.util.Map$Entry<java.lang.String,java.lang.Integer>
Found: java.lang.Object
Declaring type: Search
ASTNode: org.codehaus.groovy.ast.expr.VariableExpression@f7c84[variable: entry]
Confidence: INFERRED

java.lang.AssertionError: 
(9 more lines...)
Collapse Failed MethodReferenceSearchTests testGenericsMethodReferenceSearch History
< 1 sec
java.lang.AssertionError: expected:<0> but was:<1>
	at org.eclipse.jdt.core.groovy.tests.search.MethodReferenceSearchTests.testGenericsMethodReferenceSearch(MethodReferenceSearchTests.java:773)
Collapse Failed TypeReferenceSearchTests testFindClassDeclarationWithPattern History
< 1 sec
java.lang.AssertionError: Expected but not found: SongTests (not open) [in SongTests.groovy [in gtunes [in src [in Project]]]]
Expected but not found: ArtistTests (not open) [in ArtistTests.groovy [in gtunes [in src [in Project]]]]
Found but not expected: class ArtistTests [in ArtistTests.groovy [in src.gtunes [in <project root> [in Project]]]]
  java.lang.Object testSomething()
Found but not expected: class SongTests [in SongTests.groovy [in src.gtunes [in <project root> [in Project]]]]
  java.lang.Object testSomething()

java.lang.AssertionError: 
(9 more lines...)
Existing test failures 1
Status Test Failing since Duration
junit.framework.ComparisonFailure: 
----------- Expected ------------

------------ but was ------------
Problem : The import util.MyException is never used [ resource : </Project/src/p/Test.java> range : <18,34> category : <120> severity : <1>]

--------- Difference is ----------
 expected:<[]> but was:<[Problem : The import util.MyException is never used [ resource : </Project/src/p/Test.java> range : <18,34> category : <120> severity : <1>]
(12 more lines...)
Fixed tests 1
Status Test Failing since Duration
Successful BasicGroovyBuildTests testBuildGroovyHelloWorld2 History
Failing since build #292 (Code changes detected) < 1 sec

Error summary

The build generated some errors. See the full build log for more details.

Jan 14, 2020 6:36:54 PM org.apache.http.impl.execchain.RetryExec execute
INFO: I/O exception (org.apache.http.NoHttpResponseException) caught when processing request to {s}->https://download.eclipse.org:443: The target server failed to respond
Jan 14, 2020 6:36:54 PM org.apache.http.impl.execchain.RetryExec execute
INFO: Retrying request to {s}->https://download.eclipse.org:443
SWT SessionManagerDBus: Failed to connect to org.gnome.SessionManager: Failed to execute child process “dbus-launch” (No such file or directory)
SWT SessionManagerDBus: Failed to connect to org.xfce.SessionManager: Failed to execute child process “dbus-launch” (No such file or directory)
TypeInferencingVisitorWithRequestor.findMethodNode: no match found for Main.main([Qjava.lang.String;)
TypeInferencingVisitorWithRequestor.findMethodNode: no match found for Main.main([Qjava.lang.String;)
CodeSelectRequestor: Could not proceed due to null declaring type for org.codehaus.groovy.ast.expr.BinaryExpression@ecbea[org.codehaus.groovy.ast.expr.VariableExpression@ecbe3[variable: it]("in" at 1:20:  "in" )org.codehaus.groovy.ast.expr.ListExpression@ee270[]]
CodeSelectRequestor: Could not proceed due to null declaring type for org.codehaus.groovy.ast.expr.RangeExpression@ebcdd
CodeSelectRequestor: Could not proceed due to null declaring type for org.codehaus.groovy.ast.expr.RangeExpression@ebcde
TypeInferencingVisitorWithRequestor.findMethodNode: no match found for Type.x(QList<Qjava.util.Date;>;)
TypeInferencingVisitorWithRequestor.findMethodNode: no match found for Type.x(QList<Qjava.lang.Number;>;)
TypeInferencingVisitorWithRequestor.findMethodNode: no match found for Type.x(QList<Qjava.util.Date;>;)
TypeInferencingVisitorWithRequestor.findMethodNode: no match found for Type.x(QList<Qjava.lang.Number;>;)
TypeInferencingVisitorWithRequestor.findMethodNode: no match found for Type.x(QList<Qjava.lang.Number;>;)
CodeSelectRequestor: Could not proceed due to null declaring type for org.codehaus.groovy.ast.expr.ConstantExpression@e8fc6[fff]
CodeSelectRequestor: Could not proceed due to null declaring type for org.codehaus.groovy.ast.expr.ConstantExpression@e8fca[fff]
CodeSelectRequestor: Could not proceed due to null declaring type for org.codehaus.groovy.ast.expr.ConstantExpression@e8fca[fff]
Waiting for: Java indexing... 3 files to index (/Project)
Waiting for: Java indexing... 22 files to index (/Project)
Waiting for: Java indexing... 22 files to index (/Project)
Waiting for: Java indexing... 22 files to index (/Project)
Waiting for: Java indexing... 22 files to index (/Project)
Waiting for: Java indexing... 22 files to index (/Project)
Waiting for: Java indexing... 22 files to index (/Project)
Waiting for: Java indexing... 16 files to index (/Project)
Waiting for: Java indexing... 21 files to index (/Project)
Waiting for: Flushing content description cache.
Waiting for: Java indexing... 21 files to index (/Project)
Waiting for: Flushing content description cache.
Waiting for: Java indexing... 3 files to index (/Project)