Build: #294 failed

Job: Default Job failed

Stages & jobs

  1. Default Stage

Job result summary

Completed
Duration
95 minutes
Agent
bamboo-17.af.pivotal.io
Revision
066488d89501b52903f809ea1a04cf6ad6015b3b 066488d89501b52903f809ea1a04cf6ad6015b3b
Total tests
6284
Failing since
#254 (Code changes detected – )
Fixed in
#306 (Code changes detected)

Tests

  • 6,284 tests in total
  • 7 tests failed
  • 6 failures are new
  • 6 tests were fixed
  • 140 tests were quarantined / skipped
  • 91 minutes taken in total.
New test failures 6
Status Test Duration
Collapse Failed BasicGroovyBuildTests testClashingPackageAndType_1214 History
< 1 sec
org.junit.ComparisonFailure: unexpected recompiled units. lenExpected=2 lenActual=0 expected:<{[com.acme.Foo,xyz]}> but was:<{[]}>
	at org.eclipse.jdt.core.groovy.tests.builder.BasicGroovyBuildTests.testClashingPackageAndType_1214(BasicGroovyBuildTests.java:826)
Collapse Failed BasicGroovyBuildTests testFieldInitializerFromOtherFile History
< 1 sec
java.lang.NullPointerException
	at org.eclipse.jdt.core.groovy.tests.builder.BasicGroovyBuildTests.testFieldInitializerFromOtherFile(BasicGroovyBuildTests.java:2812)
Collapse Failed BuildAccessRulesTests testAccessForFieldGenerics History
< 1 sec
junit.framework.ComparisonFailure: 
----------- Expected ------------
Problem : Access restriction: The type 'BeanInfo' is not API (restriction on required library '##') [ resource : </Project/src/Foo.groovy> range : <47,55> category : <150> severity : <2>]

------------ but was ------------

--------- Difference is ----------
 expected:<[Problem : Access restriction: The type 'BeanInfo' is not API (restriction on required library '##') [ resource : </Project/src/Foo.groovy> range : <47,55> category : <150> severity : <2>]
(13 more lines...)
Collapse Failed GroovyContentTypeTests testGroovyProject History
< 1 sec
java.lang.AssertionError: L/Project/bin/p1/HelloJava.class should exist
	at org.eclipse.jdt.core.groovy.tests.model.GroovyContentTypeTests.checkGroovyProject(GroovyContentTypeTests.java:119)
	at org.eclipse.jdt.core.groovy.tests.model.GroovyContentTypeTests.testGroovyProject(GroovyContentTypeTests.java:78)
Collapse Failed ConstructorReferenceSearchTests testConstructorReferences8 History
< 1 sec
java.lang.AssertionError: expected:<1> but was:<0>
	at org.eclipse.jdt.core.groovy.tests.search.ConstructorReferenceSearchTests.testConstructorReferences8(ConstructorReferenceSearchTests.java:218)
Collapse Failed DGMInferencingTests testDGSMDeclaring5 History
< 1 sec
java.lang.AssertionError: Expected declaring type not found.
 Expected: org.codehaus.groovy.runtime.DefaultGroovyStaticMethods
 Found type: java.lang.String
 Found declaring type: java.util.regex.Matcher
 ASTNode: org.codehaus.groovy.ast.expr.ConstantExpression@ee9ff[getLastMatcher]
java.lang.AssertionError: 
Expected declaring type not found.
	Expected: org.codehaus.groovy.runtime.DefaultGroovyStaticMethods
(5 more lines...)
Existing test failures 1
Status Test Failing since Duration
junit.framework.ComparisonFailure: 
----------- Expected ------------

------------ but was ------------
Problem : The import util.MyException is never used [ resource : </Project/src/p/Test.java> range : <18,34> category : <120> severity : <1>]

--------- Difference is ----------
 expected:<[]> but was:<[Problem : The import util.MyException is never used [ resource : </Project/src/p/Test.java> range : <18,34> category : <120> severity : <1>]
(12 more lines...)
Fixed tests 6
Status Test Failing since Duration
Successful BasicGroovyBuildTests testAnnotationCollectorIncremental History
Failing since build #293 (Code changes detected) 1 sec
Successful BinarySearchTests testMethodDecl History
Failing since build #293 (Code changes detected) 1 sec
Successful ClosureInferencingTests testClosure24 History
Failing since build #293 (Code changes detected) < 1 sec
Successful DGMInferencingTests testDGM26 History
Failing since build #293 (Code changes detected) < 1 sec
Successful MethodReferenceSearchTests testGenericsMethodReferenceSearch History
Failing since build #293 (Code changes detected) < 1 sec
Successful TypeReferenceSearchTests testFindClassDeclarationWithPattern History
Failing since build #293 (Code changes detected) < 1 sec

Error summary

The build generated some errors. See the full build log for more details.

Jan 14, 2020 9:25:15 PM org.apache.http.impl.execchain.RetryExec execute
INFO: I/O exception (org.apache.http.NoHttpResponseException) caught when processing request to {s}->https://download.eclipse.org:443: The target server failed to respond
Jan 14, 2020 9:25:15 PM org.apache.http.impl.execchain.RetryExec execute
INFO: Retrying request to {s}->https://download.eclipse.org:443
SWT SessionManagerDBus: Failed to connect to org.gnome.SessionManager: Failed to execute child process “dbus-launch” (No such file or directory)
SWT SessionManagerDBus: Failed to connect to org.xfce.SessionManager: Failed to execute child process “dbus-launch” (No such file or directory)
TypeInferencingVisitorWithRequestor.findMethodNode: no match found for Main.main([Qjava.lang.String;)
TypeInferencingVisitorWithRequestor.findMethodNode: no match found for Main.main([Qjava.lang.String;)
CodeSelectRequestor: Could not proceed due to null declaring type for org.codehaus.groovy.ast.expr.BinaryExpression@ecbea[org.codehaus.groovy.ast.expr.VariableExpression@ecbe3[variable: it]("in" at 1:20:  "in" )org.codehaus.groovy.ast.expr.ListExpression@ee270[]]
CodeSelectRequestor: Could not proceed due to null declaring type for org.codehaus.groovy.ast.expr.RangeExpression@ebcdd
CodeSelectRequestor: Could not proceed due to null declaring type for org.codehaus.groovy.ast.expr.RangeExpression@ebcde
TypeInferencingVisitorWithRequestor.findMethodNode: no match found for Type.x(QList<Qjava.util.Date;>;)
TypeInferencingVisitorWithRequestor.findMethodNode: no match found for Type.x(QList<Qjava.lang.Number;>;)
TypeInferencingVisitorWithRequestor.findMethodNode: no match found for Type.x(QList<Qjava.lang.Number;>;)
TypeInferencingVisitorWithRequestor.findMethodNode: no match found for Type.x(QList<Qjava.util.Date;>;)
TypeInferencingVisitorWithRequestor.findMethodNode: no match found for Type.x(QList<Qjava.lang.Number;>;)
CodeSelectRequestor: Could not proceed due to null declaring type for org.codehaus.groovy.ast.expr.ConstantExpression@e8fc6[fff]
CodeSelectRequestor: Could not proceed due to null declaring type for org.codehaus.groovy.ast.expr.ConstantExpression@e8fca[fff]
CodeSelectRequestor: Could not proceed due to null declaring type for org.codehaus.groovy.ast.expr.ConstantExpression@e8fca[fff]
Waiting for: Java indexing... 22 files to index (/Project)
Waiting for: Java indexing... 22 files to index (/Project)
Waiting for: Java indexing... 22 files to index (/Project)
Waiting for: Java indexing... 22 files to index (/Project)
Waiting for: Java indexing... 22 files to index (/Project)
Waiting for: Java indexing... 22 files to index (/Project)
Waiting for: Java indexing... 22 files to index (/Project)
Waiting for: Java indexing... 21 files to index (/Project)
Waiting for: Java indexing... 21 files to index (/Project)
Waiting for: Flushing content description cache.
Waiting for: Java indexing... 21 files to index (/Project)
Waiting for: Java indexing... 3 files to index (/Project)