Build: #77 failed

Job: Default Job failed

Stages & jobs

  1. Default Stage

Build log

The build generated 2,289 lines of output.The output is too long and has been truncated to the last 1,000 lines. Download or view full build log

07-Jun-2019 16:07:22     </environment>
07-Jun-2019 16:07:22   </environments>
07-Jun-2019 16:07:22 </configuration>
07-Jun-2019 16:07:22 [DEBUG] target-platform-configuration for MavenProject: org.codehaus.groovy.eclipse:org.codehaus.groovy.eclipse.core.test:3.4.0-SNAPSHOT @ /opt/bamboo-home/xml-data/build-dir/GRECLIPSE-E412-JOB1/ide-test/org.codehaus.groovy.eclipse.core.test/pom.xml:
07-Jun-2019 16:07:22 <?xml version="1.0" encoding="UTF-8"?>
07-Jun-2019 16:07:22 <configuration>
07-Jun-2019 16:07:22   <environments>
07-Jun-2019 16:07:22     <environment>
07-Jun-2019 16:07:22       <os>linux</os>
07-Jun-2019 16:07:22       <ws>gtk</ws>
07-Jun-2019 16:07:22       <arch>x86_64</arch>
07-Jun-2019 16:07:22     </environment>
07-Jun-2019 16:07:22     <environment>
07-Jun-2019 16:07:22       <os>macosx</os>
07-Jun-2019 16:07:22       <ws>cocoa</ws>
07-Jun-2019 16:07:22       <arch>x86_64</arch>
07-Jun-2019 16:07:22     </environment>
07-Jun-2019 16:07:22     <environment>
07-Jun-2019 16:07:22       <os>win32</os>
07-Jun-2019 16:07:22       <ws>win32</ws>
07-Jun-2019 16:07:22       <arch>x86_64</arch>
07-Jun-2019 16:07:22     </environment>
07-Jun-2019 16:07:22   </environments>
07-Jun-2019 16:07:22 </configuration>
07-Jun-2019 16:07:22 [DEBUG] target-platform-configuration for MavenProject: org.codehaus.groovy.eclipse:org.codehaus.groovy.eclipse.dsl.tests:3.4.0-SNAPSHOT @ /opt/bamboo-home/xml-data/build-dir/GRECLIPSE-E412-JOB1/ide-test/org.codehaus.groovy.eclipse.dsl.tests/pom.xml:
07-Jun-2019 16:07:22 <?xml version="1.0" encoding="UTF-8"?>
07-Jun-2019 16:07:22 <configuration>
07-Jun-2019 16:07:22   <environments>
07-Jun-2019 16:07:22     <environment>
07-Jun-2019 16:07:22       <os>linux</os>
07-Jun-2019 16:07:22       <ws>gtk</ws>
07-Jun-2019 16:07:22       <arch>x86_64</arch>
07-Jun-2019 16:07:22     </environment>
07-Jun-2019 16:07:22     <environment>
07-Jun-2019 16:07:22       <os>macosx</os>
07-Jun-2019 16:07:22       <ws>cocoa</ws>
07-Jun-2019 16:07:22       <arch>x86_64</arch>
07-Jun-2019 16:07:22     </environment>
07-Jun-2019 16:07:22     <environment>
07-Jun-2019 16:07:22       <os>win32</os>
07-Jun-2019 16:07:22       <ws>win32</ws>
07-Jun-2019 16:07:22       <arch>x86_64</arch>
07-Jun-2019 16:07:22     </environment>
07-Jun-2019 16:07:22   </environments>
07-Jun-2019 16:07:22 </configuration>
07-Jun-2019 16:07:22 [DEBUG] target-platform-configuration for MavenProject: org.codehaus.groovy.eclipse:org.codehaus.groovy.eclipse.junit.test:3.4.0-SNAPSHOT @ /opt/bamboo-home/xml-data/build-dir/GRECLIPSE-E412-JOB1/ide-test/org.codehaus.groovy.eclipse.junit.test/pom.xml:
07-Jun-2019 16:07:22 <?xml version="1.0" encoding="UTF-8"?>
07-Jun-2019 16:07:22 <configuration>
07-Jun-2019 16:07:22   <environments>
07-Jun-2019 16:07:22     <environment>
07-Jun-2019 16:07:22       <os>linux</os>
07-Jun-2019 16:07:22       <ws>gtk</ws>
07-Jun-2019 16:07:22       <arch>x86_64</arch>
07-Jun-2019 16:07:22     </environment>
07-Jun-2019 16:07:22     <environment>
07-Jun-2019 16:07:22       <os>macosx</os>
07-Jun-2019 16:07:22       <ws>cocoa</ws>
07-Jun-2019 16:07:22       <arch>x86_64</arch>
07-Jun-2019 16:07:22     </environment>
07-Jun-2019 16:07:22     <environment>
07-Jun-2019 16:07:22       <os>win32</os>
07-Jun-2019 16:07:22       <ws>win32</ws>
07-Jun-2019 16:07:22       <arch>x86_64</arch>
07-Jun-2019 16:07:22     </environment>
07-Jun-2019 16:07:22   </environments>
07-Jun-2019 16:07:22 </configuration>
07-Jun-2019 16:07:22 [DEBUG] target-platform-configuration for MavenProject: org.codehaus.groovy.eclipse:org.codehaus.groovy.eclipse.quickfix.test:3.4.0-SNAPSHOT @ /opt/bamboo-home/xml-data/build-dir/GRECLIPSE-E412-JOB1/ide-test/org.codehaus.groovy.eclipse.quickfix.test/pom.xml:
07-Jun-2019 16:07:22 <?xml version="1.0" encoding="UTF-8"?>
07-Jun-2019 16:07:22 <configuration>
07-Jun-2019 16:07:22   <environments>
07-Jun-2019 16:07:22     <environment>
07-Jun-2019 16:07:22       <os>linux</os>
07-Jun-2019 16:07:22       <ws>gtk</ws>
07-Jun-2019 16:07:22       <arch>x86_64</arch>
07-Jun-2019 16:07:22     </environment>
07-Jun-2019 16:07:22     <environment>
07-Jun-2019 16:07:22       <os>macosx</os>
07-Jun-2019 16:07:22       <ws>cocoa</ws>
07-Jun-2019 16:07:22       <arch>x86_64</arch>
07-Jun-2019 16:07:22     </environment>
07-Jun-2019 16:07:22     <environment>
07-Jun-2019 16:07:22       <os>win32</os>
07-Jun-2019 16:07:22       <ws>win32</ws>
07-Jun-2019 16:07:22       <arch>x86_64</arch>
07-Jun-2019 16:07:22     </environment>
07-Jun-2019 16:07:22   </environments>
07-Jun-2019 16:07:22 </configuration>
07-Jun-2019 16:07:22 [DEBUG] target-platform-configuration for MavenProject: org.codehaus.groovy.eclipse:org.codehaus.groovy.eclipse.refactoring.test:3.4.0-SNAPSHOT @ /opt/bamboo-home/xml-data/build-dir/GRECLIPSE-E412-JOB1/ide-test/org.codehaus.groovy.eclipse.refactoring.test/pom.xml:
07-Jun-2019 16:07:22 <?xml version="1.0" encoding="UTF-8"?>
07-Jun-2019 16:07:22 <configuration>
07-Jun-2019 16:07:22   <environments>
07-Jun-2019 16:07:22     <environment>
07-Jun-2019 16:07:22       <os>linux</os>
07-Jun-2019 16:07:22       <ws>gtk</ws>
07-Jun-2019 16:07:22       <arch>x86_64</arch>
07-Jun-2019 16:07:22     </environment>
07-Jun-2019 16:07:22     <environment>
07-Jun-2019 16:07:22       <os>macosx</os>
07-Jun-2019 16:07:22       <ws>cocoa</ws>
07-Jun-2019 16:07:22       <arch>x86_64</arch>
07-Jun-2019 16:07:22     </environment>
07-Jun-2019 16:07:22     <environment>
07-Jun-2019 16:07:22       <os>win32</os>
07-Jun-2019 16:07:22       <ws>win32</ws>
07-Jun-2019 16:07:22       <arch>x86_64</arch>
07-Jun-2019 16:07:22     </environment>
07-Jun-2019 16:07:22   </environments>
07-Jun-2019 16:07:22 </configuration>
07-Jun-2019 16:07:22 [DEBUG] target-platform-configuration for MavenProject: org.codehaus.groovy.eclipse:org.codehaus.groovy.eclipse.tests:3.4.0-SNAPSHOT @ /opt/bamboo-home/xml-data/build-dir/GRECLIPSE-E412-JOB1/ide-test/org.codehaus.groovy.eclipse.tests/pom.xml:
07-Jun-2019 16:07:22 <?xml version="1.0" encoding="UTF-8"?>
07-Jun-2019 16:07:22 <configuration>
07-Jun-2019 16:07:22   <environments>
07-Jun-2019 16:07:22     <environment>
07-Jun-2019 16:07:22       <os>linux</os>
07-Jun-2019 16:07:22       <ws>gtk</ws>
07-Jun-2019 16:07:22       <arch>x86_64</arch>
07-Jun-2019 16:07:22     </environment>
07-Jun-2019 16:07:22     <environment>
07-Jun-2019 16:07:22       <os>macosx</os>
07-Jun-2019 16:07:22       <ws>cocoa</ws>
07-Jun-2019 16:07:22       <arch>x86_64</arch>
07-Jun-2019 16:07:22     </environment>
07-Jun-2019 16:07:22     <environment>
07-Jun-2019 16:07:22       <os>win32</os>
07-Jun-2019 16:07:22       <ws>win32</ws>
07-Jun-2019 16:07:22       <arch>x86_64</arch>
07-Jun-2019 16:07:22     </environment>
07-Jun-2019 16:07:22   </environments>
07-Jun-2019 16:07:22 </configuration>
07-Jun-2019 16:07:22 [DEBUG] target-platform-configuration for MavenProject: org.codehaus.groovy.eclipse:org.codehaus.groovy.alltests:3.4.0-SNAPSHOT @ /opt/bamboo-home/xml-data/build-dir/GRECLIPSE-E412-JOB1/ide-test/org.codehaus.groovy.alltests/pom.xml:
07-Jun-2019 16:07:22 <?xml version="1.0" encoding="UTF-8"?>
07-Jun-2019 16:07:22 <configuration>
07-Jun-2019 16:07:22   <environments>
07-Jun-2019 16:07:22     <environment>
07-Jun-2019 16:07:22       <os>linux</os>
07-Jun-2019 16:07:22       <ws>gtk</ws>
07-Jun-2019 16:07:22       <arch>x86_64</arch>
07-Jun-2019 16:07:22     </environment>
07-Jun-2019 16:07:22     <environment>
07-Jun-2019 16:07:22       <os>macosx</os>
07-Jun-2019 16:07:22       <ws>cocoa</ws>
07-Jun-2019 16:07:22       <arch>x86_64</arch>
07-Jun-2019 16:07:22     </environment>
07-Jun-2019 16:07:22     <environment>
07-Jun-2019 16:07:22       <os>win32</os>
07-Jun-2019 16:07:22       <ws>win32</ws>
07-Jun-2019 16:07:22       <arch>x86_64</arch>
07-Jun-2019 16:07:22     </environment>
07-Jun-2019 16:07:22   </environments>
07-Jun-2019 16:07:22 </configuration>
07-Jun-2019 16:07:22 [DEBUG] Dependency collection stats: {ConflictMarker.analyzeTime=0, ConflictMarker.markTime=0, ConflictMarker.nodeCount=274, ConflictIdSorter.graphTime=0, ConflictIdSorter.topsortTime=0, ConflictIdSorter.conflictIdCount=71, ConflictIdSorter.conflictIdCycleCount=0, ConflictResolver.totalTime=2, ConflictResolver.conflictItemCount=155, DefaultDependencyCollector.collectTime=47, DefaultDependencyCollector.transformTime=2}
07-Jun-2019 16:07:22 [DEBUG] org.eclipse.tycho:tycho-surefire-plugin:jar:1.3.0:
07-Jun-2019 16:07:22 [DEBUG]    org.apache.maven:maven-plugin-api:jar:3.0:compile
07-Jun-2019 16:07:22 [DEBUG]       org.apache.maven:maven-model:jar:3.0:compile
07-Jun-2019 16:07:22 [DEBUG]       org.apache.maven:maven-artifact:jar:3.0:compile
07-Jun-2019 16:07:22 [DEBUG]       org.sonatype.sisu:sisu-inject-plexus:jar:1.4.2:compile
07-Jun-2019 16:07:22 [DEBUG]          org.codehaus.plexus:plexus-classworlds:jar:2.2.3:compile
07-Jun-2019 16:07:22 [DEBUG]          org.sonatype.sisu:sisu-inject-bean:jar:1.4.2:compile
07-Jun-2019 16:07:22 [DEBUG]             org.sonatype.sisu:sisu-guice:jar:noaop:2.1.7:compile
07-Jun-2019 16:07:22 [DEBUG]    org.codehaus.plexus:plexus-utils:jar:3.0.24:compile
07-Jun-2019 16:07:22 [DEBUG]    org.eclipse.tycho:tycho-core:jar:1.3.0:compile
07-Jun-2019 16:07:22 [DEBUG]       org.apache.maven:maven-core:jar:3.0:compile
07-Jun-2019 16:07:22 [DEBUG]          org.apache.maven:maven-settings:jar:3.0:compile
07-Jun-2019 16:07:22 [DEBUG]          org.apache.maven:maven-settings-builder:jar:3.0:compile
07-Jun-2019 16:07:22 [DEBUG]          org.apache.maven:maven-repository-metadata:jar:3.0:compile
07-Jun-2019 16:07:22 [DEBUG]          org.apache.maven:maven-model-builder:jar:3.0:compile
07-Jun-2019 16:07:22 [DEBUG]          org.apache.maven:maven-aether-provider:jar:3.0:runtime
07-Jun-2019 16:07:22 [DEBUG]          org.sonatype.aether:aether-impl:jar:1.7:compile
07-Jun-2019 16:07:22 [DEBUG]             org.sonatype.aether:aether-spi:jar:1.7:compile
07-Jun-2019 16:07:22 [DEBUG]          org.sonatype.aether:aether-api:jar:1.7:compile
07-Jun-2019 16:07:22 [DEBUG]          org.sonatype.aether:aether-util:jar:1.7:compile
07-Jun-2019 16:07:22 [DEBUG]          org.codehaus.plexus:plexus-interpolation:jar:1.14:compile
07-Jun-2019 16:07:22 [DEBUG]          org.sonatype.plexus:plexus-sec-dispatcher:jar:1.3:compile
07-Jun-2019 16:07:22 [DEBUG]             org.sonatype.plexus:plexus-cipher:jar:1.7:compile
07-Jun-2019 16:07:22 [DEBUG]       org.codehaus.plexus:plexus-archiver:jar:3.4:compile
07-Jun-2019 16:07:22 [DEBUG]          org.codehaus.plexus:plexus-io:jar:2.7.1:compile
07-Jun-2019 16:07:22 [DEBUG]          commons-io:commons-io:jar:2.5:compile
07-Jun-2019 16:07:22 [DEBUG]          org.apache.commons:commons-compress:jar:1.15:compile
07-Jun-2019 16:07:22 [DEBUG]             org.objenesis:objenesis:jar:2.6:compile
07-Jun-2019 16:07:22 [DEBUG]          org.iq80.snappy:snappy:jar:0.4:compile
07-Jun-2019 16:07:22 [DEBUG]          org.tukaani:xz:jar:1.5:runtime
07-Jun-2019 16:07:22 [DEBUG]       org.eclipse.tycho:org.eclipse.osgi.compatibility.state:jar:1.1.100.v20180131-1413:compile
07-Jun-2019 16:07:22 [DEBUG]       org.eclipse.tycho:sisu-equinox-embedder:jar:1.3.0:compile
07-Jun-2019 16:07:22 [DEBUG]          org.eclipse.tycho:org.eclipse.osgi:jar:3.13.0.v20180226-1711:compile
07-Jun-2019 16:07:22 [DEBUG]       org.eclipse.tycho:tycho-metadata-model:jar:1.3.0:compile
07-Jun-2019 16:07:22 [DEBUG]          de.pdark:decentxml:jar:1.3:compile
07-Jun-2019 16:07:22 [DEBUG]       org.eclipse.tycho:tycho-embedder-api:jar:1.3.0:compile
07-Jun-2019 16:07:22 [DEBUG]          org.eclipse.tycho:org.eclipse.tycho.embedder.shared:jar:1.3.0:compile
07-Jun-2019 16:07:22 [DEBUG]       org.eclipse.tycho:org.eclipse.tycho.core.shared:jar:1.3.0:compile
07-Jun-2019 16:07:22 [DEBUG]       org.apache.maven:maven-compat:jar:3.0:compile
07-Jun-2019 16:07:22 [DEBUG]          org.apache.maven.wagon:wagon-provider-api:jar:1.0-beta-6:compile
07-Jun-2019 16:07:22 [DEBUG]    org.eclipse.tycho:sisu-equinox-launching:jar:1.3.0:compile
07-Jun-2019 16:07:22 [DEBUG]       org.eclipse.tycho:sisu-equinox-api:jar:1.3.0:compile
07-Jun-2019 16:07:22 [DEBUG]       org.apache.commons:commons-exec:jar:1.2:compile
07-Jun-2019 16:07:22 [DEBUG]    org.eclipse.tycho:org.eclipse.tycho.surefire.osgibooter:jar:1.3.0:runtime
07-Jun-2019 16:07:22 [DEBUG]    org.eclipse.tycho:org.eclipse.tycho.surefire.junit:jar:1.3.0:runtime
07-Jun-2019 16:07:22 [DEBUG]    org.eclipse.tycho:org.eclipse.tycho.surefire.junit4:jar:1.3.0:runtime
07-Jun-2019 16:07:22 [DEBUG]    org.eclipse.tycho:org.eclipse.tycho.surefire.junit47:jar:1.3.0:runtime
07-Jun-2019 16:07:22 [DEBUG]    org.eclipse.tycho:org.eclipse.tycho.surefire.junit5:jar:1.3.0:runtime
07-Jun-2019 16:07:22 [DEBUG]    org.eclipse.tycho:org.eclipse.tycho.surefire.testng:jar:1.3.0:runtime
07-Jun-2019 16:07:22 [DEBUG]    org.apache.maven.surefire:surefire-api:jar:2.22.0:compile
07-Jun-2019 16:07:22 [DEBUG]       org.apache.maven.surefire:surefire-logger-api:jar:2.22.0:compile
07-Jun-2019 16:07:22 [DEBUG]    org.eclipse.tycho:tycho-p2-facade:jar:1.3.0:compile
07-Jun-2019 16:07:22 [DEBUG]       org.codehaus.plexus:plexus-component-annotations:jar:1.7.1:compile
07-Jun-2019 16:07:22 [DEBUG]       org.eclipse.tycho:org.eclipse.tycho.p2.resolver.shared:jar:1.3.0:compile
07-Jun-2019 16:07:22 [DEBUG]       org.eclipse.tycho:org.eclipse.tycho.p2.tools.shared:jar:1.3.0:compile
07-Jun-2019 16:07:22 [DEBUG]    org.apache.maven.surefire:maven-surefire-common:jar:2.22.0:compile
07-Jun-2019 16:07:22 [DEBUG]       org.apache.maven.plugin-tools:maven-plugin-annotations:jar:3.5.2:provided
07-Jun-2019 16:07:22 [DEBUG]       org.apache.maven.surefire:surefire-booter:jar:2.22.0:compile
07-Jun-2019 16:07:22 [DEBUG]       org.apache.maven:maven-plugin-descriptor:jar:2.2.1:compile
07-Jun-2019 16:07:22 [DEBUG]          org.codehaus.plexus:plexus-container-default:jar:1.7.1:provided
07-Jun-2019 16:07:22 [DEBUG]             org.apache.xbean:xbean-reflect:jar:3.7:provided
07-Jun-2019 16:07:22 [DEBUG]             com.google.collections:google-collections:jar:1.0:provided
07-Jun-2019 16:07:22 [DEBUG]       org.apache.maven:maven-project:jar:2.2.1:compile
07-Jun-2019 16:07:22 [DEBUG]          org.apache.maven:maven-profile:jar:2.2.1:compile
07-Jun-2019 16:07:22 [DEBUG]          org.apache.maven:maven-artifact-manager:jar:2.2.1:compile
07-Jun-2019 16:07:22 [DEBUG]             backport-util-concurrent:backport-util-concurrent:jar:3.1:compile
07-Jun-2019 16:07:22 [DEBUG]          org.apache.maven:maven-plugin-registry:jar:2.2.1:compile
07-Jun-2019 16:07:22 [DEBUG]       org.apache.maven:maven-toolchain:jar:2.2.1:compile
07-Jun-2019 16:07:22 [DEBUG]       org.codehaus.plexus:plexus-java:jar:0.9.8:compile
07-Jun-2019 16:07:22 [DEBUG]          org.ow2.asm:asm:jar:6.1.1:compile
07-Jun-2019 16:07:22 [DEBUG]          com.thoughtworks.qdox:qdox:jar:2.0-M7:compile
07-Jun-2019 16:07:22 [DEBUG] Created new class realm plugin>org.eclipse.tycho:tycho-surefire-plugin:1.3.0
07-Jun-2019 16:07:22 [DEBUG] Importing foreign packages into class realm plugin>org.eclipse.tycho:tycho-surefire-plugin:1.3.0
07-Jun-2019 16:07:22 [DEBUG]   Imported:  < project>org.codehaus.groovy.eclipse:org.codehaus.groovy.eclipse.parent:3.4.0-SNAPSHOT
07-Jun-2019 16:07:22 [DEBUG] Populating class realm plugin>org.eclipse.tycho:tycho-surefire-plugin:1.3.0
07-Jun-2019 16:07:22 [DEBUG]   Included: org.eclipse.tycho:tycho-surefire-plugin:jar:1.3.0
07-Jun-2019 16:07:22 [DEBUG]   Included: org.sonatype.sisu:sisu-inject-bean:jar:1.4.2
07-Jun-2019 16:07:22 [DEBUG]   Included: org.sonatype.sisu:sisu-guice:jar:noaop:2.1.7
07-Jun-2019 16:07:22 [DEBUG]   Included: org.codehaus.plexus:plexus-utils:jar:3.0.24
07-Jun-2019 16:07:22 [DEBUG]   Included: org.sonatype.aether:aether-util:jar:1.7
07-Jun-2019 16:07:22 [DEBUG]   Included: org.codehaus.plexus:plexus-interpolation:jar:1.14
07-Jun-2019 16:07:22 [DEBUG]   Included: org.sonatype.plexus:plexus-sec-dispatcher:jar:1.3
07-Jun-2019 16:07:22 [DEBUG]   Included: org.sonatype.plexus:plexus-cipher:jar:1.7
07-Jun-2019 16:07:22 [DEBUG]   Included: org.codehaus.plexus:plexus-archiver:jar:3.4
07-Jun-2019 16:07:22 [DEBUG]   Included: org.codehaus.plexus:plexus-io:jar:2.7.1
07-Jun-2019 16:07:22 [DEBUG]   Included: commons-io:commons-io:jar:2.5
07-Jun-2019 16:07:22 [DEBUG]   Included: org.apache.commons:commons-compress:jar:1.15
07-Jun-2019 16:07:22 [DEBUG]   Included: org.objenesis:objenesis:jar:2.6
07-Jun-2019 16:07:22 [DEBUG]   Included: org.iq80.snappy:snappy:jar:0.4
07-Jun-2019 16:07:22 [DEBUG]   Included: org.tukaani:xz:jar:1.5
07-Jun-2019 16:07:22 [DEBUG]   Included: org.eclipse.tycho:org.eclipse.osgi.compatibility.state:jar:1.1.100.v20180131-1413
07-Jun-2019 16:07:22 [DEBUG]   Included: org.eclipse.tycho:sisu-equinox-launching:jar:1.3.0
07-Jun-2019 16:07:22 [DEBUG]   Included: org.apache.commons:commons-exec:jar:1.2
07-Jun-2019 16:07:22 [DEBUG]   Included: org.eclipse.tycho:org.eclipse.tycho.surefire.osgibooter:jar:1.3.0
07-Jun-2019 16:07:22 [DEBUG]   Included: org.eclipse.tycho:org.eclipse.tycho.surefire.junit:jar:1.3.0
07-Jun-2019 16:07:22 [DEBUG]   Included: org.eclipse.tycho:org.eclipse.tycho.surefire.junit4:jar:1.3.0
07-Jun-2019 16:07:22 [DEBUG]   Included: org.eclipse.tycho:org.eclipse.tycho.surefire.junit47:jar:1.3.0
07-Jun-2019 16:07:22 [DEBUG]   Included: org.eclipse.tycho:org.eclipse.tycho.surefire.junit5:jar:1.3.0
07-Jun-2019 16:07:22 [DEBUG]   Included: org.eclipse.tycho:org.eclipse.tycho.surefire.testng:jar:1.3.0
07-Jun-2019 16:07:22 [DEBUG]   Included: org.apache.maven.surefire:surefire-api:jar:2.22.0
07-Jun-2019 16:07:22 [DEBUG]   Included: org.apache.maven.surefire:surefire-logger-api:jar:2.22.0
07-Jun-2019 16:07:22 [DEBUG]   Included: org.codehaus.plexus:plexus-component-annotations:jar:1.7.1
07-Jun-2019 16:07:22 [DEBUG]   Included: org.apache.maven.surefire:maven-surefire-common:jar:2.22.0
07-Jun-2019 16:07:22 [DEBUG]   Included: org.apache.maven.surefire:surefire-booter:jar:2.22.0
07-Jun-2019 16:07:22 [DEBUG]   Included: backport-util-concurrent:backport-util-concurrent:jar:3.1
07-Jun-2019 16:07:22 [DEBUG]   Included: org.codehaus.plexus:plexus-java:jar:0.9.8
07-Jun-2019 16:07:22 [DEBUG]   Included: org.ow2.asm:asm:jar:6.1.1
07-Jun-2019 16:07:22 [DEBUG]   Included: com.thoughtworks.qdox:qdox:jar:2.0-M7
07-Jun-2019 16:07:22 [DEBUG] target-platform-configuration for MavenProject: org.codehaus.groovy.eclipse:org.codehaus.groovy.m2eclipse:3.4.0-SNAPSHOT @ /opt/bamboo-home/xml-data/build-dir/GRECLIPSE-E412-JOB1/extras/org.codehaus.groovy.m2eclipse/pom.xml:
07-Jun-2019 16:07:22 <?xml version="1.0" encoding="UTF-8"?>
07-Jun-2019 16:07:22 <configuration>
07-Jun-2019 16:07:22   <environments>
07-Jun-2019 16:07:22     <environment>
07-Jun-2019 16:07:22       <os>linux</os>
07-Jun-2019 16:07:22       <ws>gtk</ws>
07-Jun-2019 16:07:22       <arch>x86_64</arch>
07-Jun-2019 16:07:22     </environment>
07-Jun-2019 16:07:22     <environment>
07-Jun-2019 16:07:22       <os>macosx</os>
07-Jun-2019 16:07:22       <ws>cocoa</ws>
07-Jun-2019 16:07:22       <arch>x86_64</arch>
07-Jun-2019 16:07:22     </environment>
07-Jun-2019 16:07:22     <environment>
07-Jun-2019 16:07:22       <os>win32</os>
07-Jun-2019 16:07:22       <ws>win32</ws>
07-Jun-2019 16:07:22       <arch>x86_64</arch>
07-Jun-2019 16:07:22     </environment>
07-Jun-2019 16:07:22   </environments>
07-Jun-2019 16:07:22 </configuration>
07-Jun-2019 16:07:22 [DEBUG] target-platform-configuration for MavenProject: org.codehaus.groovy.eclipse:org.codehaus.groovy.m2eclipse.feature:3.4.0-SNAPSHOT @ /opt/bamboo-home/xml-data/build-dir/GRECLIPSE-E412-JOB1/extras/Feature-org.codehaus.groovy.m2eclipse/pom.xml:
07-Jun-2019 16:07:22 <?xml version="1.0" encoding="UTF-8"?>
07-Jun-2019 16:07:22 <configuration>
07-Jun-2019 16:07:22   <environments>
07-Jun-2019 16:07:22     <environment>
07-Jun-2019 16:07:22       <os>linux</os>
07-Jun-2019 16:07:22       <ws>gtk</ws>
07-Jun-2019 16:07:22       <arch>x86_64</arch>
07-Jun-2019 16:07:22     </environment>
07-Jun-2019 16:07:22     <environment>
07-Jun-2019 16:07:22       <os>macosx</os>
07-Jun-2019 16:07:22       <ws>cocoa</ws>
07-Jun-2019 16:07:22       <arch>x86_64</arch>
07-Jun-2019 16:07:22     </environment>
07-Jun-2019 16:07:22     <environment>
07-Jun-2019 16:07:22       <os>win32</os>
07-Jun-2019 16:07:22       <ws>win32</ws>
07-Jun-2019 16:07:22       <arch>x86_64</arch>
07-Jun-2019 16:07:22     </environment>
07-Jun-2019 16:07:22   </environments>
07-Jun-2019 16:07:22 </configuration>
07-Jun-2019 16:07:22 [DEBUG] target-platform-configuration for MavenProject: org.codehaus.groovy.eclipse:org.codehaus.groovy.eclipse.site:3.4.0-SNAPSHOT @ /opt/bamboo-home/xml-data/build-dir/GRECLIPSE-E412-JOB1/Site-org.codehaus.groovy.eclipse/pom.xml:
07-Jun-2019 16:07:22 <?xml version="1.0" encoding="UTF-8"?>
07-Jun-2019 16:07:22 <configuration>
07-Jun-2019 16:07:22   <environments>
07-Jun-2019 16:07:22     <environment>
07-Jun-2019 16:07:22       <os>linux</os>
07-Jun-2019 16:07:22       <ws>gtk</ws>
07-Jun-2019 16:07:22       <arch>x86_64</arch>
07-Jun-2019 16:07:22     </environment>
07-Jun-2019 16:07:22     <environment>
07-Jun-2019 16:07:22       <os>macosx</os>
07-Jun-2019 16:07:22       <ws>cocoa</ws>
07-Jun-2019 16:07:22       <arch>x86_64</arch>
07-Jun-2019 16:07:22     </environment>
07-Jun-2019 16:07:22     <environment>
07-Jun-2019 16:07:22       <os>win32</os>
07-Jun-2019 16:07:22       <ws>win32</ws>
07-Jun-2019 16:07:22       <arch>x86_64</arch>
07-Jun-2019 16:07:22     </environment>
07-Jun-2019 16:07:22   </environments>
07-Jun-2019 16:07:22 </configuration>
07-Jun-2019 16:07:22 [DEBUG] Dependency collection stats: {ConflictMarker.analyzeTime=0, ConflictMarker.markTime=0, ConflictMarker.nodeCount=186, ConflictIdSorter.graphTime=0, ConflictIdSorter.topsortTime=0, ConflictIdSorter.conflictIdCount=48, ConflictIdSorter.conflictIdCycleCount=0, ConflictResolver.totalTime=1, ConflictResolver.conflictItemCount=115, DefaultDependencyCollector.collectTime=3, DefaultDependencyCollector.transformTime=1}
07-Jun-2019 16:07:22 [DEBUG] org.eclipse.tycho:tycho-source-plugin:jar:1.3.0:
07-Jun-2019 16:07:22 [DEBUG]    org.eclipse.tycho:tycho-p2-facade:jar:1.3.0:compile
07-Jun-2019 16:07:22 [DEBUG]       org.codehaus.plexus:plexus-component-annotations:jar:1.7.1:compile
07-Jun-2019 16:07:22 [DEBUG]       org.eclipse.tycho:sisu-equinox-embedder:jar:1.3.0:compile
07-Jun-2019 16:07:22 [DEBUG]          org.eclipse.tycho:org.eclipse.osgi:jar:3.13.0.v20180226-1711:compile
07-Jun-2019 16:07:22 [DEBUG]          org.eclipse.tycho:sisu-equinox-api:jar:1.3.0:compile
07-Jun-2019 16:07:22 [DEBUG]       org.eclipse.tycho:org.eclipse.tycho.p2.resolver.shared:jar:1.3.0:compile
07-Jun-2019 16:07:22 [DEBUG]       org.eclipse.tycho:org.eclipse.tycho.p2.tools.shared:jar:1.3.0:compile
07-Jun-2019 16:07:22 [DEBUG]    org.apache.maven:maven-core:jar:3.0:compile
07-Jun-2019 16:07:22 [DEBUG]       org.apache.maven:maven-model:jar:3.0:compile
07-Jun-2019 16:07:22 [DEBUG]       org.apache.maven:maven-settings:jar:3.0:compile
07-Jun-2019 16:07:22 [DEBUG]       org.apache.maven:maven-settings-builder:jar:3.0:compile
07-Jun-2019 16:07:22 [DEBUG]       org.apache.maven:maven-repository-metadata:jar:3.0:compile
07-Jun-2019 16:07:22 [DEBUG]       org.apache.maven:maven-artifact:jar:3.0:compile
07-Jun-2019 16:07:22 [DEBUG]       org.apache.maven:maven-model-builder:jar:3.0:compile
07-Jun-2019 16:07:22 [DEBUG]       org.apache.maven:maven-aether-provider:jar:3.0:runtime
07-Jun-2019 16:07:22 [DEBUG]       org.sonatype.aether:aether-impl:jar:1.7:compile
07-Jun-2019 16:07:22 [DEBUG]          org.sonatype.aether:aether-spi:jar:1.7:compile
07-Jun-2019 16:07:22 [DEBUG]       org.sonatype.aether:aether-api:jar:1.7:compile
07-Jun-2019 16:07:22 [DEBUG]       org.sonatype.aether:aether-util:jar:1.7:compile
07-Jun-2019 16:07:22 [DEBUG]       org.sonatype.sisu:sisu-inject-plexus:jar:1.4.2:compile
07-Jun-2019 16:07:22 [DEBUG]          org.sonatype.sisu:sisu-inject-bean:jar:1.4.2:compile
07-Jun-2019 16:07:22 [DEBUG]             org.sonatype.sisu:sisu-guice:jar:noaop:2.1.7:compile
07-Jun-2019 16:07:22 [DEBUG]       org.codehaus.plexus:plexus-interpolation:jar:1.14:compile
07-Jun-2019 16:07:22 [DEBUG]       org.codehaus.plexus:plexus-utils:jar:3.0.24:compile
07-Jun-2019 16:07:22 [DEBUG]       org.codehaus.plexus:plexus-classworlds:jar:2.2.3:compile
07-Jun-2019 16:07:22 [DEBUG]       org.sonatype.plexus:plexus-sec-dispatcher:jar:1.3:compile
07-Jun-2019 16:07:22 [DEBUG]          org.sonatype.plexus:plexus-cipher:jar:1.7:compile
07-Jun-2019 16:07:22 [DEBUG]    org.apache.maven:maven-plugin-api:jar:3.0:compile
07-Jun-2019 16:07:22 [DEBUG]    org.apache.maven.plugins:maven-source-plugin:jar:2.1:compile
07-Jun-2019 16:07:22 [DEBUG]       org.apache.maven:maven-archiver:jar:2.5:compile
07-Jun-2019 16:07:22 [DEBUG]       org.codehaus.plexus:plexus-archiver:jar:3.4:compile
07-Jun-2019 16:07:22 [DEBUG]          org.codehaus.plexus:plexus-io:jar:2.7.1:compile
07-Jun-2019 16:07:22 [DEBUG]          commons-io:commons-io:jar:2.5:compile
07-Jun-2019 16:07:22 [DEBUG]          org.apache.commons:commons-compress:jar:1.15:compile
07-Jun-2019 16:07:22 [DEBUG]             org.objenesis:objenesis:jar:2.6:compile
07-Jun-2019 16:07:22 [DEBUG]          org.iq80.snappy:snappy:jar:0.4:compile
07-Jun-2019 16:07:22 [DEBUG]          org.tukaani:xz:jar:1.5:runtime
07-Jun-2019 16:07:22 [DEBUG]    org.eclipse.tycho:tycho-core:jar:1.3.0:compile
07-Jun-2019 16:07:22 [DEBUG]       org.eclipse.tycho:org.eclipse.osgi.compatibility.state:jar:1.1.100.v20180131-1413:compile
07-Jun-2019 16:07:22 [DEBUG]       org.eclipse.tycho:tycho-metadata-model:jar:1.3.0:compile
07-Jun-2019 16:07:22 [DEBUG]          de.pdark:decentxml:jar:1.3:compile
07-Jun-2019 16:07:22 [DEBUG]       org.eclipse.tycho:tycho-embedder-api:jar:1.3.0:compile
07-Jun-2019 16:07:22 [DEBUG]          org.eclipse.tycho:org.eclipse.tycho.embedder.shared:jar:1.3.0:compile
07-Jun-2019 16:07:22 [DEBUG]       org.eclipse.tycho:org.eclipse.tycho.core.shared:jar:1.3.0:compile
07-Jun-2019 16:07:22 [DEBUG]       org.apache.maven:maven-compat:jar:3.0:compile
07-Jun-2019 16:07:22 [DEBUG]          org.apache.maven.wagon:wagon-provider-api:jar:1.0-beta-6:compile
07-Jun-2019 16:07:22 [DEBUG]    org.eclipse.tycho:tycho-packaging-plugin:jar:1.3.0:compile
07-Jun-2019 16:07:22 [DEBUG] Created new class realm plugin>org.eclipse.tycho:tycho-source-plugin:1.3.0-730619841
07-Jun-2019 16:07:22 [DEBUG] Importing foreign packages into class realm plugin>org.eclipse.tycho:tycho-source-plugin:1.3.0-730619841
07-Jun-2019 16:07:22 [DEBUG]   Imported:  < project>org.codehaus.groovy.eclipse:org.codehaus.groovy.eclipse.parent:3.4.0-SNAPSHOT
07-Jun-2019 16:07:22 [DEBUG] Populating class realm plugin>org.eclipse.tycho:tycho-source-plugin:1.3.0-730619841
07-Jun-2019 16:07:22 [DEBUG]   Included: org.eclipse.tycho:tycho-source-plugin:jar:1.3.0
07-Jun-2019 16:07:22 [DEBUG]   Included: org.codehaus.plexus:plexus-component-annotations:jar:1.7.1
07-Jun-2019 16:07:22 [DEBUG]   Included: org.sonatype.aether:aether-util:jar:1.7
07-Jun-2019 16:07:22 [DEBUG]   Included: org.sonatype.sisu:sisu-inject-bean:jar:1.4.2
07-Jun-2019 16:07:22 [DEBUG]   Included: org.sonatype.sisu:sisu-guice:jar:noaop:2.1.7
07-Jun-2019 16:07:22 [DEBUG]   Included: org.codehaus.plexus:plexus-interpolation:jar:1.14
07-Jun-2019 16:07:22 [DEBUG]   Included: org.codehaus.plexus:plexus-utils:jar:3.0.24
07-Jun-2019 16:07:22 [DEBUG]   Included: org.sonatype.plexus:plexus-sec-dispatcher:jar:1.3
07-Jun-2019 16:07:22 [DEBUG]   Included: org.sonatype.plexus:plexus-cipher:jar:1.7
07-Jun-2019 16:07:22 [DEBUG]   Included: org.apache.maven.plugins:maven-source-plugin:jar:2.1
07-Jun-2019 16:07:22 [DEBUG]   Included: org.apache.maven:maven-archiver:jar:2.5
07-Jun-2019 16:07:22 [DEBUG]   Included: org.codehaus.plexus:plexus-archiver:jar:3.4
07-Jun-2019 16:07:22 [DEBUG]   Included: org.codehaus.plexus:plexus-io:jar:2.7.1
07-Jun-2019 16:07:22 [DEBUG]   Included: commons-io:commons-io:jar:2.5
07-Jun-2019 16:07:22 [DEBUG]   Included: org.apache.commons:commons-compress:jar:1.15
07-Jun-2019 16:07:22 [DEBUG]   Included: org.objenesis:objenesis:jar:2.6
07-Jun-2019 16:07:22 [DEBUG]   Included: org.iq80.snappy:snappy:jar:0.4
07-Jun-2019 16:07:22 [DEBUG]   Included: org.tukaani:xz:jar:1.5
07-Jun-2019 16:07:22 [DEBUG]   Included: org.eclipse.tycho:org.eclipse.osgi.compatibility.state:jar:1.1.100.v20180131-1413
07-Jun-2019 16:07:22 [DEBUG]   Included: org.eclipse.tycho:tycho-packaging-plugin:jar:1.3.0
07-Jun-2019 16:07:22 [DEBUG] Dependency collection stats: {ConflictMarker.analyzeTime=1, ConflictMarker.markTime=0, ConflictMarker.nodeCount=154, ConflictIdSorter.graphTime=0, ConflictIdSorter.topsortTime=0, ConflictIdSorter.conflictIdCount=61, ConflictIdSorter.conflictIdCycleCount=0, ConflictResolver.totalTime=1, ConflictResolver.conflictItemCount=110, DefaultDependencyCollector.collectTime=3, DefaultDependencyCollector.transformTime=2}
07-Jun-2019 16:07:22 [DEBUG] org.eclipse.tycho.extras:tycho-source-feature-plugin:jar:1.3.0:
07-Jun-2019 16:07:22 [DEBUG]    org.apache.maven:maven-plugin-api:jar:3.0:compile
07-Jun-2019 16:07:22 [DEBUG]       org.apache.maven:maven-model:jar:3.0:provided
07-Jun-2019 16:07:22 [DEBUG]       org.apache.maven:maven-artifact:jar:3.0:compile
07-Jun-2019 16:07:22 [DEBUG]       org.sonatype.sisu:sisu-inject-plexus:jar:1.4.2:compile
07-Jun-2019 16:07:22 [DEBUG]          org.sonatype.sisu:sisu-inject-bean:jar:1.4.2:compile
07-Jun-2019 16:07:22 [DEBUG]             org.sonatype.sisu:sisu-guice:jar:noaop:2.1.7:compile
07-Jun-2019 16:07:22 [DEBUG]    org.apache.maven:maven-core:jar:3.0:compile
07-Jun-2019 16:07:22 [DEBUG]       org.apache.maven:maven-settings:jar:3.0:compile
07-Jun-2019 16:07:22 [DEBUG]       org.apache.maven:maven-settings-builder:jar:3.0:compile
07-Jun-2019 16:07:22 [DEBUG]       org.apache.maven:maven-repository-metadata:jar:3.0:compile
07-Jun-2019 16:07:22 [DEBUG]       org.apache.maven:maven-model-builder:jar:3.0:provided
07-Jun-2019 16:07:22 [DEBUG]       org.apache.maven:maven-aether-provider:jar:3.0:runtime
07-Jun-2019 16:07:22 [DEBUG]       org.sonatype.aether:aether-impl:jar:1.7:compile
07-Jun-2019 16:07:22 [DEBUG]          org.sonatype.aether:aether-spi:jar:1.7:compile
07-Jun-2019 16:07:22 [DEBUG]       org.sonatype.aether:aether-api:jar:1.7:compile
07-Jun-2019 16:07:22 [DEBUG]       org.sonatype.aether:aether-util:jar:1.7:compile
07-Jun-2019 16:07:22 [DEBUG]       org.codehaus.plexus:plexus-interpolation:jar:1.14:compile
07-Jun-2019 16:07:22 [DEBUG]       org.codehaus.plexus:plexus-utils:jar:3.0.24:compile
07-Jun-2019 16:07:22 [DEBUG]       org.codehaus.plexus:plexus-classworlds:jar:2.2.3:compile
07-Jun-2019 16:07:22 [DEBUG]       org.codehaus.plexus:plexus-component-annotations:jar:1.5.5:compile
07-Jun-2019 16:07:22 [DEBUG]       org.sonatype.plexus:plexus-sec-dispatcher:jar:1.3:compile
07-Jun-2019 16:07:22 [DEBUG]          org.sonatype.plexus:plexus-cipher:jar:1.4:compile
07-Jun-2019 16:07:22 [DEBUG]    org.apache.maven:maven-archiver:jar:2.5:compile
07-Jun-2019 16:07:22 [DEBUG]       org.codehaus.plexus:plexus-archiver:jar:3.4:compile
07-Jun-2019 16:07:22 [DEBUG]          org.codehaus.plexus:plexus-io:jar:2.7.1:compile
07-Jun-2019 16:07:22 [DEBUG]          commons-io:commons-io:jar:2.5:compile
07-Jun-2019 16:07:22 [DEBUG]          org.apache.commons:commons-compress:jar:1.15:compile
07-Jun-2019 16:07:22 [DEBUG]             org.objenesis:objenesis:jar:2.6:compile
07-Jun-2019 16:07:22 [DEBUG]          org.iq80.snappy:snappy:jar:0.4:compile
07-Jun-2019 16:07:22 [DEBUG]          org.tukaani:xz:jar:1.5:runtime
07-Jun-2019 16:07:22 [DEBUG]    org.eclipse.tycho:tycho-core:jar:1.3.0:compile
07-Jun-2019 16:07:22 [DEBUG]       org.eclipse.tycho:org.eclipse.osgi.compatibility.state:jar:1.1.100.v20180131-1413:compile
07-Jun-2019 16:07:22 [DEBUG]       org.eclipse.tycho:sisu-equinox-embedder:jar:1.3.0:compile
07-Jun-2019 16:07:22 [DEBUG]          org.eclipse.tycho:org.eclipse.osgi:jar:3.13.0.v20180226-1711:compile
07-Jun-2019 16:07:22 [DEBUG]          org.eclipse.tycho:sisu-equinox-api:jar:1.3.0:compile
07-Jun-2019 16:07:22 [DEBUG]       org.eclipse.tycho:tycho-metadata-model:jar:1.3.0:compile
07-Jun-2019 16:07:22 [DEBUG]          de.pdark:decentxml:jar:1.3:compile
07-Jun-2019 16:07:22 [DEBUG]       org.eclipse.tycho:tycho-embedder-api:jar:1.3.0:compile
07-Jun-2019 16:07:22 [DEBUG]          org.eclipse.tycho:org.eclipse.tycho.embedder.shared:jar:1.3.0:compile
07-Jun-2019 16:07:22 [DEBUG]       org.eclipse.tycho:org.eclipse.tycho.core.shared:jar:1.3.0:compile
07-Jun-2019 16:07:22 [DEBUG]       org.apache.maven:maven-compat:jar:3.0:compile
07-Jun-2019 16:07:22 [DEBUG]          org.apache.maven.wagon:wagon-provider-api:jar:1.0-beta-6:compile
07-Jun-2019 16:07:22 [DEBUG]    org.eclipse.tycho:tycho-p2-facade:jar:1.3.0:compile
07-Jun-2019 16:07:22 [DEBUG]       org.eclipse.tycho:org.eclipse.tycho.p2.resolver.shared:jar:1.3.0:compile
07-Jun-2019 16:07:22 [DEBUG]       org.eclipse.tycho:org.eclipse.tycho.p2.tools.shared:jar:1.3.0:compile
07-Jun-2019 16:07:22 [DEBUG]    org.eclipse.tycho:tycho-packaging-plugin:jar:1.3.0:compile
07-Jun-2019 16:07:22 [DEBUG] Created new class realm plugin>org.eclipse.tycho.extras:tycho-source-feature-plugin:1.3.0-422110239
07-Jun-2019 16:07:22 [DEBUG] Importing foreign packages into class realm plugin>org.eclipse.tycho.extras:tycho-source-feature-plugin:1.3.0-422110239
07-Jun-2019 16:07:22 [DEBUG]   Imported:  < project>org.codehaus.groovy.eclipse:org.codehaus.groovy.eclipse.parent:3.4.0-SNAPSHOT
07-Jun-2019 16:07:22 [DEBUG] Populating class realm plugin>org.eclipse.tycho.extras:tycho-source-feature-plugin:1.3.0-422110239
07-Jun-2019 16:07:22 [DEBUG]   Included: org.eclipse.tycho.extras:tycho-source-feature-plugin:jar:1.3.0
07-Jun-2019 16:07:22 [DEBUG]   Included: org.sonatype.sisu:sisu-inject-bean:jar:1.4.2
07-Jun-2019 16:07:22 [DEBUG]   Included: org.sonatype.sisu:sisu-guice:jar:noaop:2.1.7
07-Jun-2019 16:07:22 [DEBUG]   Included: org.sonatype.aether:aether-util:jar:1.7
07-Jun-2019 16:07:22 [DEBUG]   Included: org.codehaus.plexus:plexus-interpolation:jar:1.14
07-Jun-2019 16:07:22 [DEBUG]   Included: org.codehaus.plexus:plexus-utils:jar:3.0.24
07-Jun-2019 16:07:22 [DEBUG]   Included: org.codehaus.plexus:plexus-component-annotations:jar:1.5.5
07-Jun-2019 16:07:22 [DEBUG]   Included: org.sonatype.plexus:plexus-sec-dispatcher:jar:1.3
07-Jun-2019 16:07:22 [DEBUG]   Included: org.sonatype.plexus:plexus-cipher:jar:1.4
07-Jun-2019 16:07:22 [DEBUG]   Included: org.apache.maven:maven-archiver:jar:2.5
07-Jun-2019 16:07:22 [DEBUG]   Included: org.codehaus.plexus:plexus-archiver:jar:3.4
07-Jun-2019 16:07:22 [DEBUG]   Included: org.codehaus.plexus:plexus-io:jar:2.7.1
07-Jun-2019 16:07:22 [DEBUG]   Included: commons-io:commons-io:jar:2.5
07-Jun-2019 16:07:22 [DEBUG]   Included: org.apache.commons:commons-compress:jar:1.15
07-Jun-2019 16:07:22 [DEBUG]   Included: org.objenesis:objenesis:jar:2.6
07-Jun-2019 16:07:22 [DEBUG]   Included: org.iq80.snappy:snappy:jar:0.4
07-Jun-2019 16:07:22 [DEBUG]   Included: org.tukaani:xz:jar:1.5
07-Jun-2019 16:07:22 [DEBUG]   Included: org.eclipse.tycho:org.eclipse.osgi.compatibility.state:jar:1.1.100.v20180131-1413
07-Jun-2019 16:07:22 [DEBUG]   Included: org.eclipse.tycho:tycho-packaging-plugin:jar:1.3.0
07-Jun-2019 16:07:22 [DEBUG] Dependency collection stats: {ConflictMarker.analyzeTime=0, ConflictMarker.markTime=0, ConflictMarker.nodeCount=107, ConflictIdSorter.graphTime=0, ConflictIdSorter.topsortTime=0, ConflictIdSorter.conflictIdCount=49, ConflictIdSorter.conflictIdCycleCount=0, ConflictResolver.totalTime=1, ConflictResolver.conflictItemCount=106, DefaultDependencyCollector.collectTime=2, DefaultDependencyCollector.transformTime=1}
07-Jun-2019 16:07:22 [DEBUG] org.eclipse.tycho:tycho-p2-plugin:jar:1.3.0:
07-Jun-2019 16:07:22 [DEBUG]    org.apache.maven:maven-plugin-api:jar:3.0:compile
07-Jun-2019 16:07:22 [DEBUG]       org.apache.maven:maven-model:jar:3.0:compile
07-Jun-2019 16:07:22 [DEBUG]       org.apache.maven:maven-artifact:jar:3.0:compile
07-Jun-2019 16:07:22 [DEBUG]       org.sonatype.sisu:sisu-inject-plexus:jar:1.4.2:compile
07-Jun-2019 16:07:22 [DEBUG]          org.sonatype.sisu:sisu-inject-bean:jar:1.4.2:compile
07-Jun-2019 16:07:22 [DEBUG]             org.sonatype.sisu:sisu-guice:jar:noaop:2.1.7:compile
07-Jun-2019 16:07:22 [DEBUG]    org.apache.maven:maven-core:jar:3.0:compile
07-Jun-2019 16:07:22 [DEBUG]       org.apache.maven:maven-settings:jar:3.0:compile
07-Jun-2019 16:07:22 [DEBUG]       org.apache.maven:maven-settings-builder:jar:3.0:compile
07-Jun-2019 16:07:22 [DEBUG]       org.apache.maven:maven-repository-metadata:jar:3.0:compile
07-Jun-2019 16:07:22 [DEBUG]       org.apache.maven:maven-model-builder:jar:3.0:compile
07-Jun-2019 16:07:22 [DEBUG]       org.apache.maven:maven-aether-provider:jar:3.0:runtime
07-Jun-2019 16:07:22 [DEBUG]       org.sonatype.aether:aether-impl:jar:1.7:compile
07-Jun-2019 16:07:22 [DEBUG]          org.sonatype.aether:aether-spi:jar:1.7:compile
07-Jun-2019 16:07:22 [DEBUG]       org.sonatype.aether:aether-api:jar:1.7:compile
07-Jun-2019 16:07:22 [DEBUG]       org.sonatype.aether:aether-util:jar:1.7:compile
07-Jun-2019 16:07:22 [DEBUG]       org.codehaus.plexus:plexus-interpolation:jar:1.14:compile
07-Jun-2019 16:07:22 [DEBUG]       org.codehaus.plexus:plexus-utils:jar:3.0.24:compile
07-Jun-2019 16:07:22 [DEBUG]       org.codehaus.plexus:plexus-classworlds:jar:2.2.3:compile
07-Jun-2019 16:07:22 [DEBUG]       org.codehaus.plexus:plexus-component-annotations:jar:1.7.1:compile
07-Jun-2019 16:07:22 [DEBUG]       org.sonatype.plexus:plexus-sec-dispatcher:jar:1.3:compile
07-Jun-2019 16:07:22 [DEBUG]          org.sonatype.plexus:plexus-cipher:jar:1.7:compile
07-Jun-2019 16:07:22 [DEBUG]    org.eclipse.tycho:sisu-equinox-launching:jar:1.3.0:compile
07-Jun-2019 16:07:22 [DEBUG]       org.eclipse.tycho:tycho-core:jar:1.3.0:compile
07-Jun-2019 16:07:22 [DEBUG]          org.codehaus.plexus:plexus-archiver:jar:3.4:compile
07-Jun-2019 16:07:22 [DEBUG]             org.codehaus.plexus:plexus-io:jar:2.7.1:compile
07-Jun-2019 16:07:22 [DEBUG]             commons-io:commons-io:jar:2.5:compile
07-Jun-2019 16:07:22 [DEBUG]             org.apache.commons:commons-compress:jar:1.15:compile
07-Jun-2019 16:07:22 [DEBUG]                org.objenesis:objenesis:jar:2.6:compile
07-Jun-2019 16:07:22 [DEBUG]             org.iq80.snappy:snappy:jar:0.4:compile
07-Jun-2019 16:07:22 [DEBUG]             org.tukaani:xz:jar:1.5:runtime
07-Jun-2019 16:07:22 [DEBUG]          org.eclipse.tycho:org.eclipse.osgi.compatibility.state:jar:1.1.100.v20180131-1413:compile
07-Jun-2019 16:07:22 [DEBUG]          org.eclipse.tycho:tycho-metadata-model:jar:1.3.0:compile
07-Jun-2019 16:07:22 [DEBUG]             de.pdark:decentxml:jar:1.3:compile
07-Jun-2019 16:07:22 [DEBUG]          org.eclipse.tycho:tycho-embedder-api:jar:1.3.0:compile
07-Jun-2019 16:07:22 [DEBUG]             org.eclipse.tycho:org.eclipse.tycho.embedder.shared:jar:1.3.0:compile
07-Jun-2019 16:07:22 [DEBUG]          org.eclipse.tycho:org.eclipse.tycho.core.shared:jar:1.3.0:compile
07-Jun-2019 16:07:22 [DEBUG]          org.apache.maven:maven-compat:jar:3.0:compile
07-Jun-2019 16:07:22 [DEBUG]             org.apache.maven.wagon:wagon-provider-api:jar:1.0-beta-6:compile
07-Jun-2019 16:07:22 [DEBUG]       org.eclipse.tycho:sisu-equinox-api:jar:1.3.0:compile
07-Jun-2019 16:07:22 [DEBUG]       org.apache.commons:commons-exec:jar:1.2:compile
07-Jun-2019 16:07:22 [DEBUG]    org.eclipse.tycho:tycho-p2-facade:jar:1.3.0:compile
07-Jun-2019 16:07:22 [DEBUG]       org.eclipse.tycho:sisu-equinox-embedder:jar:1.3.0:compile
07-Jun-2019 16:07:22 [DEBUG]          org.eclipse.tycho:org.eclipse.osgi:jar:3.13.0.v20180226-1711:compile
07-Jun-2019 16:07:22 [DEBUG]       org.eclipse.tycho:org.eclipse.tycho.p2.resolver.shared:jar:1.3.0:compile
07-Jun-2019 16:07:22 [DEBUG]       org.eclipse.tycho:org.eclipse.tycho.p2.tools.shared:jar:1.3.0:compile
07-Jun-2019 16:07:22 [DEBUG]    org.eclipse.tycho:tycho-artifactcomparator:jar:1.3.0:compile
07-Jun-2019 16:07:22 [DEBUG]       org.ow2.asm:asm-debug-all:jar:5.0.3:compile
07-Jun-2019 16:07:22 [DEBUG] Created new class realm plugin>org.eclipse.tycho:tycho-p2-plugin:1.3.0-687231233
07-Jun-2019 16:07:22 [DEBUG] Importing foreign packages into class realm plugin>org.eclipse.tycho:tycho-p2-plugin:1.3.0-687231233
07-Jun-2019 16:07:22 [DEBUG]   Imported:  < project>org.codehaus.groovy.eclipse:org.codehaus.groovy.eclipse.parent:3.4.0-SNAPSHOT
07-Jun-2019 16:07:22 [DEBUG] Populating class realm plugin>org.eclipse.tycho:tycho-p2-plugin:1.3.0-687231233
07-Jun-2019 16:07:22 [DEBUG]   Included: org.eclipse.tycho:tycho-p2-plugin:jar:1.3.0
07-Jun-2019 16:07:22 [DEBUG]   Included: org.sonatype.sisu:sisu-inject-bean:jar:1.4.2
07-Jun-2019 16:07:22 [DEBUG]   Included: org.sonatype.sisu:sisu-guice:jar:noaop:2.1.7
07-Jun-2019 16:07:22 [DEBUG]   Included: org.sonatype.aether:aether-util:jar:1.7
07-Jun-2019 16:07:22 [DEBUG]   Included: org.codehaus.plexus:plexus-interpolation:jar:1.14
07-Jun-2019 16:07:22 [DEBUG]   Included: org.codehaus.plexus:plexus-utils:jar:3.0.24
07-Jun-2019 16:07:22 [DEBUG]   Included: org.codehaus.plexus:plexus-component-annotations:jar:1.7.1
07-Jun-2019 16:07:22 [DEBUG]   Included: org.sonatype.plexus:plexus-sec-dispatcher:jar:1.3
07-Jun-2019 16:07:22 [DEBUG]   Included: org.sonatype.plexus:plexus-cipher:jar:1.7
07-Jun-2019 16:07:22 [DEBUG]   Included: org.eclipse.tycho:sisu-equinox-launching:jar:1.3.0
07-Jun-2019 16:07:22 [DEBUG]   Included: org.codehaus.plexus:plexus-archiver:jar:3.4
07-Jun-2019 16:07:22 [DEBUG]   Included: org.codehaus.plexus:plexus-io:jar:2.7.1
07-Jun-2019 16:07:22 [DEBUG]   Included: commons-io:commons-io:jar:2.5
07-Jun-2019 16:07:22 [DEBUG]   Included: org.apache.commons:commons-compress:jar:1.15
07-Jun-2019 16:07:22 [DEBUG]   Included: org.objenesis:objenesis:jar:2.6
07-Jun-2019 16:07:22 [DEBUG]   Included: org.iq80.snappy:snappy:jar:0.4
07-Jun-2019 16:07:22 [DEBUG]   Included: org.tukaani:xz:jar:1.5
07-Jun-2019 16:07:22 [DEBUG]   Included: org.eclipse.tycho:org.eclipse.osgi.compatibility.state:jar:1.1.100.v20180131-1413
07-Jun-2019 16:07:22 [DEBUG]   Included: org.apache.commons:commons-exec:jar:1.2
07-Jun-2019 16:07:22 [DEBUG]   Included: org.eclipse.tycho:tycho-artifactcomparator:jar:1.3.0
07-Jun-2019 16:07:22 [DEBUG]   Included: org.ow2.asm:asm-debug-all:jar:5.0.3
07-Jun-2019 16:07:22 [DEBUG] target-platform-configuration for MavenProject: org.codehaus.groovy.eclipse:org.eclipse.jdt.core:3.18.0-SNAPSHOT @ /opt/bamboo-home/xml-data/build-dir/GRECLIPSE-E412-JOB1/jdt-patch/e412/org.eclipse.jdt.core/pom.xml:
07-Jun-2019 16:07:22 <?xml version="1.0" encoding="UTF-8"?>
07-Jun-2019 16:07:22 <configuration>
07-Jun-2019 16:07:22   <environments>
07-Jun-2019 16:07:22     <environment>
07-Jun-2019 16:07:22       <os>linux</os>
07-Jun-2019 16:07:22       <ws>gtk</ws>
07-Jun-2019 16:07:22       <arch>x86_64</arch>
07-Jun-2019 16:07:22     </environment>
07-Jun-2019 16:07:22     <environment>
07-Jun-2019 16:07:22       <os>macosx</os>
07-Jun-2019 16:07:22       <ws>cocoa</ws>
07-Jun-2019 16:07:22       <arch>x86_64</arch>
07-Jun-2019 16:07:22     </environment>
07-Jun-2019 16:07:22     <environment>
07-Jun-2019 16:07:22       <os>win32</os>
07-Jun-2019 16:07:22       <ws>win32</ws>
07-Jun-2019 16:07:22       <arch>x86_64</arch>
07-Jun-2019 16:07:22     </environment>
07-Jun-2019 16:07:22   </environments>
07-Jun-2019 16:07:22 </configuration>
07-Jun-2019 16:07:22 [DEBUG] Dependency collection stats: {ConflictMarker.analyzeTime=0, ConflictMarker.markTime=0, ConflictMarker.nodeCount=147, ConflictIdSorter.graphTime=0, ConflictIdSorter.topsortTime=0, ConflictIdSorter.conflictIdCount=60, ConflictIdSorter.conflictIdCycleCount=0, ConflictResolver.totalTime=1, ConflictResolver.conflictItemCount=103, DefaultDependencyCollector.collectTime=2, DefaultDependencyCollector.transformTime=1}
07-Jun-2019 16:07:22 [DEBUG] org.eclipse.tycho.extras:tycho-custom-bundle-plugin:jar:1.3.0:
07-Jun-2019 16:07:22 [DEBUG]    org.apache.maven:maven-plugin-api:jar:3.0:compile
07-Jun-2019 16:07:22 [DEBUG]       org.apache.maven:maven-model:jar:3.0:provided
07-Jun-2019 16:07:22 [DEBUG]       org.apache.maven:maven-artifact:jar:3.0:compile
07-Jun-2019 16:07:22 [DEBUG]       org.sonatype.sisu:sisu-inject-plexus:jar:1.4.2:compile
07-Jun-2019 16:07:22 [DEBUG]          org.sonatype.sisu:sisu-inject-bean:jar:1.4.2:compile
07-Jun-2019 16:07:22 [DEBUG]             org.sonatype.sisu:sisu-guice:jar:noaop:2.1.7:compile
07-Jun-2019 16:07:22 [DEBUG]    org.apache.maven:maven-core:jar:3.0:compile
07-Jun-2019 16:07:22 [DEBUG]       org.apache.maven:maven-settings:jar:3.0:compile
07-Jun-2019 16:07:22 [DEBUG]       org.apache.maven:maven-settings-builder:jar:3.0:compile
07-Jun-2019 16:07:22 [DEBUG]       org.apache.maven:maven-repository-metadata:jar:3.0:compile
07-Jun-2019 16:07:22 [DEBUG]       org.apache.maven:maven-model-builder:jar:3.0:provided
07-Jun-2019 16:07:22 [DEBUG]       org.apache.maven:maven-aether-provider:jar:3.0:runtime
07-Jun-2019 16:07:22 [DEBUG]       org.sonatype.aether:aether-impl:jar:1.7:compile
07-Jun-2019 16:07:22 [DEBUG]          org.sonatype.aether:aether-spi:jar:1.7:compile
07-Jun-2019 16:07:22 [DEBUG]       org.sonatype.aether:aether-api:jar:1.7:compile
07-Jun-2019 16:07:22 [DEBUG]       org.sonatype.aether:aether-util:jar:1.7:compile
07-Jun-2019 16:07:22 [DEBUG]       org.codehaus.plexus:plexus-interpolation:jar:1.14:compile
07-Jun-2019 16:07:22 [DEBUG]       org.codehaus.plexus:plexus-utils:jar:3.0.24:compile
07-Jun-2019 16:07:22 [DEBUG]       org.codehaus.plexus:plexus-classworlds:jar:2.2.3:compile
07-Jun-2019 16:07:22 [DEBUG]       org.codehaus.plexus:plexus-component-annotations:jar:1.5.5:compile
07-Jun-2019 16:07:22 [DEBUG]       org.sonatype.plexus:plexus-sec-dispatcher:jar:1.3:compile
07-Jun-2019 16:07:22 [DEBUG]          org.sonatype.plexus:plexus-cipher:jar:1.4:compile
07-Jun-2019 16:07:22 [DEBUG]    org.apache.maven:maven-archiver:jar:2.5:compile
07-Jun-2019 16:07:22 [DEBUG]       org.codehaus.plexus:plexus-archiver:jar:3.4:compile
07-Jun-2019 16:07:22 [DEBUG]          org.codehaus.plexus:plexus-io:jar:2.7.1:compile
07-Jun-2019 16:07:22 [DEBUG]          commons-io:commons-io:jar:2.5:compile
07-Jun-2019 16:07:22 [DEBUG]          org.apache.commons:commons-compress:jar:1.15:compile
07-Jun-2019 16:07:22 [DEBUG]             org.objenesis:objenesis:jar:2.6:compile
07-Jun-2019 16:07:22 [DEBUG]          org.iq80.snappy:snappy:jar:0.4:compile
07-Jun-2019 16:07:22 [DEBUG]          org.tukaani:xz:jar:1.5:runtime
07-Jun-2019 16:07:22 [DEBUG]    org.eclipse.tycho:tycho-core:jar:1.3.0:compile
07-Jun-2019 16:07:22 [DEBUG]       org.eclipse.tycho:org.eclipse.osgi.compatibility.state:jar:1.1.100.v20180131-1413:compile
07-Jun-2019 16:07:22 [DEBUG]       org.eclipse.tycho:sisu-equinox-embedder:jar:1.3.0:compile
07-Jun-2019 16:07:22 [DEBUG]          org.eclipse.tycho:org.eclipse.osgi:jar:3.13.0.v20180226-1711:compile
07-Jun-2019 16:07:22 [DEBUG]          org.eclipse.tycho:sisu-equinox-api:jar:1.3.0:compile
07-Jun-2019 16:07:22 [DEBUG]       org.eclipse.tycho:tycho-metadata-model:jar:1.3.0:compile
07-Jun-2019 16:07:22 [DEBUG]          de.pdark:decentxml:jar:1.3:compile
07-Jun-2019 16:07:22 [DEBUG]       org.eclipse.tycho:tycho-embedder-api:jar:1.3.0:compile
07-Jun-2019 16:07:22 [DEBUG]          org.eclipse.tycho:org.eclipse.tycho.embedder.shared:jar:1.3.0:compile
07-Jun-2019 16:07:22 [DEBUG]       org.eclipse.tycho:org.eclipse.tycho.core.shared:jar:1.3.0:compile
07-Jun-2019 16:07:22 [DEBUG]       org.apache.maven:maven-compat:jar:3.0:compile
07-Jun-2019 16:07:22 [DEBUG]          org.apache.maven.wagon:wagon-provider-api:jar:1.0-beta-6:compile
07-Jun-2019 16:07:22 [DEBUG]    org.eclipse.tycho:tycho-p2-facade:jar:1.3.0:compile
07-Jun-2019 16:07:22 [DEBUG]       org.eclipse.tycho:org.eclipse.tycho.p2.resolver.shared:jar:1.3.0:compile
07-Jun-2019 16:07:22 [DEBUG]       org.eclipse.tycho:org.eclipse.tycho.p2.tools.shared:jar:1.3.0:compile
07-Jun-2019 16:07:22 [DEBUG] Created new class realm plugin>org.eclipse.tycho.extras:tycho-custom-bundle-plugin:1.3.0
07-Jun-2019 16:07:22 [DEBUG] Importing foreign packages into class realm plugin>org.eclipse.tycho.extras:tycho-custom-bundle-plugin:1.3.0
07-Jun-2019 16:07:22 [DEBUG]   Imported:  < project>org.codehaus.groovy.eclipse:org.codehaus.groovy.eclipse.parent:3.4.0-SNAPSHOT
07-Jun-2019 16:07:22 [DEBUG] Populating class realm plugin>org.eclipse.tycho.extras:tycho-custom-bundle-plugin:1.3.0
07-Jun-2019 16:07:22 [DEBUG]   Included: org.eclipse.tycho.extras:tycho-custom-bundle-plugin:jar:1.3.0
07-Jun-2019 16:07:22 [DEBUG]   Included: org.sonatype.sisu:sisu-inject-bean:jar:1.4.2
07-Jun-2019 16:07:22 [DEBUG]   Included: org.sonatype.sisu:sisu-guice:jar:noaop:2.1.7
07-Jun-2019 16:07:22 [DEBUG]   Included: org.sonatype.aether:aether-util:jar:1.7
07-Jun-2019 16:07:22 [DEBUG]   Included: org.codehaus.plexus:plexus-interpolation:jar:1.14
07-Jun-2019 16:07:22 [DEBUG]   Included: org.codehaus.plexus:plexus-utils:jar:3.0.24
07-Jun-2019 16:07:22 [DEBUG]   Included: org.codehaus.plexus:plexus-component-annotations:jar:1.5.5
07-Jun-2019 16:07:22 [DEBUG]   Included: org.sonatype.plexus:plexus-sec-dispatcher:jar:1.3
07-Jun-2019 16:07:22 [DEBUG]   Included: org.sonatype.plexus:plexus-cipher:jar:1.4
07-Jun-2019 16:07:22 [DEBUG]   Included: org.apache.maven:maven-archiver:jar:2.5
07-Jun-2019 16:07:22 [DEBUG]   Included: org.codehaus.plexus:plexus-archiver:jar:3.4
07-Jun-2019 16:07:22 [DEBUG]   Included: org.codehaus.plexus:plexus-io:jar:2.7.1
07-Jun-2019 16:07:22 [DEBUG]   Included: commons-io:commons-io:jar:2.5
07-Jun-2019 16:07:22 [DEBUG]   Included: org.apache.commons:commons-compress:jar:1.15
07-Jun-2019 16:07:22 [DEBUG]   Included: org.objenesis:objenesis:jar:2.6
07-Jun-2019 16:07:22 [DEBUG]   Included: org.iq80.snappy:snappy:jar:0.4
07-Jun-2019 16:07:22 [DEBUG]   Included: org.tukaani:xz:jar:1.5
07-Jun-2019 16:07:22 [DEBUG]   Included: org.eclipse.tycho:org.eclipse.osgi.compatibility.state:jar:1.1.100.v20180131-1413
07-Jun-2019 16:07:22 [DEBUG] target-platform-configuration for MavenProject: org.eclipse.jdt:org.eclipse.jdt.core.tests.builder:3.10.600-SNAPSHOT @ /opt/bamboo-home/xml-data/build-dir/GRECLIPSE-E412-JOB1/jdt-patch/e412/org.eclipse.jdt.core.tests.builder/pom.xml:
07-Jun-2019 16:07:22 <?xml version="1.0" encoding="UTF-8"?>
07-Jun-2019 16:07:22 <configuration>
07-Jun-2019 16:07:22   <filters>
07-Jun-2019 16:07:22     <filter>
07-Jun-2019 16:07:22       <type>osgi-bundle</type>
07-Jun-2019 16:07:22       <id>org.eclipse.jdt.core.compiler.batch</id>
07-Jun-2019 16:07:22       <removeAll/>
07-Jun-2019 16:07:22     </filter>
07-Jun-2019 16:07:22   </filters>
07-Jun-2019 16:07:22   <environments>
07-Jun-2019 16:07:22     <environment>
07-Jun-2019 16:07:22       <os>linux</os>
07-Jun-2019 16:07:22       <ws>gtk</ws>
07-Jun-2019 16:07:22       <arch>x86_64</arch>
07-Jun-2019 16:07:22     </environment>
07-Jun-2019 16:07:22     <environment>
07-Jun-2019 16:07:22       <os>macosx</os>
07-Jun-2019 16:07:22       <ws>cocoa</ws>
07-Jun-2019 16:07:22       <arch>x86_64</arch>
07-Jun-2019 16:07:22     </environment>
07-Jun-2019 16:07:22     <environment>
07-Jun-2019 16:07:22       <os>win32</os>
07-Jun-2019 16:07:22       <ws>win32</ws>
07-Jun-2019 16:07:22       <arch>x86_64</arch>
07-Jun-2019 16:07:22     </environment>
07-Jun-2019 16:07:22   </environments>
07-Jun-2019 16:07:22 </configuration>
07-Jun-2019 16:07:22 [DEBUG] target-platform-configuration for MavenProject: org.eclipse.jdt:org.eclipse.jdt.core.tests.compiler:3.12.900-SNAPSHOT @ /opt/bamboo-home/xml-data/build-dir/GRECLIPSE-E412-JOB1/jdt-patch/e412/org.eclipse.jdt.core.tests.compiler/pom.xml:
07-Jun-2019 16:07:22 <?xml version="1.0" encoding="UTF-8"?>
07-Jun-2019 16:07:22 <configuration>
07-Jun-2019 16:07:22   <filters>
07-Jun-2019 16:07:22     <filter>
07-Jun-2019 16:07:22       <type>osgi-bundle</type>
07-Jun-2019 16:07:22       <id>org.eclipse.jdt.core.compiler.batch</id>
07-Jun-2019 16:07:22       <removeAll/>
07-Jun-2019 16:07:22     </filter>
07-Jun-2019 16:07:22   </filters>
07-Jun-2019 16:07:22   <environments>
07-Jun-2019 16:07:22     <environment>
07-Jun-2019 16:07:22       <os>linux</os>
07-Jun-2019 16:07:22       <ws>gtk</ws>
07-Jun-2019 16:07:22       <arch>x86_64</arch>
07-Jun-2019 16:07:22     </environment>
07-Jun-2019 16:07:22     <environment>
07-Jun-2019 16:07:22       <os>macosx</os>
07-Jun-2019 16:07:22       <ws>cocoa</ws>
07-Jun-2019 16:07:22       <arch>x86_64</arch>
07-Jun-2019 16:07:22     </environment>
07-Jun-2019 16:07:22     <environment>
07-Jun-2019 16:07:22       <os>win32</os>
07-Jun-2019 16:07:22       <ws>win32</ws>
07-Jun-2019 16:07:22       <arch>x86_64</arch>
07-Jun-2019 16:07:22     </environment>
07-Jun-2019 16:07:22   </environments>
07-Jun-2019 16:07:22 </configuration>
07-Jun-2019 16:07:22 [DEBUG] target-platform-configuration for MavenProject: org.codehaus.groovy.eclipse:org.codehaus.groovy.jdt.patch:3.4.0-SNAPSHOT @ /opt/bamboo-home/xml-data/build-dir/GRECLIPSE-E412-JOB1/jdt-patch/e412/Feature-org.codehaus.groovy.jdt.patch/pom.xml:
07-Jun-2019 16:07:22 <?xml version="1.0" encoding="UTF-8"?>
07-Jun-2019 16:07:22 <configuration>
07-Jun-2019 16:07:22   <environments>
07-Jun-2019 16:07:22     <environment>
07-Jun-2019 16:07:22       <os>linux</os>
07-Jun-2019 16:07:22       <ws>gtk</ws>
07-Jun-2019 16:07:22       <arch>x86_64</arch>
07-Jun-2019 16:07:22     </environment>
07-Jun-2019 16:07:22     <environment>
07-Jun-2019 16:07:22       <os>macosx</os>
07-Jun-2019 16:07:22       <ws>cocoa</ws>
07-Jun-2019 16:07:22       <arch>x86_64</arch>
07-Jun-2019 16:07:22     </environment>
07-Jun-2019 16:07:22     <environment>
07-Jun-2019 16:07:22       <os>win32</os>
07-Jun-2019 16:07:22       <ws>win32</ws>
07-Jun-2019 16:07:22       <arch>x86_64</arch>
07-Jun-2019 16:07:22     </environment>
07-Jun-2019 16:07:22   </environments>
07-Jun-2019 16:07:22 </configuration>
07-Jun-2019 16:07:22 [INFO] Computing target platform for MavenProject: org.codehaus.groovy.eclipse:org.codehaus.groovy:2.4.17-SNAPSHOT @ /opt/bamboo-home/xml-data/build-dir/GRECLIPSE-E412-JOB1/base/org.codehaus.groovy24/pom.xml
07-Jun-2019 16:07:22 [DEBUG] Added p2 repository 2019-06 (https://download.eclipse.org/releases/2019-06)
07-Jun-2019 16:07:22 [DEBUG] Added p2 repository eclipse (https://download.eclipse.org/eclipse/updates/4.12milestones)
07-Jun-2019 16:07:22 [DEBUG] Using execution environment 'JavaSE-1.8' configured in Bundle-RequiredExecutionEnvironment (first entry)
07-Jun-2019 16:07:22 [DEBUG] Registered artifact repository org.eclipse.tycho.repository.registry.facade.RepositoryBlackboardKey(uri=file:/resolution-context-artifacts@%252Fopt%252Fbamboo-home%252Fxml-data%252Fbuild-dir%252FGRECLIPSE-E412-JOB1%252Fbase%252Forg.codehaus.groovy24)
07-Jun-2019 16:07:23 [INFO] Fetching p2.index from https://download.eclipse.org/releases/2019-06/
07-Jun-2019 16:07:23 [INFO] Fetching p2.index from https://download.eclipse.org/releases/2019-06/
07-Jun-2019 16:07:23 [INFO] Adding repository https://download.eclipse.org/releases/2019-06
07-Jun-2019 16:07:24 [INFO] Fetching compositeContent.jar from https://download.eclipse.org/releases/2019-06/ (498B)
07-Jun-2019 16:07:24 [INFO] Fetching compositeContent.jar from https://download.eclipse.org/releases/2019-06/ (498B)
07-Jun-2019 16:07:24 Jun 07, 2019 4:07:24 PM org.apache.http.impl.client.DefaultRequestDirector tryExecute
07-Jun-2019 16:07:24 INFO: I/O exception (java.net.SocketException) caught when processing request to {}->http://download.eclipse.org:80: Connection reset
07-Jun-2019 16:07:24 Jun 07, 2019 4:07:24 PM org.apache.http.impl.client.DefaultRequestDirector tryExecute
07-Jun-2019 16:07:24 INFO: Retrying request to {}->http://download.eclipse.org:80
07-Jun-2019 16:07:24 Jun 07, 2019 4:07:24 PM org.apache.http.impl.client.DefaultRequestDirector tryExecute
07-Jun-2019 16:07:24 INFO: I/O exception (java.net.SocketException) caught when processing request to {}->http://download.eclipse.org:80: Connection reset
07-Jun-2019 16:07:24 Jun 07, 2019 4:07:24 PM org.apache.http.impl.client.DefaultRequestDirector tryExecute
07-Jun-2019 16:07:24 INFO: Retrying request to {}->http://download.eclipse.org:80
07-Jun-2019 16:07:25 Jun 07, 2019 4:07:25 PM org.apache.http.impl.client.DefaultRequestDirector tryExecute
07-Jun-2019 16:07:25 INFO: I/O exception (java.net.SocketException) caught when processing request to {}->http://download.eclipse.org:80: Connection reset
07-Jun-2019 16:07:25 Jun 07, 2019 4:07:25 PM org.apache.http.impl.client.DefaultRequestDirector tryExecute
07-Jun-2019 16:07:25 INFO: Retrying request to {}->http://download.eclipse.org:80
07-Jun-2019 16:07:25 !SESSION 2019-06-07 16:07:25.240 -----------------------------------------------
07-Jun-2019 16:07:25 eclipse.buildId=unknown
07-Jun-2019 16:07:25 java.version=1.8.0_212
07-Jun-2019 16:07:25 java.vendor=AdoptOpenJDK
07-Jun-2019 16:07:25 BootLoader constants: OS=linux, ARCH=x86_64, WS=gtk, NL=en_US
07-Jun-2019 16:07:25 Framework arguments:  -eclipse.keyring /tmp/GRECLIPSE-E412-JOB1/tycho115471299661382444secure_storage
07-Jun-2019 16:07:25 Command-line arguments:  -eclipse.keyring /tmp/GRECLIPSE-E412-JOB1/tycho115471299661382444secure_storage -debug -consoleLog
07-Jun-2019 16:07:25
07-Jun-2019 16:07:25 !ENTRY org.eclipse.equinox.p2.transport.ecf 2 0 2019-06-07 16:07:25.241
07-Jun-2019 16:07:25 !MESSAGE Connection to http://download.eclipse.org/technology/epp/packages/2019-06/p2.index failed on Connection reset. Retry attempt 0 started
07-Jun-2019 16:07:25 !STACK 0
07-Jun-2019 16:07:25 java.net.SocketException: Connection reset
07-Jun-2019 16:07:25         at java.net.SocketInputStream.read(SocketInputStream.java:210)
07-Jun-2019 16:07:25         at java.net.SocketInputStream.read(SocketInputStream.java:141)
07-Jun-2019 16:07:25         at org.apache.http.impl.io.AbstractSessionInputBuffer.fillBuffer(AbstractSessionInputBuffer.java:158)
07-Jun-2019 16:07:25         at org.apache.http.impl.io.SocketInputBuffer.fillBuffer(SocketInputBuffer.java:82)
07-Jun-2019 16:07:25         at org.apache.http.impl.io.AbstractSessionInputBuffer.readLine(AbstractSessionInputBuffer.java:271)
07-Jun-2019 16:07:25         at org.apache.http.impl.conn.DefaultHttpResponseParser.parseHead(DefaultHttpResponseParser.java:140)
07-Jun-2019 16:07:25         at org.apache.http.impl.conn.DefaultHttpResponseParser.parseHead(DefaultHttpResponseParser.java:57)
07-Jun-2019 16:07:25         at org.apache.http.impl.io.AbstractMessageParser.parse(AbstractMessageParser.java:259)
07-Jun-2019 16:07:25         at org.apache.http.impl.AbstractHttpClientConnection.receiveResponseHeader(AbstractHttpClientConnection.java:281)
07-Jun-2019 16:07:25         at org.apache.http.impl.conn.DefaultClientConnection.receiveResponseHeader(DefaultClientConnection.java:259)
07-Jun-2019 16:07:25         at org.apache.http.impl.conn.AbstractClientConnAdapter.receiveResponseHeader(AbstractClientConnAdapter.java:232)
07-Jun-2019 16:07:25         at org.apache.http.protocol.HttpRequestExecutor.doReceiveResponse(HttpRequestExecutor.java:273)
07-Jun-2019 16:07:25         at org.apache.http.protocol.HttpRequestExecutor.execute(HttpRequestExecutor.java:125)
07-Jun-2019 16:07:25         at org.apache.http.impl.client.DefaultRequestDirector.tryExecute(DefaultRequestDirector.java:686)
07-Jun-2019 16:07:25         at org.apache.http.impl.client.DefaultRequestDirector.execute(DefaultRequestDirector.java:488)
07-Jun-2019 16:07:25         at org.apache.http.impl.client.AbstractHttpClient.doExecute(AbstractHttpClient.java:884)
07-Jun-2019 16:07:25         at org.apache.http.impl.client.CloseableHttpClient.execute(CloseableHttpClient.java:82)
07-Jun-2019 16:07:25         at org.eclipse.ecf.provider.filetransfer.httpclient4.HttpClientRetrieveFileTransfer.performConnect(HttpClientRetrieveFileTransfer.java:1084)
07-Jun-2019 16:07:25         at org.eclipse.ecf.provider.filetransfer.httpclient4.HttpClientRetrieveFileTransfer.access$0(HttpClientRetrieveFileTransfer.java:1075)
07-Jun-2019 16:07:25         at org.eclipse.ecf.provider.filetransfer.httpclient4.HttpClientRetrieveFileTransfer$1.performFileTransfer(HttpClientRetrieveFileTransfer.java:1071)
07-Jun-2019 16:07:25         at org.eclipse.ecf.filetransfer.FileTransferJob.run(FileTransferJob.java:74)
07-Jun-2019 16:07:25         at org.eclipse.core.internal.jobs.Worker.run(Worker.java:60)
07-Jun-2019 16:07:25 Jun 07, 2019 4:07:25 PM org.apache.http.impl.client.DefaultRequestDirector tryExecute
07-Jun-2019 16:07:25 INFO: I/O exception (java.net.SocketException) caught when processing request to {}->http://download.eclipse.org:80: Connection reset
07-Jun-2019 16:07:25 Jun 07, 2019 4:07:25 PM org.apache.http.impl.client.DefaultRequestDirector tryExecute
07-Jun-2019 16:07:25 INFO: Retrying request to {}->http://download.eclipse.org:80
07-Jun-2019 16:07:25 Jun 07, 2019 4:07:25 PM org.apache.http.impl.client.DefaultRequestDirector tryExecute
07-Jun-2019 16:07:25 INFO: I/O exception (java.net.SocketException) caught when processing request to {}->http://download.eclipse.org:80: Connection reset
07-Jun-2019 16:07:25 Jun 07, 2019 4:07:25 PM org.apache.http.impl.client.DefaultRequestDirector tryExecute
07-Jun-2019 16:07:25 INFO: Retrying request to {}->http://download.eclipse.org:80
07-Jun-2019 16:07:25 Jun 07, 2019 4:07:25 PM org.apache.http.impl.client.DefaultRequestDirector tryExecute
07-Jun-2019 16:07:25 INFO: I/O exception (java.net.SocketException) caught when processing request to {}->http://download.eclipse.org:80: Connection reset
07-Jun-2019 16:07:25 Jun 07, 2019 4:07:25 PM org.apache.http.impl.client.DefaultRequestDirector tryExecute
07-Jun-2019 16:07:25 INFO: Retrying request to {}->http://download.eclipse.org:80
07-Jun-2019 16:07:26 Jun 07, 2019 4:07:26 PM org.apache.http.impl.client.DefaultRequestDirector tryExecute
07-Jun-2019 16:07:26 INFO: I/O exception (java.net.SocketException) caught when processing request to {}->http://download.eclipse.org:80: Connection reset
07-Jun-2019 16:07:26 Jun 07, 2019 4:07:26 PM org.apache.http.impl.client.DefaultRequestDirector tryExecute
07-Jun-2019 16:07:26 INFO: Retrying request to {}->http://download.eclipse.org:80
07-Jun-2019 16:07:26 Jun 07, 2019 4:07:26 PM org.apache.http.impl.client.DefaultRequestDirector tryExecute
07-Jun-2019 16:07:26 INFO: I/O exception (java.net.SocketException) caught when processing request to {}->http://download.eclipse.org:80: Connection reset
07-Jun-2019 16:07:26 Jun 07, 2019 4:07:26 PM org.apache.http.impl.client.DefaultRequestDirector tryExecute
07-Jun-2019 16:07:26 INFO: Retrying request to {}->http://download.eclipse.org:80
07-Jun-2019 16:07:26 Jun 07, 2019 4:07:26 PM org.apache.http.impl.client.DefaultRequestDirector tryExecute
07-Jun-2019 16:07:26 INFO: I/O exception (java.net.SocketException) caught when processing request to {}->http://download.eclipse.org:80: Connection reset
07-Jun-2019 16:07:26 Jun 07, 2019 4:07:26 PM org.apache.http.impl.client.DefaultRequestDirector tryExecute
07-Jun-2019 16:07:26 INFO: Retrying request to {}->http://download.eclipse.org:80
07-Jun-2019 16:07:27 Jun 07, 2019 4:07:27 PM org.apache.http.impl.client.DefaultRequestDirector tryExecute
07-Jun-2019 16:07:27 INFO: I/O exception (java.net.SocketException) caught when processing request to {}->http://download.eclipse.org:80: Connection reset
07-Jun-2019 16:07:27 Jun 07, 2019 4:07:27 PM org.apache.http.impl.client.DefaultRequestDirector tryExecute
07-Jun-2019 16:07:27 INFO: Retrying request to {}->http://download.eclipse.org:80
07-Jun-2019 16:07:27 Jun 07, 2019 4:07:27 PM org.apache.http.impl.client.DefaultRequestDirector tryExecute
07-Jun-2019 16:07:27 INFO: I/O exception (java.net.SocketException) caught when processing request to {}->http://download.eclipse.org:80: Connection reset
07-Jun-2019 16:07:27 Jun 07, 2019 4:07:27 PM org.apache.http.impl.client.DefaultRequestDirector tryExecute
07-Jun-2019 16:07:27 INFO: Retrying request to {}->http://download.eclipse.org:80
07-Jun-2019 16:07:28 Jun 07, 2019 4:07:28 PM org.apache.http.impl.client.DefaultRequestDirector tryExecute
07-Jun-2019 16:07:28 INFO: I/O exception (java.net.SocketException) caught when processing request to {}->http://download.eclipse.org:80: Connection reset
07-Jun-2019 16:07:28 Jun 07, 2019 4:07:28 PM org.apache.http.impl.client.DefaultRequestDirector tryExecute
07-Jun-2019 16:07:28 INFO: Retrying request to {}->http://download.eclipse.org:80
07-Jun-2019 16:07:28
07-Jun-2019 16:07:28 !ENTRY org.eclipse.equinox.p2.core 4 0 2019-06-07 16:07:28.811
07-Jun-2019 16:07:28 !MESSAGE Provisioning exception
07-Jun-2019 16:07:28 !STACK 1
07-Jun-2019 16:07:28 org.eclipse.equinox.p2.core.ProvisionException: Unable to read repository at http://download.eclipse.org/technology/epp/packages/2019-06/content.xml.
07-Jun-2019 16:07:28         at org.eclipse.equinox.internal.p2.repository.CacheManager.createCache(CacheManager.java:243)
07-Jun-2019 16:07:28         at org.eclipse.tycho.p2.remote.RemoteRepositoryCacheManager.createCache(RemoteRepositoryCacheManager.java:67)
07-Jun-2019 16:07:28         at org.eclipse.equinox.internal.p2.metadata.repository.SimpleMetadataRepositoryFactory.getLocalFile(SimpleMetadataRepositoryFactory.java:66)
07-Jun-2019 16:07:28         at org.eclipse.equinox.internal.p2.metadata.repository.SimpleMetadataRepositoryFactory.load(SimpleMetadataRepositoryFactory.java:86)
07-Jun-2019 16:07:28         at org.eclipse.equinox.internal.p2.metadata.repository.MetadataRepositoryManager.factoryLoad(MetadataRepositoryManager.java:60)
07-Jun-2019 16:07:28         at org.eclipse.equinox.internal.p2.repository.helpers.AbstractRepositoryManager.loadRepository(AbstractRepositoryManager.java:767)
07-Jun-2019 16:07:28         at org.eclipse.equinox.internal.p2.repository.helpers.AbstractRepositoryManager.loadRepository(AbstractRepositoryManager.java:668)
07-Jun-2019 16:07:28         at org.eclipse.equinox.internal.p2.metadata.repository.MetadataRepositoryManager.loadRepository(MetadataRepositoryManager.java:107)
07-Jun-2019 16:07:28         at org.eclipse.tycho.p2.remote.RemoteMetadataRepositoryManager.loadRepository(RemoteMetadataRepositoryManager.java:61)
07-Jun-2019 16:07:28         at org.eclipse.tycho.p2.remote.RemoteMetadataRepositoryManager.loadRepository(RemoteMetadataRepositoryManager.java:53)
07-Jun-2019 16:07:28         at org.eclipse.equinox.internal.p2.metadata.repository.CompositeMetadataRepository.addChild(CompositeMetadataRepository.java:165)
07-Jun-2019 16:07:28         at org.eclipse.equinox.internal.p2.metadata.repository.CompositeMetadataRepository.<init>(CompositeMetadataRepository.java:107)
07-Jun-2019 16:07:28         at org.eclipse.equinox.internal.p2.metadata.repository.CompositeMetadataRepositoryFactory.load(CompositeMetadataRepositoryFactory.java:121)
07-Jun-2019 16:07:28         at org.eclipse.equinox.internal.p2.metadata.repository.MetadataRepositoryManager.factoryLoad(MetadataRepositoryManager.java:60)
07-Jun-2019 16:07:28         at org.eclipse.equinox.internal.p2.repository.helpers.AbstractRepositoryManager.loadRepository(AbstractRepositoryManager.java:767)
07-Jun-2019 16:07:28         at org.eclipse.equinox.internal.p2.repository.helpers.AbstractRepositoryManager.loadRepository(AbstractRepositoryManager.java:668)
07-Jun-2019 16:07:28         at org.eclipse.equinox.internal.p2.metadata.repository.MetadataRepositoryManager.loadRepository(MetadataRepositoryManager.java:107)
07-Jun-2019 16:07:28         at org.eclipse.tycho.p2.remote.RemoteMetadataRepositoryManager.loadRepository(RemoteMetadataRepositoryManager.java:61)
07-Jun-2019 16:07:28         at org.eclipse.tycho.p2.remote.RemoteMetadataRepositoryManager.loadRepository(RemoteMetadataRepositoryManager.java:53)
07-Jun-2019 16:07:28         at org.eclipse.tycho.p2.target.TargetPlatformFactoryImpl.loadMetadataRepository(TargetPlatformFactoryImpl.java:298)
07-Jun-2019 16:07:28         at org.eclipse.tycho.p2.target.TargetPlatformFactoryImpl.gatherExternalInstallableUnits(TargetPlatformFactoryImpl.java:270)
07-Jun-2019 16:07:28         at org.eclipse.tycho.p2.target.TargetPlatformFactoryImpl.createTargetPlatform(TargetPlatformFactoryImpl.java:176)
07-Jun-2019 16:07:28         at org.eclipse.tycho.p2.target.TargetPlatformFactoryImpl.createTargetPlatform(TargetPlatformFactoryImpl.java:128)
07-Jun-2019 16:07:28         at org.eclipse.tycho.p2.target.TargetPlatformFactoryImpl.createTargetPlatform(TargetPlatformFactoryImpl.java:1)
07-Jun-2019 16:07:28         at org.eclipse.tycho.p2.manager.ReactorRepositoryManagerImpl.computePreliminaryTargetPlatform(ReactorRepositoryManagerImpl.java:84)
07-Jun-2019 16:07:28         at org.eclipse.tycho.p2.resolver.P2DependencyResolver.computePreliminaryTargetPlatform(P2DependencyResolver.java:224)
07-Jun-2019 16:07:28         at org.eclipse.tycho.core.resolver.DefaultTychoResolver.resolveProject(DefaultTychoResolver.java:109)
07-Jun-2019 16:07:28         at org.eclipse.tycho.core.maven.TychoMavenLifecycleParticipant.afterProjectsRead(TychoMavenLifecycleParticipant.java:95)
07-Jun-2019 16:07:28         at org.apache.maven.DefaultMaven.doExecute(DefaultMaven.java:266)
07-Jun-2019 16:07:28         at org.apache.maven.DefaultMaven.doExecute(DefaultMaven.java:193)
07-Jun-2019 16:07:28         at org.apache.maven.DefaultMaven.execute(DefaultMaven.java:106)
07-Jun-2019 16:07:28         at org.apache.maven.cli.MavenCli.execute(MavenCli.java:863)
07-Jun-2019 16:07:28         at org.apache.maven.cli.MavenCli.doMain(MavenCli.java:288)
07-Jun-2019 16:07:28         at org.apache.maven.cli.MavenCli.main(MavenCli.java:199)
07-Jun-2019 16:07:28         at sun.reflect.NativeMethodAccessorImpl.invoke0(Native Method)
07-Jun-2019 16:07:28         at sun.reflect.NativeMethodAccessorImpl.invoke(NativeMethodAccessorImpl.java:62)
07-Jun-2019 16:07:28         at sun.reflect.DelegatingMethodAccessorImpl.invoke(DelegatingMethodAccessorImpl.java:43)
07-Jun-2019 16:07:28         at java.lang.reflect.Method.invoke(Method.java:498)
07-Jun-2019 16:07:28         at org.codehaus.plexus.classworlds.launcher.Launcher.launchEnhanced(Launcher.java:289)
07-Jun-2019 16:07:28         at org.codehaus.plexus.classworlds.launcher.Launcher.launch(Launcher.java:229)
07-Jun-2019 16:07:28         at org.codehaus.plexus.classworlds.launcher.Launcher.mainWithExitCode(Launcher.java:415)
07-Jun-2019 16:07:28         at org.codehaus.plexus.classworlds.launcher.Launcher.main(Launcher.java:356)
07-Jun-2019 16:07:28 Caused by: java.net.SocketException: Connection reset
07-Jun-2019 16:07:28         at java.net.SocketInputStream.read(SocketInputStream.java:210)
07-Jun-2019 16:07:28         at java.net.SocketInputStream.read(SocketInputStream.java:141)
07-Jun-2019 16:07:28         at org.apache.http.impl.io.AbstractSessionInputBuffer.fillBuffer(AbstractSessionInputBuffer.java:158)
07-Jun-2019 16:07:28         at org.apache.http.impl.io.SocketInputBuffer.fillBuffer(SocketInputBuffer.java:82)
07-Jun-2019 16:07:28         at org.apache.http.impl.io.AbstractSessionInputBuffer.readLine(AbstractSessionInputBuffer.java:271)
07-Jun-2019 16:07:28         at org.apache.http.impl.conn.DefaultHttpResponseParser.parseHead(DefaultHttpResponseParser.java:140)
07-Jun-2019 16:07:28         at org.apache.http.impl.conn.DefaultHttpResponseParser.parseHead(DefaultHttpResponseParser.java:57)
07-Jun-2019 16:07:28         at org.apache.http.impl.io.AbstractMessageParser.parse(AbstractMessageParser.java:259)
07-Jun-2019 16:07:28         at org.apache.http.impl.AbstractHttpClientConnection.receiveResponseHeader(AbstractHttpClientConnection.java:281)
07-Jun-2019 16:07:28         at org.apache.http.impl.conn.DefaultClientConnection.receiveResponseHeader(DefaultClientConnection.java:259)
07-Jun-2019 16:07:28         at org.apache.http.impl.conn.ManagedClientConnectionImpl.receiveResponseHeader(ManagedClientConnectionImpl.java:209)
07-Jun-2019 16:07:28         at org.apache.http.protocol.HttpRequestExecutor.doReceiveResponse(HttpRequestExecutor.java:273)
07-Jun-2019 16:07:28         at org.apache.http.protocol.HttpRequestExecutor.execute(HttpRequestExecutor.java:125)
07-Jun-2019 16:07:28         at org.apache.http.impl.client.DefaultRequestDirector.tryExecute(DefaultRequestDirector.java:686)
07-Jun-2019 16:07:28         at org.apache.http.impl.client.DefaultRequestDirector.execute(DefaultRequestDirector.java:488)
07-Jun-2019 16:07:28         at org.apache.http.impl.client.AbstractHttpClient.doExecute(AbstractHttpClient.java:884)
07-Jun-2019 16:07:28         at org.apache.http.impl.client.CloseableHttpClient.execute(CloseableHttpClient.java:82)
07-Jun-2019 16:07:28         at org.eclipse.ecf.provider.filetransfer.httpclient4.HttpClientFileSystemBrowser.runRequest(HttpClientFileSystemBrowser.java:263)
07-Jun-2019 16:07:28         at org.eclipse.ecf.provider.filetransfer.browse.AbstractFileSystemBrowser$DirectoryJob.run(AbstractFileSystemBrowser.java:69)
07-Jun-2019 16:07:28         at org.eclipse.core.internal.jobs.Worker.run(Worker.java:60)
07-Jun-2019 16:07:28 !SUBENTRY 1 org.eclipse.equinox.p2.transport.ecf 4 1002 2019-06-07 16:07:28.812
07-Jun-2019 16:07:28 !MESSAGE Unable to read repository at http://download.eclipse.org/technology/epp/packages/2019-06/content.xml.
07-Jun-2019 16:07:28 !STACK 0
07-Jun-2019 16:07:28 java.net.SocketException: Connection reset
07-Jun-2019 16:07:28         at java.net.SocketInputStream.read(SocketInputStream.java:210)
07-Jun-2019 16:07:28         at java.net.SocketInputStream.read(SocketInputStream.java:141)
07-Jun-2019 16:07:28         at org.apache.http.impl.io.AbstractSessionInputBuffer.fillBuffer(AbstractSessionInputBuffer.java:158)
07-Jun-2019 16:07:28         at org.apache.http.impl.io.SocketInputBuffer.fillBuffer(SocketInputBuffer.java:82)
07-Jun-2019 16:07:28         at org.apache.http.impl.io.AbstractSessionInputBuffer.readLine(AbstractSessionInputBuffer.java:271)
07-Jun-2019 16:07:28         at org.apache.http.impl.conn.DefaultHttpResponseParser.parseHead(DefaultHttpResponseParser.java:140)
07-Jun-2019 16:07:28         at org.apache.http.impl.conn.DefaultHttpResponseParser.parseHead(DefaultHttpResponseParser.java:57)
07-Jun-2019 16:07:28         at org.apache.http.impl.io.AbstractMessageParser.parse(AbstractMessageParser.java:259)
07-Jun-2019 16:07:28         at org.apache.http.impl.AbstractHttpClientConnection.receiveResponseHeader(AbstractHttpClientConnection.java:281)
07-Jun-2019 16:07:28         at org.apache.http.impl.conn.DefaultClientConnection.receiveResponseHeader(DefaultClientConnection.java:259)
07-Jun-2019 16:07:28         at org.apache.http.impl.conn.ManagedClientConnectionImpl.receiveResponseHeader(ManagedClientConnectionImpl.java:209)
07-Jun-2019 16:07:28         at org.apache.http.protocol.HttpRequestExecutor.doReceiveResponse(HttpRequestExecutor.java:273)
07-Jun-2019 16:07:28         at org.apache.http.protocol.HttpRequestExecutor.execute(HttpRequestExecutor.java:125)
07-Jun-2019 16:07:28         at org.apache.http.impl.client.DefaultRequestDirector.tryExecute(DefaultRequestDirector.java:686)
07-Jun-2019 16:07:28         at org.apache.http.impl.client.DefaultRequestDirector.execute(DefaultRequestDirector.java:488)
07-Jun-2019 16:07:28         at org.apache.http.impl.client.AbstractHttpClient.doExecute(AbstractHttpClient.java:884)
07-Jun-2019 16:07:28         at org.apache.http.impl.client.CloseableHttpClient.execute(CloseableHttpClient.java:82)
07-Jun-2019 16:07:28         at org.eclipse.ecf.provider.filetransfer.httpclient4.HttpClientFileSystemBrowser.runRequest(HttpClientFileSystemBrowser.java:263)
07-Jun-2019 16:07:28         at org.eclipse.ecf.provider.filetransfer.browse.AbstractFileSystemBrowser$DirectoryJob.run(AbstractFileSystemBrowser.java:69)
07-Jun-2019 16:07:28         at org.eclipse.core.internal.jobs.Worker.run(Worker.java:60)
07-Jun-2019 16:07:28 [ERROR] Internal error: java.lang.RuntimeException: Failed to load p2 repository with ID '2019-06' from location https://download.eclipse.org/releases/2019-06: Unable to read repository at https://download.eclipse.org/releases/2019-06. Unable to read repository at http://download.eclipse.org/technology/epp/packages/2019-06/content.xml. Connection reset -> [Help 1]
07-Jun-2019 16:07:28 org.apache.maven.InternalErrorException: Internal error: java.lang.RuntimeException: Failed to load p2 repository with ID '2019-06' from location https://download.eclipse.org/releases/2019-06
07-Jun-2019 16:07:28         at org.apache.maven.DefaultMaven.execute(DefaultMaven.java:121)
07-Jun-2019 16:07:28         at org.apache.maven.cli.MavenCli.execute(MavenCli.java:863)
07-Jun-2019 16:07:28         at org.apache.maven.cli.MavenCli.doMain(MavenCli.java:288)
07-Jun-2019 16:07:28         at org.apache.maven.cli.MavenCli.main(MavenCli.java:199)
07-Jun-2019 16:07:28         at sun.reflect.NativeMethodAccessorImpl.invoke0(Native Method)
07-Jun-2019 16:07:28         at sun.reflect.NativeMethodAccessorImpl.invoke(NativeMethodAccessorImpl.java:62)
07-Jun-2019 16:07:28         at sun.reflect.DelegatingMethodAccessorImpl.invoke(DelegatingMethodAccessorImpl.java:43)
07-Jun-2019 16:07:28         at java.lang.reflect.Method.invoke(Method.java:498)
07-Jun-2019 16:07:28         at org.codehaus.plexus.classworlds.launcher.Launcher.launchEnhanced(Launcher.java:289)
07-Jun-2019 16:07:28         at org.codehaus.plexus.classworlds.launcher.Launcher.launch(Launcher.java:229)
07-Jun-2019 16:07:28         at org.codehaus.plexus.classworlds.launcher.Launcher.mainWithExitCode(Launcher.java:415)
07-Jun-2019 16:07:28         at org.codehaus.plexus.classworlds.launcher.Launcher.main(Launcher.java:356)
07-Jun-2019 16:07:28 Caused by: java.lang.RuntimeException: Failed to load p2 repository with ID '2019-06' from location https://download.eclipse.org/releases/2019-06
07-Jun-2019 16:07:28         at org.eclipse.tycho.p2.target.TargetPlatformFactoryImpl.loadMetadataRepository(TargetPlatformFactoryImpl.java:302)
07-Jun-2019 16:07:28         at org.eclipse.tycho.p2.target.TargetPlatformFactoryImpl.gatherExternalInstallableUnits(TargetPlatformFactoryImpl.java:270)
07-Jun-2019 16:07:28         at org.eclipse.tycho.p2.target.TargetPlatformFactoryImpl.createTargetPlatform(TargetPlatformFactoryImpl.java:176)
07-Jun-2019 16:07:28         at org.eclipse.tycho.p2.target.TargetPlatformFactoryImpl.createTargetPlatform(TargetPlatformFactoryImpl.java:128)
07-Jun-2019 16:07:28         at org.eclipse.tycho.p2.target.TargetPlatformFactoryImpl.createTargetPlatform(TargetPlatformFactoryImpl.java:1)
07-Jun-2019 16:07:28         at org.eclipse.tycho.p2.manager.ReactorRepositoryManagerImpl.computePreliminaryTargetPlatform(ReactorRepositoryManagerImpl.java:84)
07-Jun-2019 16:07:28         at org.eclipse.tycho.p2.resolver.P2DependencyResolver.computePreliminaryTargetPlatform(P2DependencyResolver.java:224)
07-Jun-2019 16:07:28         at org.eclipse.tycho.core.resolver.DefaultTychoResolver.resolveProject(DefaultTychoResolver.java:109)
07-Jun-2019 16:07:28         at org.eclipse.tycho.core.maven.TychoMavenLifecycleParticipant.afterProjectsRead(TychoMavenLifecycleParticipant.java:95)
07-Jun-2019 16:07:28         at org.apache.maven.DefaultMaven.doExecute(DefaultMaven.java:266)
07-Jun-2019 16:07:28         at org.apache.maven.DefaultMaven.doExecute(DefaultMaven.java:193)
07-Jun-2019 16:07:28         at org.apache.maven.DefaultMaven.execute(DefaultMaven.java:106)
07-Jun-2019 16:07:28         ... 11 more
07-Jun-2019 16:07:28 Caused by: org.eclipse.equinox.p2.core.ProvisionException: Unable to read repository at https://download.eclipse.org/releases/2019-06.
07-Jun-2019 16:07:28         at org.eclipse.equinox.internal.p2.metadata.repository.CompositeMetadataRepository.addChild(CompositeMetadataRepository.java:184)
07-Jun-2019 16:07:28         at org.eclipse.equinox.internal.p2.metadata.repository.CompositeMetadataRepository.<init>(CompositeMetadataRepository.java:107)
07-Jun-2019 16:07:28         at org.eclipse.equinox.internal.p2.metadata.repository.CompositeMetadataRepositoryFactory.load(CompositeMetadataRepositoryFactory.java:121)
07-Jun-2019 16:07:28         at org.eclipse.equinox.internal.p2.metadata.repository.MetadataRepositoryManager.factoryLoad(MetadataRepositoryManager.java:60)
07-Jun-2019 16:07:28         at org.eclipse.equinox.internal.p2.repository.helpers.AbstractRepositoryManager.loadRepository(AbstractRepositoryManager.java:767)
07-Jun-2019 16:07:28         at org.eclipse.equinox.internal.p2.repository.helpers.AbstractRepositoryManager.loadRepository(AbstractRepositoryManager.java:668)
07-Jun-2019 16:07:28         at org.eclipse.equinox.internal.p2.metadata.repository.MetadataRepositoryManager.loadRepository(MetadataRepositoryManager.java:107)
07-Jun-2019 16:07:28         at org.eclipse.tycho.p2.remote.RemoteMetadataRepositoryManager.loadRepository(RemoteMetadataRepositoryManager.java:61)
07-Jun-2019 16:07:28         at org.eclipse.tycho.p2.remote.RemoteMetadataRepositoryManager.loadRepository(RemoteMetadataRepositoryManager.java:53)
07-Jun-2019 16:07:28         at org.eclipse.tycho.p2.target.TargetPlatformFactoryImpl.loadMetadataRepository(TargetPlatformFactoryImpl.java:298)
07-Jun-2019 16:07:28         ... 22 more
07-Jun-2019 16:07:28 Caused by: org.eclipse.equinox.p2.core.ProvisionException: Unable to read repository at http://download.eclipse.org/technology/epp/packages/2019-06/content.xml.
07-Jun-2019 16:07:28         at org.eclipse.equinox.internal.p2.repository.CacheManager.createCache(CacheManager.java:243)
07-Jun-2019 16:07:28         at org.eclipse.tycho.p2.remote.RemoteRepositoryCacheManager.createCache(RemoteRepositoryCacheManager.java:67)
07-Jun-2019 16:07:28         at org.eclipse.equinox.internal.p2.metadata.repository.SimpleMetadataRepositoryFactory.getLocalFile(SimpleMetadataRepositoryFactory.java:66)
07-Jun-2019 16:07:28         at org.eclipse.equinox.internal.p2.metadata.repository.SimpleMetadataRepositoryFactory.load(SimpleMetadataRepositoryFactory.java:86)
07-Jun-2019 16:07:28         at org.eclipse.equinox.internal.p2.metadata.repository.MetadataRepositoryManager.factoryLoad(MetadataRepositoryManager.java:60)
07-Jun-2019 16:07:28         at org.eclipse.equinox.internal.p2.repository.helpers.AbstractRepositoryManager.loadRepository(AbstractRepositoryManager.java:767)
07-Jun-2019 16:07:28         at org.eclipse.equinox.internal.p2.repository.helpers.AbstractRepositoryManager.loadRepository(AbstractRepositoryManager.java:668)
07-Jun-2019 16:07:28         at org.eclipse.equinox.internal.p2.metadata.repository.MetadataRepositoryManager.loadRepository(MetadataRepositoryManager.java:107)
07-Jun-2019 16:07:28         at org.eclipse.tycho.p2.remote.RemoteMetadataRepositoryManager.loadRepository(RemoteMetadataRepositoryManager.java:61)
07-Jun-2019 16:07:28         at org.eclipse.tycho.p2.remote.RemoteMetadataRepositoryManager.loadRepository(RemoteMetadataRepositoryManager.java:53)
07-Jun-2019 16:07:28         at org.eclipse.equinox.internal.p2.metadata.repository.CompositeMetadataRepository.addChild(CompositeMetadataRepository.java:165)
07-Jun-2019 16:07:28         ... 31 more
07-Jun-2019 16:07:28 Caused by: java.net.SocketException: Connection reset
07-Jun-2019 16:07:28         at java.net.SocketInputStream.read(SocketInputStream.java:210)
07-Jun-2019 16:07:28         at java.net.SocketInputStream.read(SocketInputStream.java:141)
07-Jun-2019 16:07:28         at org.apache.http.impl.io.AbstractSessionInputBuffer.fillBuffer(AbstractSessionInputBuffer.java:158)
07-Jun-2019 16:07:28         at org.apache.http.impl.io.SocketInputBuffer.fillBuffer(SocketInputBuffer.java:82)
07-Jun-2019 16:07:28         at org.apache.http.impl.io.AbstractSessionInputBuffer.readLine(AbstractSessionInputBuffer.java:271)
07-Jun-2019 16:07:28         at org.apache.http.impl.conn.DefaultHttpResponseParser.parseHead(DefaultHttpResponseParser.java:140)
07-Jun-2019 16:07:28         at org.apache.http.impl.conn.DefaultHttpResponseParser.parseHead(DefaultHttpResponseParser.java:57)
07-Jun-2019 16:07:28         at org.apache.http.impl.io.AbstractMessageParser.parse(AbstractMessageParser.java:259)
07-Jun-2019 16:07:28         at org.apache.http.impl.AbstractHttpClientConnection.receiveResponseHeader(AbstractHttpClientConnection.java:281)
07-Jun-2019 16:07:28         at org.apache.http.impl.conn.DefaultClientConnection.receiveResponseHeader(DefaultClientConnection.java:259)
07-Jun-2019 16:07:28         at org.apache.http.impl.conn.ManagedClientConnectionImpl.receiveResponseHeader(ManagedClientConnectionImpl.java:209)
07-Jun-2019 16:07:28         at org.apache.http.protocol.HttpRequestExecutor.doReceiveResponse(HttpRequestExecutor.java:273)
07-Jun-2019 16:07:28         at org.apache.http.protocol.HttpRequestExecutor.execute(HttpRequestExecutor.java:125)
07-Jun-2019 16:07:28         at org.apache.http.impl.client.DefaultRequestDirector.tryExecute(DefaultRequestDirector.java:686)
07-Jun-2019 16:07:28         at org.apache.http.impl.client.DefaultRequestDirector.execute(DefaultRequestDirector.java:488)
07-Jun-2019 16:07:28         at org.apache.http.impl.client.AbstractHttpClient.doExecute(AbstractHttpClient.java:884)
07-Jun-2019 16:07:28         at org.apache.http.impl.client.CloseableHttpClient.execute(CloseableHttpClient.java:82)
07-Jun-2019 16:07:28         at org.eclipse.ecf.provider.filetransfer.httpclient4.HttpClientFileSystemBrowser.runRequest(HttpClientFileSystemBrowser.java:263)
07-Jun-2019 16:07:28         at org.eclipse.ecf.provider.filetransfer.browse.AbstractFileSystemBrowser$DirectoryJob.run(AbstractFileSystemBrowser.java:69)
07-Jun-2019 16:07:28         at org.eclipse.core.internal.jobs.Worker.run(Worker.java:60)
07-Jun-2019 16:07:28 [ERROR]
07-Jun-2019 16:07:28 [ERROR]
07-Jun-2019 16:07:28 [ERROR] For more information about the errors and possible solutions, please read the following articles:
07-Jun-2019 16:07:28 [ERROR] [Help 1] http://cwiki.apache.org/confluence/display/MAVEN/InternalErrorException
07-Jun-2019 16:07:29 Failing task since return code of [/opt/maven-3.3/bin/mvn --batch-mode -Djava.io.tmpdir=/tmp/GRECLIPSE-E412-JOB1 --settings /home/bamboo/.m2/settings.xml -e -X -Pe4.12 clean deploy -Psnapshot] was 1 while expected 0
07-Jun-2019 16:07:29 Parsing test results under /opt/bamboo-home/xml-data/build-dir/GRECLIPSE-E412-JOB1...
07-Jun-2019 16:07:29 Finished task 'Maven 3.x' with result: Failed
07-Jun-2019 16:07:29 Running post build plugin 'Docker Container Cleanup'
07-Jun-2019 16:07:29 Running post build plugin 'NCover Results Collector'
07-Jun-2019 16:07:29 Running post build plugin 'Artifactory Release Management Staging'
07-Jun-2019 16:07:29 Running post build plugin 'Artifactory Build Info Copier'
07-Jun-2019 16:07:29 Running post build plugin 'Artifactory Gradle Properties Info Copier'
07-Jun-2019 16:07:29 Running post build plugin 'Clover Results Collector'
07-Jun-2019 16:07:29 Running post build plugin 'npm Cache Cleanup'
07-Jun-2019 16:07:29 Running post build plugin 'Artifact Copier'
07-Jun-2019 16:07:29 Publishing an artifact: surefire-reports
07-Jun-2019 16:07:30 Finished publishing of artifact Non required job artifact: [surefire-reports], pattern: [**/target/TEST-*.xml] in 362.8 ms
07-Jun-2019 16:07:30 Publishing an artifact: Zipped Update Site
07-Jun-2019 16:07:30 Unable to publish artifact [Zipped Update Site]: the source directory /opt/bamboo-home/xml-data/build-dir/GRECLIPSE-E412-JOB1/Site-org.codehaus.groovy.eclipse/target/site does not exist.
07-Jun-2019 16:07:30 The artifact hasn't been successfully published after 401.8 μs
07-Jun-2019 16:07:30 Successfully removed working directory at '/opt/bamboo-home/xml-data/build-dir/GRECLIPSE-E412-JOB1'
07-Jun-2019 16:07:30 Finalising the build...
07-Jun-2019 16:07:30 Stopping timer.
07-Jun-2019 16:07:30 Build GRECLIPSE-E412-JOB1-77 completed.
07-Jun-2019 16:07:30 Running on server: post build plugin 'NCover Results Collector'
07-Jun-2019 16:07:30 Running on server: post build plugin 'Build Hanging Detection Configuration'
07-Jun-2019 16:07:30 Running on server: post build plugin 'Clover Delta Calculator'
07-Jun-2019 16:07:30 Running on server: post build plugin 'Maven Dependencies Postprocessor'
07-Jun-2019 16:07:30 All post build plugins have finished
07-Jun-2019 16:07:30 Generating build results summary...
07-Jun-2019 16:07:30 Saving build results to disk...
07-Jun-2019 16:07:30 Logging substituted variables...
07-Jun-2019 16:07:30 Indexing build results...
07-Jun-2019 16:07:30 Finished building GRECLIPSE-E412-JOB1-77.