Build: #84 failed

Job: Default Job failed

Stages & jobs

  1. Default Stage

Job result summary

Completed
Duration
108 minutes
Agent
bamboo-18.af.pivotal.io
Revision
b330a3ecf62e5e6f33e8ef5c637adc163e30a27a b330a3ecf62e5e6f33e8ef5c637adc163e30a27a
Total tests
5770
Failing since
#54 (Code changes detected – )
Fixed in
#99 (Custom build by Eric Milles with revision v3.4.0)

Tests

  • 5,770 tests in total
  • 3 tests failed
  • 3 failures are new
  • 2 tests were fixed
  • 100 tests were quarantined / skipped
  • 98 minutes taken in total.
New test failures 3
Status Test Duration
Collapse Failed ErrorLogTest testNoWarningsOnStartup History
< 1 sec
java.lang.AssertionError: There should be no unexpected entries in the error log. Found:
=================== Log entry 1 ===================
FrameworkEvent ERROR (org.eclipse.ecf.provider.filetransfer.httpclient45.win32)

java.lang.AssertionError: 
There should be no unexpected entries in the error log. Found:
=================== Log entry 1 ===================
FrameworkEvent ERROR (org.eclipse.ecf.provider.filetransfer.httpclient45.win32)
(2 more lines...)
Collapse Failed BasicGroovyBuildTests testTags3 History
< 1 sec
java.lang.ArrayIndexOutOfBoundsException: 0
	at org.eclipse.jdt.core.groovy.tests.builder.BasicGroovyBuildTests.testTags3(BasicGroovyBuildTests.java:3448)
Collapse Failed BasicGroovyBuildTests testTraitBinary History
< 1 sec
org.junit.ComparisonFailure: unexpected recompiled units. lenExpected=5 lenActual=10 expected:<{Runner,[p.Named,p.Named$Trait$Helper,q.DefaultNamed],r.NamedClass}> but was:<{Runner,[Runner,p.Named,p.Named,p.Named$Trait$Helper,p.Named$Trait$Helper,q.DefaultNamed,q.DefaultNamed,r.NamedClass],r.NamedClass}>
	at org.eclipse.jdt.core.groovy.tests.builder.BasicGroovyBuildTests.testTraitBinary(BasicGroovyBuildTests.java:3187)
Fixed tests 2
Status Test Failing since Duration
Successful BasicGroovyBuildTests testGRE1773 History
Failing since build #56 (Code changes detected) < 1 sec
Successful InferencingTests testStaticMethod9 History
Failing since build #56 (Code changes detected) < 1 sec

Error summary

The build generated some errors. See the full build log for more details.

Jun 14, 2019 8:00:22 PM org.apache.http.impl.client.DefaultRequestDirector tryExecute
INFO: I/O exception (java.net.SocketException) caught when processing request to {}->http://ftp.osuosl.org:80: Connection reset
Jun 14, 2019 8:00:22 PM org.apache.http.impl.client.DefaultRequestDirector tryExecute
INFO: Retrying request to {}->http://ftp.osuosl.org:80
Jun 14, 2019 8:00:22 PM org.apache.http.impl.client.DefaultRequestDirector tryExecute
INFO: I/O exception (java.net.SocketException) caught when processing request to {}->http://ftp.osuosl.org:80: Connection reset
Jun 14, 2019 8:00:22 PM org.apache.http.impl.client.DefaultRequestDirector tryExecute
INFO: Retrying request to {}->http://ftp.osuosl.org:80
Jun 14, 2019 8:00:22 PM org.apache.http.impl.client.DefaultRequestDirector tryExecute
INFO: I/O exception (java.net.SocketException) caught when processing request to {}->http://ftp.osuosl.org:80: Connection reset
Jun 14, 2019 8:00:22 PM org.apache.http.impl.client.DefaultRequestDirector tryExecute
INFO: Retrying request to {}->http://ftp.osuosl.org:80
Jun 14, 2019 8:00:23 PM org.apache.http.impl.client.DefaultRequestDirector tryExecute
INFO: I/O exception (java.net.SocketException) caught when processing request to {}->http://ftp.osuosl.org:80: Connection reset
Jun 14, 2019 8:00:23 PM org.apache.http.impl.client.DefaultRequestDirector tryExecute
INFO: Retrying request to {}->http://ftp.osuosl.org:80
Jun 14, 2019 8:00:23 PM org.apache.http.impl.client.DefaultRequestDirector tryExecute
INFO: I/O exception (java.net.SocketException) caught when processing request to {}->http://ftp.osuosl.org:80: Connection reset
Jun 14, 2019 8:00:23 PM org.apache.http.impl.client.DefaultRequestDirector tryExecute
INFO: Retrying request to {}->http://ftp.osuosl.org:80
Jun 14, 2019 8:00:23 PM org.apache.http.impl.client.DefaultRequestDirector tryExecute
INFO: I/O exception (java.net.SocketException) caught when processing request to {}->http://ftp.osuosl.org:80: Connection reset
Jun 14, 2019 8:00:23 PM org.apache.http.impl.client.DefaultRequestDirector tryExecute
INFO: Retrying request to {}->http://ftp.osuosl.org:80
Jun 14, 2019 8:00:35 PM org.apache.http.impl.client.DefaultRequestDirector tryExecute
INFO: I/O exception (java.net.SocketException) caught when processing request to {}->http://mirrors.syringanetworks.net:80: Connection reset
Jun 14, 2019 8:00:35 PM org.apache.http.impl.client.DefaultRequestDirector tryExecute
INFO: Retrying request to {}->http://mirrors.syringanetworks.net:80
Jun 14, 2019 8:00:35 PM org.apache.http.impl.client.DefaultRequestDirector tryExecute
INFO: I/O exception (java.net.SocketException) caught when processing request to {}->http://mirrors.syringanetworks.net:80: Connection reset
Jun 14, 2019 8:00:35 PM org.apache.http.impl.client.DefaultRequestDirector tryExecute
INFO: Retrying request to {}->http://mirrors.syringanetworks.net:80
Jun 14, 2019 8:00:35 PM org.apache.http.impl.client.DefaultRequestDirector tryExecute
INFO: I/O exception (java.net.SocketException) caught when processing request to {}->http://mirrors.syringanetworks.net:80: Connection reset
Jun 14, 2019 8:00:35 PM org.apache.http.impl.client.DefaultRequestDirector tryExecute
INFO: Retrying request to {}->http://mirrors.syringanetworks.net:80
Jun 14, 2019 8:00:36 PM org.apache.http.impl.client.DefaultRequestDirector tryExecute
INFO: I/O exception (java.net.SocketException) caught when processing request to {}->http://mirrors.syringanetworks.net:80: Connection reset
Jun 14, 2019 8:00:36 PM org.apache.http.impl.client.DefaultRequestDirector tryExecute
INFO: Retrying request to {}->http://mirrors.syringanetworks.net:80
Jun 14, 2019 8:00:36 PM org.apache.http.impl.client.DefaultRequestDirector tryExecute
INFO: I/O exception (java.net.SocketException) caught when processing request to {}->http://mirrors.syringanetworks.net:80: Connection reset
Jun 14, 2019 8:00:36 PM org.apache.http.impl.client.DefaultRequestDirector tryExecute
INFO: Retrying request to {}->http://mirrors.syringanetworks.net:80
Jun 14, 2019 8:00:36 PM org.apache.http.impl.client.DefaultRequestDirector tryExecute
INFO: I/O exception (java.net.SocketException) caught when processing request to {}->http://mirrors.syringanetworks.net:80: Connection reset
Jun 14, 2019 8:00:36 PM org.apache.http.impl.client.DefaultRequestDirector tryExecute
INFO: Retrying request to {}->http://mirrors.syringanetworks.net:80
SWT SessionManagerDBus: Failed to connect to org.gnome.SessionManager: Failed to execute child process “dbus-launch” (No such file or directory)
SWT SessionManagerDBus: Failed to connect to org.xfce.SessionManager: Failed to execute child process “dbus-launch” (No such file or directory)
TypeInferencingVisitorWithRequestor.findMethodNode: no match found for Foo(QMap.Entry;, Qjava.lang.Object;)
TypeInferencingVisitorWithRequestor.findMethodNode: no match found for Foo(QMap.Entry;)
TypeInferencingVisitorWithRequestor.findMethodNode: no match found for Foo(QDictionary;)
TypeInferencingVisitorWithRequestor.findMethodNode: no match found for TestUnit767052.y(QOuter.Inner;)
TypeInferencingVisitorWithRequestor.findMethodNode: no match found for TestUnit767052.y(QOuter.Inner;)
TypeInferencingVisitorWithRequestor.findMethodNode: no match found for TestUnit444635.y(QOuter.Inner;)
TypeInferencingVisitorWithRequestor.findMethodNode: no match found for TestUnit444635.y(QOuter.Inner;)
TypeInferencingVisitorWithRequestor.findMethodNode: no match found for Main.main([Qjava.lang.String;)
TypeInferencingVisitorWithRequestor.findMethodNode: no match found for Main.main([Qjava.lang.String;)
CodeSelectRequestor: Could not proceed due to null declaring type for org.codehaus.groovy.ast.expr.BinaryExpression@ecbea[org.codehaus.groovy.ast.expr.VariableExpression@ecbe3[variable: it]("in" at 1:20:  "in" )org.codehaus.groovy.ast.expr.ListExpression@ee270[]]
CodeSelectRequestor: Could not proceed due to null declaring type for org.codehaus.groovy.ast.expr.RangeExpression@ebcdd
CodeSelectRequestor: Could not proceed due to null declaring type for org.codehaus.groovy.ast.expr.RangeExpression@ebcde
TypeInferencingVisitorWithRequestor.findMethodNode: no match found for Type.x(QList<Qjava.util.Date;>;)
TypeInferencingVisitorWithRequestor.findMethodNode: no match found for Type.x(QList<Qjava.lang.Number;>;)
TypeInferencingVisitorWithRequestor.findMethodNode: no match found for Type.x(QList<Qjava.lang.Number;>;)
TypeInferencingVisitorWithRequestor.findMethodNode: no match found for Type.x(QList<Qjava.util.Date;>;)
TypeInferencingVisitorWithRequestor.findMethodNode: no match found for Type.x(QList<Qjava.lang.Number;>;)
TypeInferencingVisitorWithRequestor.findMethodNode: no match found for Type.x(QList<Qjava.lang.Number;>;)
CodeSelectRequestor: Could not proceed due to null declaring type for org.codehaus.groovy.ast.expr.ConstantExpression@e8fc6[fff]
CodeSelectRequestor: Could not proceed due to null declaring type for org.codehaus.groovy.ast.expr.ConstantExpression@e8fca[fff]
CodeSelectRequestor: Could not proceed due to null declaring type for org.codehaus.groovy.ast.expr.ConstantExpression@e8fca[fff]
Waiting for: Java indexing... 3 files to index (/opt/bamboo-home/xml-data/build-dir/GRECLIPSE-E412-JOB1/ide-test/org.codehaus.groovy.alltests/target/work/plugins/org.eclipse.jdt.groovy.core.tests.builder_3.4.0.v201906141955-e1906/lib/binGroovySearch.jar)
Waiting for: Java indexing... 22 files to index (/Project)
Waiting for: Java indexing... 22 files to index (/Project)
Waiting for: Java indexing... 22 files to index (/Project)
Waiting for: Java indexing... 22 files to index (/Project)
Waiting for: Java indexing... 22 files to index (/Project)
Waiting for: Java indexing... 22 files to index (/Project)
Waiting for: Java indexing... 21 files to index (/Project)
Waiting for: Java indexing... 21 files to index (/Project)
Waiting for: Java indexing... 21 files to index (/Project)
Waiting for: Java indexing... 3 files to index (/Project)