Build: #90 failed

Job: Default Job failed

Stages & jobs

  1. Default Stage

Job result summary

Completed
Duration
107 minutes
Agent
bamboo-18.af.pivotal.io
Revision
e3d49de543b863a05941b4918f69328df7b0c92b e3d49de543b863a05941b4918f69328df7b0c92b
Total tests
5781
Failing since
#54 (Code changes detected – )
Fixed in
#99 (Custom build by Eric Milles with revision v3.4.0)

Tests

  • 5,781 tests in total
  • 5 tests failed
  • 4 failures are new
  • 100 tests were quarantined / skipped
  • 98 minutes taken in total.
New test failures 4
Status Test Duration
Collapse Failed BasicGroovyBuildTests test1167 History
< 1 sec
org.junit.ComparisonFailure: unexpected recompiled units. lenExpected=3 lenActual=6 expected:<...oklyn.event.adapter.[HttpSensorAdapt]er,brooklyn.event.ad...> but was:<...oklyn.event.adapter.[Foo,brooklyn.event.adapter.HttpSensorAdapter,brooklyn.event.adapter.HttpSensorAdapter,brooklyn.event.adapter.ValueProvid]er,brooklyn.event.ad...>
	at org.eclipse.jdt.core.groovy.tests.builder.BasicGroovyBuildTests.test1167(BasicGroovyBuildTests.java:882)
Collapse Failed BuildAccessRulesTests testAccessForLazyProperty History
< 1 sec
junit.framework.ComparisonFailure: 
----------- Expected ------------
Problem : Access restriction: The type 'BeanInfo' is not API (restriction on required library '##') [ resource : </Project/src/Foo.groovy> range : <49,57> category : <150> severity : <2>]

------------ but was ------------

--------- Difference is ----------
 expected:<[Problem : Access restriction: The type 'BeanInfo' is not API (restriction on required library '##') [ resource : </Project/src/Foo.groovy> range : <49,57> category : <150> severity : <2>]
(13 more lines...)
Collapse Failed ClosureInferencingTests testNestedClosure13 History
< 1 sec
java.lang.AssertionError: Expected type not found.
Expected: java.util.regex.Pattern
Found: Search
Declaring type: groovy.lang.Closure<V extends java.lang.Object>
ASTNode: org.codehaus.groovy.ast.expr.ConstantExpression@1030e7[delegate]
Confidence: INFERRED

java.lang.AssertionError: 
(9 more lines...)
Collapse Failed DGMInferencingTests testDGMDeclaring3 History
< 1 sec
java.lang.AssertionError: Expected declaring type not found.
 Expected: org.codehaus.groovy.runtime.IOGroovyMethods
 Found type: java.lang.String
 Found declaring type: java.io.Writer
 ASTNode: org.codehaus.groovy.ast.expr.ConstantExpression@ebce2[leftShift]
java.lang.AssertionError: 
Expected declaring type not found.
	Expected: org.codehaus.groovy.runtime.IOGroovyMethods
(5 more lines...)
Existing test failures 1
Status Test Failing since Duration
java.lang.AssertionError: There should be no unexpected entries in the error log. Found:
=================== Log entry 1 ===================
FrameworkEvent ERROR (org.eclipse.ecf.provider.filetransfer.httpclient45.win32)

java.lang.AssertionError: 
There should be no unexpected entries in the error log. Found:
=================== Log entry 1 ===================
FrameworkEvent ERROR (org.eclipse.ecf.provider.filetransfer.httpclient45.win32)
(2 more lines...)

Error summary

The build generated some errors. See the full build log for more details.

SWT SessionManagerDBus: Failed to connect to org.gnome.SessionManager: Failed to execute child process “dbus-launch” (No such file or directory)
SWT SessionManagerDBus: Failed to connect to org.xfce.SessionManager: Failed to execute child process “dbus-launch” (No such file or directory)
TypeInferencingVisitorWithRequestor.findMethodNode: no match found for Foo(QMap.Entry;, Qjava.lang.Object;)
TypeInferencingVisitorWithRequestor.findMethodNode: no match found for Foo(QMap.Entry;)
TypeInferencingVisitorWithRequestor.findMethodNode: no match found for TestUnit399436.y(QOuter.Inner;)
TypeInferencingVisitorWithRequestor.findMethodNode: no match found for TestUnit399436.y(QOuter.Inner;)
TypeInferencingVisitorWithRequestor.findMethodNode: no match found for TestUnit577461.y(QOuter.Inner;)
TypeInferencingVisitorWithRequestor.findMethodNode: no match found for TestUnit577461.y(QOuter.Inner;)
TypeInferencingVisitorWithRequestor.findMethodNode: no match found for Main.main([Qjava.lang.String;)
TypeInferencingVisitorWithRequestor.findMethodNode: no match found for Main.main([Qjava.lang.String;)
CodeSelectRequestor: Could not proceed due to null declaring type for org.codehaus.groovy.ast.expr.BinaryExpression@ecbea[org.codehaus.groovy.ast.expr.VariableExpression@ecbe3[variable: it]("in" at 1:20:  "in" )org.codehaus.groovy.ast.expr.ListExpression@ee270[]]
CodeSelectRequestor: Could not proceed due to null declaring type for org.codehaus.groovy.ast.expr.RangeExpression@ebcdd
CodeSelectRequestor: Could not proceed due to null declaring type for org.codehaus.groovy.ast.expr.RangeExpression@ebcde
TypeInferencingVisitorWithRequestor.findMethodNode: no match found for Type.x(QList<Qjava.util.Date;>;)
TypeInferencingVisitorWithRequestor.findMethodNode: no match found for Type.x(QList<Qjava.lang.Number;>;)
TypeInferencingVisitorWithRequestor.findMethodNode: no match found for Type.x(QList<Qjava.util.Date;>;)
TypeInferencingVisitorWithRequestor.findMethodNode: no match found for Type.x(QList<Qjava.lang.Number;>;)
CodeSelectRequestor: Could not proceed due to null declaring type for org.codehaus.groovy.ast.expr.ConstantExpression@e8fc6[fff]
CodeSelectRequestor: Could not proceed due to null declaring type for org.codehaus.groovy.ast.expr.ConstantExpression@e8fca[fff]
CodeSelectRequestor: Could not proceed due to null declaring type for org.codehaus.groovy.ast.expr.ConstantExpression@e8fca[fff]
Waiting for: Java indexing... 3 files to index (/Project)
Waiting for: Java indexing... 22 files to index (/Project)
Waiting for: Java indexing... 22 files to index (/Project)
Waiting for: Java indexing... 4 files to index (/opt/bamboo-home/xml-data/build-dir/GRECLIPSE-E412-JOB1/ide-test/org.codehaus.groovy.alltests/target/work/plugins/org.eclipse.jdt.groovy.core.tests.builder_3.4.0.v201906181722-e1906/lib/binGroovySearch.jar)
Waiting for: Java indexing... 22 files to index (/Project)
Waiting for: Java indexing... 22 files to index (/Project)
Waiting for: Java indexing... 22 files to index (/Project)
Waiting for: Java indexing... 21 files to index (/Project)
Waiting for: Java indexing... 21 files to index (/Project)
Waiting for: Java indexing... 18 files to index (/Project)
Waiting for: Java indexing... 17 files to index (/opt/jdk8u212-b03/jre/lib/rt.jar)