Build: #523 failed Changes by Eric Milles

Build result summary

Details

Completed
Duration
103 minutes
Labels
None
Agent
bamboo-14.af.pivotal.io
Revision
c3c06da7aa256cad96f1438d6c1beaa9391a1bb4 c3c06da7aa256cad96f1438d6c1beaa9391a1bb4
Total tests
6748
Failing since
#521 (Changes by Eric Milles)

Responsible

Code commits

Author Commit Message Commit date
Eric Milles Eric Milles c3c06da7aa256cad96f1438d6c1beaa9391a1bb4 c3c06da7aa256cad96f1438d6c1beaa9391a1bb4 Eclipse 4.17 (M2) JDT Patch for Groovy-Eclipse: JDT commit 5f22973
#1139
Eric Milles Eric Milles 8b11b6637be4b00c54621de67e14a59c949ce810 8b11b6637be4b00c54621de67e14a59c949ce810 GROOVY-9672 (take 2)

Tests

New test failures 3
Status Test View job Duration
Collapse Failed BasicGroovyBuildTests testTags3 History
Default Job < 1 sec
java.lang.ArrayIndexOutOfBoundsException: 0
	at org.eclipse.jdt.core.groovy.tests.builder.BasicGroovyBuildTests.testTags3(BasicGroovyBuildTests.java:3341)
Collapse Failed DGMInferencingTests testDGMClosure5 History
Default Job < 1 sec
java.lang.AssertionError: Expected type not found.
Expected: java.lang.Integer
Found: java.lang.Object
Declaring type: groovy.lang.Closure<V extends java.lang.Object>
ASTNode: org.codehaus.groovy.ast.expr.VariableExpression@62041726[variable: it]
Confidence: INFERRED

java.lang.AssertionError: 
(9 more lines...)
Collapse Failed InferencingTests testNothingIsUnknownWithCategories History
Default Job < 1 sec
java.lang.AssertionError: Should not have found any AST nodes with unknown confidence, but found:
[org.codehaus.groovy.ast.expr.ConstantExpression@4324dbb7[use], org.codehaus.groovy.ast.expr.ConstantExpression@132206fa[println], org.codehaus.groovy.ast.expr.ConstantExpression@5eae6620[println], org.codehaus.groovy.ast.expr.ConstantExpression@62de588c[use]]
java.lang.AssertionError: 
Should not have found any AST nodes with unknown confidence, but found:
[org.codehaus.groovy.ast.expr.ConstantExpression@4324dbb7[use], org.codehaus.groovy.ast.expr.ConstantExpression@132206fa[println], org.codehaus.groovy.ast.expr.ConstantExpression@5eae6620[println], org.codehaus.groovy.ast.expr.ConstantExpression@62de588c[use]]
	at org.eclipse.jdt.core.groovy.tests.search.InferencingTests.assertNoUnknowns(InferencingTests.java:44)
	at org.eclipse.jdt.core.groovy.tests.search.InferencingTests.testNothingIsUnknownWithCategories(InferencingTests.java:2824)
Fixed tests 2
Status Test Failing since View job Duration
Successful BuildAccessRulesTests testAccessForFieldGenerics History
Failing since build #522 (Changes by Eric Milles) Default Job < 1 sec
Successful OperatorOverloadingInferencingTests testGetAt4 History
Failing since build #522 (Changes by Eric Milles) Default Job < 1 sec

Jira issues

IssueDescriptionStatus
Unknown Issue TypeGROOVY-9672Could not obtain issue details from Jira