Build: #112 failed Changes by Eric Milles

Build result summary

Details

Completed
Duration
121 minutes
Labels
None
Agent
bamboo-16.af.pivotal.io
Revision
9217239b97d7c6a469017451e8349a1735fa2fd1 9217239b97d7c6a469017451e8349a1735fa2fd1
Total tests
6142
Failing since
#101 (Changes by Eric Milles)
Fixed in
#118 (Changes by Eric Milles)

Responsible

Code commits

Author Commit Message Commit date
Eric Milles Eric Milles 9217239b97d7c6a469017451e8349a1735fa2fd1 9217239b97d7c6a469017451e8349a1735fa2fd1 Fix for #986: find method declaration for more bean-style references

Tests

New test failures 4
Status Test View job Duration
Collapse Failed BinarySearchTests testClassDecl1 History
Default Job 1 sec
java.lang.AssertionError: Expecting 12 matches, but found 0

java.lang.AssertionError: 
Expecting 12 matches, but found 0

	at org.eclipse.jdt.core.groovy.tests.search.BinarySearchTests.assertMatches(BinarySearchTests.java:139)
	at org.eclipse.jdt.core.groovy.tests.search.BinarySearchTests.testClassDecl1(BinarySearchTests.java:165)
Collapse Failed BinarySearchTests testFieldDecl2 History
Default Job 1 sec
java.lang.AssertionError: Expecting 2 matches, but found 0

java.lang.AssertionError: 
Expecting 2 matches, but found 0

	at org.eclipse.jdt.core.groovy.tests.search.BinarySearchTests.assertMatches(BinarySearchTests.java:139)
	at org.eclipse.jdt.core.groovy.tests.search.BinarySearchTests.testFieldDecl2(BinarySearchTests.java:190)
Collapse Failed ConstructorReferenceSearchTests testConstructorReferences4 History
Default Job < 1 sec
java.lang.AssertionError: expected:<2> but was:<0>
	at org.eclipse.jdt.core.groovy.tests.search.ConstructorReferenceSearchTests.testConstructorReferences4(ConstructorReferenceSearchTests.java:144)
Collapse Failed Groovy21InferencingTests testDelegatesToTypeName3 History
Default Job < 1 sec
java.lang.AssertionError: Expected type not found.
Expected: java.lang.Number
Found: java.lang.Object
Declaring type: Search
ASTNode: org.codehaus.groovy.ast.expr.VariableExpression@100f13[variable: number]
Confidence: UNKNOWN

java.lang.AssertionError: 
(8 more lines...)
Existing test failures 17
Status Test Failing since View job Duration
org.junit.ComparisonFailure: invalid renaming expected:<...c def s() {
        [g = A.g
    }
}

class B extends A {
    public def f
    void m() {
(59 more lines...)
org.junit.ComparisonFailure: invalid renaming expected:<...->
        f = this.[g]
    }
}> but was:<...->
        f = this.[f]
    }
}>
org.junit.ComparisonFailure: 
(10 more lines...)
org.junit.ComparisonFailure: invalid renaming expected:<...s() {
        f = A.[g
        f = super.g
    }
}

class A extends C {
    static g = 7
(63 more lines...)
org.junit.ComparisonFailure: invalid renaming expected:<... p
class A { 
    { [g }
    def g
    def other = g
    def doOperation= { g }
    { g] }
}> but was:<... p
(27 more lines...)
org.junit.ComparisonFailure: invalid renaming expected:<... 
    A() { }
    { [g }
    def g
    def other = g
    def doOperation= { g }
    { g] }
}> but was:<... 
(27 more lines...)
org.junit.ComparisonFailure: invalid renaming expected:<...   A(a,b) { }
    { [g }
    def g
    def other = g
    def doOperation= { g }
    { g] }
}> but was:<...   A(a,b) { }
    { [f }
(23 more lines...)
org.junit.ComparisonFailure: invalid renaming expected:<...oid s() {
        c.[g = 3
        def f =  {f -> println(f)}
        c.g()
    }
}

class A {
(51 more lines...)
org.junit.ComparisonFailure: invalid renaming expected:<...s A {
    {
        [g = g
        while (true) {
            def f = this.g
            f++
        }
        g]++
(34 more lines...)
org.junit.ComparisonFailure: invalid renaming expected:<... {
        f = this.[g]
    }
}> but was:<... {
        f = this.[f]
    }
}>
org.junit.ComparisonFailure: 
(11 more lines...)
org.junit.ComparisonFailure: invalid renaming expected:<... void s() {
        [g = g
        this.g = super.g
    }
}

class A extends C {
    def g = 7
(59 more lines...)
org.junit.ComparisonFailure: invalid renaming expected:<...     this.f = super.[g]
    }
}

class A {
...> but was:<...     this.f = super.[f]
    }
}
(19 more lines...)
org.junit.ComparisonFailure: invalid renaming expected:<...port static o.Other.[BAR

BAR
o.Other.BAR]> but was:<...port static o.Other.[FOO

FOO
o.Other.FOO]>
org.junit.ComparisonFailure: 
(9 more lines...)
org.junit.ComparisonFailure: invalid renaming expected:<...ef s() {
        "${[g}"
        "${this.g]}"
    }
}> but was:<...ef s() {
        "${[f}"
        "${this.f]}"
    }
(15 more lines...)
org.junit.ComparisonFailure: invalid renaming expected:<...2 = new MyBean(foo: [g].foo)
 }
}> but was:<...2 = new MyBean(foo: [f].foo)
 }
}>
org.junit.ComparisonFailure: 
invalid renaming expected:<...2 = new MyBean(foo: [g].foo)
	}
(5 more lines...)
org.junit.ComparisonFailure: invalid renaming expected:<...f val = new C()
val.[g

def val2 = ""
val2.f
val2 = val
val2.g]

(34 more lines...)
org.junit.ComparisonFailure: invalid renaming expected:<...f val = new B()
val.[g

def val2 = ""
val2.f
val2 = val
val2.g]

(42 more lines...)
org.junit.ComparisonFailure: invalid renaming expected:<...tBar(Class bar) {
  [baz = bar
 }
}

@CompileStatic
class A {
 def f = new MyBean()
(41 more lines...)