Build: #120 failed Changes by Eric Milles

Build result summary

Details

Completed
Duration
91 minutes
Labels
None
Agent
bamboo-23.af.pivotal.io
Revision
f40793f60ca401f0751b6f298cca3f16e09d6d96 f40793f60ca401f0751b6f298cca3f16e09d6d96
Total tests
6156
Failing since
#119 (Changes by Eric Milles)
Fixed in
#126 (Changes by Eric Milles)

Responsible

Code commits

Author Commit Message Commit date
Eric Milles Eric Milles f40793f60ca401f0751b6f298cca3f16e09d6d96 f40793f60ca401f0751b6f298cca3f16e09d6d96 GROOVY-8686

Tests

New test failures 3
Status Test View job Duration
Collapse Failed ArrayInferencingTests testForLoop1 History
Default Job < 1 sec
java.lang.AssertionError: Expected type not found.
Expected: java.lang.Integer
Found: java.lang.Integer[]
Declaring type: Search
ASTNode: org.codehaus.groovy.ast.expr.VariableExpression@f8f4a[variable: x]
Confidence: INFERRED

java.lang.AssertionError: 
(8 more lines...)
Collapse Failed ClosureInferencingTests testClosureReturnType3 History
Default Job < 1 sec
java.lang.AssertionError: Expected type not found.
Expected: Foo
Found: java.lang.String
Declaring type: Search
ASTNode: org.codehaus.groovy.ast.expr.VariableExpression@1070c4[variable: foo]
Confidence: INFERRED

java.lang.AssertionError: 
(8 more lines...)
Collapse Failed DGMInferencingTests testDGMClosure18 History
Default Job < 1 sec
java.lang.AssertionError: Expected type not found.
Expected: java.util.Date
Found: java.lang.Object
Declaring type: Search
ASTNode: org.codehaus.groovy.ast.expr.VariableExpression@f1ace[variable: val]
Confidence: INFERRED

java.lang.AssertionError: 
(9 more lines...)
Fixed tests 6
Status Test Failing since View job Duration
Successful GroovyContentTypeTests testJavaThenGroovyProject History
Failing since build #119 (Changes by Eric Milles) Default Job < 1 sec
Successful ArrayInferencingTests testArrayProperty9 History
Failing since build #119 (Changes by Eric Milles) Default Job < 1 sec
Successful BinarySearchTests testClassDecl1 History
Failing since build #119 (Changes by Eric Milles) Default Job 1 sec
Successful DGMInferencingTests testDGMClosure10 History
Failing since build #119 (Changes by Eric Milles) Default Job < 1 sec
Successful MethodReferenceSearchTests testMethodWithDefaultParameters3 History
Failing since build #119 (Changes by Eric Milles) Default Job < 1 sec
Successful TypeReferenceSearchTests testFindClassDeclarationWithPattern History
Failing since build #119 (Changes by Eric Milles) Default Job 1 sec

Jira issues

IssueDescriptionStatus
Unknown Issue TypeGROOVY-8686Could not obtain issue details from Jira