Build: #176 failed Changes by Eric Milles

Build result summary

Details

Completed
Duration
96 minutes
Labels
None
Agent
bamboo-16.af.pivotal.io
Revision
bcc52ba8edd56e7741b9d59a9d65fbca250ef671 bcc52ba8edd56e7741b9d59a9d65fbca250ef671
Total tests
6279
Failing since
#169 (Changes by Eric Milles)
Fixed in
#186 (Changes by Eric Milles)

Responsible

Code commits

Author Commit Message Commit date
Eric Milles Eric Milles bcc52ba8edd56e7741b9d59a9d65fbca250ef671 bcc52ba8edd56e7741b9d59a9d65fbca250ef671 Eclipse 4.15 (M1) JDT Patch for Groovy-Eclipse: JDT commit 0001a8c
#1007

Tests

New test failures 3
Status Test View job Duration
Collapse Failed BuildAccessRulesTests testAccessForLazyProperty History
Default Job < 1 sec
junit.framework.ComparisonFailure: 
----------- Expected ------------
Problem : Access restriction: The type 'BeanInfo' is not API (restriction on required library '##') [ resource : </Project/src/Foo.groovy> range : <49,57> category : <150> severity : <2>]

------------ but was ------------

--------- Difference is ----------
 expected:<[Problem : Access restriction: The type 'BeanInfo' is not API (restriction on required library '##') [ resource : </Project/src/Foo.groovy> range : <49,57> category : <150> severity : <2>]
(13 more lines...)
Collapse Failed ConstructorReferenceSearchTests testConstructorReferences2 History
Default Job < 1 sec
java.lang.AssertionError: Incorrect number of matches; expected:<1> but was:<0>
	at org.eclipse.jdt.core.groovy.tests.search.ConstructorReferenceSearchTests.testConstructorReferences2(ConstructorReferenceSearchTests.java:96)
Collapse Failed InferencingTests testLocalTypeAndDefaultImportCollision History
Default Job < 1 sec
java.lang.AssertionError: Expected type not found.
Expected: domain.Calendar
Found: java.lang.String
Declaring type: Search
ASTNode: org.codehaus.groovy.ast.expr.VariableExpression@e9ecc[variable: cal]
Confidence: INFERRED

java.lang.AssertionError: 
(8 more lines...)
Fixed tests 37
Status Test Failing since View job Duration
Successful SyntheticAccessorRenamingTests testSetterOnly2a History
Failing since build #175 (Changes by Eric Milles) Default Job 1 sec
Successful SyntheticAccessorRenamingTests testSingleFileRename3 History
Failing since build #175 (Changes by Eric Milles) Default Job 1 sec
Successful SyntheticAccessorRenamingTests testSingleFileRename2 History
Failing since build #175 (Changes by Eric Milles) Default Job 1 sec
Successful SyntheticAccessorRenamingTests testSingleFileRename4 History
Failing since build #175 (Changes by Eric Milles) Default Job 1 sec
Successful SyntheticAccessorRenamingTests testSubclassAccess2 History
Failing since build #175 (Changes by Eric Milles) Default Job 1 sec
Successful SyntheticAccessorRenamingTests testSubclassAccess1 History
Failing since build #175 (Changes by Eric Milles) Default Job 4 secs
Successful SyntheticAccessorRenamingTests testSetterOnly2 History
Failing since build #175 (Changes by Eric Milles) Default Job 1 sec
Successful SyntheticAccessorRenamingTests testSetterOnly1 History
Failing since build #175 (Changes by Eric Milles) Default Job 1 sec
Successful SyntheticAccessorRenamingTests testIsserOnly History
Failing since build #175 (Changes by Eric Milles) Default Job 1 sec
Successful SyntheticAccessorRenamingTests testJavaRename2 History
Failing since build #175 (Changes by Eric Milles) Default Job 1 sec
Successful SyntheticAccessorRenamingTests testJavaRename1 History
Failing since build #175 (Changes by Eric Milles) Default Job 1 sec
Successful SyntheticAccessorRenamingTests testStaticSetterOnly4a History
Failing since build #175 (Changes by Eric Milles) Default Job 1 sec
Successful SyntheticAccessorRenamingTests testMultiFileRename1 History
Failing since build #175 (Changes by Eric Milles) Default Job 1 sec
Successful SyntheticAccessorRenamingTests testMultiFileRename2 History
Failing since build #175 (Changes by Eric Milles) Default Job 1 sec
Successful SyntheticAccessorRenamingTests testMultiFileRename5 History
Failing since build #175 (Changes by Eric Milles) Default Job 1 sec
Successful SyntheticAccessorRenamingTests testMultiFileRename6 History
Failing since build #175 (Changes by Eric Milles) Default Job 1 sec
Successful SyntheticAccessorRenamingTests testMultiFileRename7 History
Failing since build #175 (Changes by Eric Milles) Default Job 1 sec
Successful SyntheticAccessorRenamingTests testStaticIsserOnly2 History
Failing since build #175 (Changes by Eric Milles) Default Job 1 sec
Successful SyntheticAccessorRenamingTests testStaticIsserOnly1 History
Failing since build #175 (Changes by Eric Milles) Default Job 1 sec
Successful SyntheticAccessorRenamingTests testAliasedAccess History
Failing since build #175 (Changes by Eric Milles) Default Job 1 sec
Successful SyntheticAccessorRenamingTests testStaticGetterOnly2 History
Failing since build #175 (Changes by Eric Milles) Default Job 1 sec
Successful SyntheticAccessorRenamingTests testStaticGetterOnly1 History
Failing since build #175 (Changes by Eric Milles) Default Job 1 sec
Successful SyntheticAccessorRenamingTests testStaticSetterOnly4 History
Failing since build #175 (Changes by Eric Milles) Default Job < 1 sec
Successful SyntheticAccessorRenamingTests testStaticSetterOnly2 History
Failing since build #175 (Changes by Eric Milles) Default Job 1 sec
Successful SyntheticAccessorRenamingTests testStaticSetterOnly1 History
Failing since build #175 (Changes by Eric Milles) Default Job 1 sec
Successful SyntheticAccessorRenamingTests testConstructorAccess History
Failing since build #175 (Changes by Eric Milles) Default Job 1 sec
Successful SyntheticAccessorRenamingTests testFieldAndGetterAndSetter1 History
Failing since build #175 (Changes by Eric Milles) Default Job 1 sec
Successful SyntheticAccessorRenamingTests testFieldAndGetterAndSetter4 History
Failing since build #175 (Changes by Eric Milles) Default Job 1 sec
Successful SyntheticAccessorRenamingTests testFieldAndGetterAndSetter2 History
Failing since build #175 (Changes by Eric Milles) Default Job 1 sec
Successful SyntheticAccessorRenamingTests testFieldAndGetterAndSetter3 History
Failing since build #175 (Changes by Eric Milles) Default Job 1 sec
Successful SyntheticAccessorRenamingTests testGetterOnly History
Failing since build #175 (Changes by Eric Milles) Default Job 1 sec
Successful SyntheticAccessorRenamingTests testSingleFileRename1 History
Failing since build #175 (Changes by Eric Milles) Default Job 1 sec
Successful BinarySearchTests testMethodDecl History
Failing since build #175 (Changes by Eric Milles) Default Job 1 sec
Successful ConstructorReferenceSearchTests testConstructorReferences4 History
Failing since build #175 (Changes by Eric Milles) Default Job < 1 sec
Successful ConstructorReferenceSearchTests testConstructorReferences7 History
Failing since build #175 (Changes by Eric Milles) Default Job < 1 sec
Successful ConstructorReferenceSearchTests testNewifyConstructorReferences2 History
Failing since build #175 (Changes by Eric Milles) Default Job < 1 sec
Successful DGMInferencingTests testDGM21 History
Failing since build #175 (Changes by Eric Milles) Default Job < 1 sec