Build: #177 failed Changes by Eric Milles

Build result summary

Details

Completed
Duration
94 minutes
Labels
None
Agent
bamboo-19.af.pivotal.io
Revision
70065b0f02124b32b9ec067f23f004089ca9a6ed 70065b0f02124b32b9ec067f23f004089ca9a6ed
Total tests
6281
Failing since
#169 (Changes by Eric Milles)
Fixed in
#186 (Changes by Eric Milles)

Responsible

Code commits

Author Commit Message Commit date
Eric Milles Eric Milles 70065b0f02124b32b9ec067f23f004089ca9a6ed 70065b0f02124b32b9ec067f23f004089ca9a6ed Fix for #1001: integer target type for shift RHS in const initializer
GROOVY-9336

Tests

New test failures 5
Status Test View job Duration
Collapse Failed BinarySearchTests testClassDecl1 History
Default Job 1 sec
java.lang.AssertionError: Expecting 12 matches, but found 0

java.lang.AssertionError: 
Expecting 12 matches, but found 0

	at org.eclipse.jdt.core.groovy.tests.search.BinarySearchTests.assertMatches(BinarySearchTests.java:139)
	at org.eclipse.jdt.core.groovy.tests.search.BinarySearchTests.testClassDecl1(BinarySearchTests.java:165)
Collapse Failed ClosureInferencingTests testNestedClosure11 History
Default Job < 1 sec
java.lang.AssertionError: Expected type not found.
Expected: java.lang.Integer
Found: Search
Declaring type: groovy.lang.Closure<V extends java.lang.Object>
ASTNode: org.codehaus.groovy.ast.expr.ConstantExpression@f9e59[delegate]
Confidence: INFERRED

java.lang.AssertionError: 
(8 more lines...)
Collapse Failed ConstructorReferenceSearchTests testConstructorReferences12 History
Default Job < 1 sec
java.lang.AssertionError: expected:<2> but was:<0>
	at org.eclipse.jdt.core.groovy.tests.search.ConstructorReferenceSearchTests.testConstructorReferences12(ConstructorReferenceSearchTests.java:313)
Collapse Failed ConstructorReferenceSearchTests testConstructorReferences12a History
Default Job < 1 sec
java.lang.AssertionError: expected:<3> but was:<0>
	at org.eclipse.jdt.core.groovy.tests.search.ConstructorReferenceSearchTests.testConstructorReferences12a(ConstructorReferenceSearchTests.java:332)
Collapse Failed DGMInferencingTests testDGM20 History
Default Job < 1 sec
java.lang.AssertionError: Expected type not found.
Expected: java.lang.String
Found: java.lang.Object
Declaring type: Search
ASTNode: org.codehaus.groovy.ast.expr.VariableExpression@f0804[variable: key]
Confidence: INFERRED

java.lang.AssertionError: 
(9 more lines...)
Fixed tests 3
Status Test Failing since View job Duration
Successful BuildAccessRulesTests testAccessForLazyProperty History
Failing since build #176 (Changes by Eric Milles) Default Job < 1 sec
Successful ConstructorReferenceSearchTests testConstructorReferences2 History
Failing since build #176 (Changes by Eric Milles) Default Job < 1 sec
Successful InferencingTests testLocalTypeAndDefaultImportCollision History
Failing since build #176 (Changes by Eric Milles) Default Job < 1 sec

Jira issues

IssueDescriptionStatus
Unknown Issue TypeGROOVY-9336Could not obtain issue details from Jira